beam-commits mailing list archives

Site index · List index
Message view « Date » · « Thread »
Top « Date » · « Thread »
From Apache Jenkins Server <jenk...@builds.apache.org>
Subject Build failed in Jenkins: beam_PostCommit_Java_MavenInstall_Windows #13
Date Mon, 15 May 2017 21:03:31 GMT
See <https://builds.apache.org/job/beam_PostCommit_Java_MavenInstall_Windows/13/display/redirect?page=changes>

Changes:

[altay] Moving the data file for trigger tests to testing/data

------------------------------------------
[...truncated 1.99 MB...]
2017-05-15T20:58:31.876 [INFO] Excluding org.slf4j:jcl-over-slf4j:jar:1.7.7 from the shaded
jar.
2017-05-15T20:58:31.876 [INFO] Excluding io.dropwizard.metrics:metrics-core:jar:3.1.0 from
the shaded jar.
2017-05-15T20:58:31.876 [INFO] Excluding io.dropwizard.metrics:metrics-jvm:jar:3.1.0 from
the shaded jar.
2017-05-15T20:58:31.876 [INFO] Excluding com.clearspring.analytics:stream:jar:2.5.2 from the
shaded jar.
2017-05-15T20:58:31.876 [INFO] Excluding it.unimi.dsi:fastutil:jar:6.5.7 from the shaded jar.
2017-05-15T20:58:31.876 [INFO] Excluding org.apache.thrift:libthrift:jar:0.9.2 from the shaded
jar.
2017-05-15T20:58:31.876 [INFO] Excluding io.netty:netty-all:jar:4.0.39.Final from the shaded
jar.
2017-05-15T20:58:31.876 [INFO] Excluding org.ow2.asm:asm:jar:5.0.3 from the shaded jar.
2017-05-15T20:58:31.876 [INFO] Excluding commons-io:commons-io:jar:2.4 from the shaded jar.
2017-05-15T20:58:31.876 [INFO] Excluding org.apache.beam:beam-sdks-java-core:jar:2.1.0-SNAPSHOT
from the shaded jar.
2017-05-15T20:58:31.876 [INFO] Excluding com.fasterxml.jackson.core:jackson-annotations:jar:2.8.8
from the shaded jar.
2017-05-15T20:58:31.876 [INFO] Excluding com.fasterxml.jackson.core:jackson-databind:jar:2.8.8
from the shaded jar.
2017-05-15T20:58:31.876 [INFO] Excluding net.bytebuddy:byte-buddy:jar:1.6.8 from the shaded
jar.
2017-05-15T20:58:31.876 [INFO] Excluding org.apache.logging.log4j:log4j-api:jar:2.6.2 from
the shaded jar.
2017-05-15T20:58:34.363 [INFO] Replacing original artifact with shaded artifact.
2017-05-15T20:58:34.363 [INFO] Replacing F:\jenkins\jenkins-slave\workspace\beam_PostCommit_Java_MavenInstall_Windows\sdks\java\io\hadoop\jdk1.8-tests\target\beam-sdks-java-io-hadoop-jdk1.8-tests-2.1.0-SNAPSHOT.jar
with F:\jenkins\jenkins-slave\workspace\beam_PostCommit_Java_MavenInstall_Windows\sdks\java\io\hadoop\jdk1.8-tests\target\beam-sdks-java-io-hadoop-jdk1.8-tests-2.1.0-SNAPSHOT-shaded.jar
2017-05-15T20:58:34.363 [INFO] Replacing original test artifact with shaded test artifact.
2017-05-15T20:58:34.363 [INFO] Replacing F:\jenkins\jenkins-slave\workspace\beam_PostCommit_Java_MavenInstall_Windows\sdks\java\io\hadoop\jdk1.8-tests\target\beam-sdks-java-io-hadoop-jdk1.8-tests-2.1.0-SNAPSHOT-tests.jar
with F:\jenkins\jenkins-slave\workspace\beam_PostCommit_Java_MavenInstall_Windows\sdks\java\io\hadoop\jdk1.8-tests\target\beam-sdks-java-io-hadoop-jdk1.8-tests-2.1.0-SNAPSHOT-shaded-tests.jar
2017-05-15T20:58:34.598 [INFO] 
2017-05-15T20:58:34.598 [INFO] --- maven-javadoc-plugin:2.10.4:jar (attach-javadocs) @ beam-sdks-java-io-hadoop-jdk1.8-tests
---
2017-05-15T20:58:36.859 [INFO] 
2017-05-15T20:58:36.859 [INFO] --- maven-source-plugin:3.0.1:jar-no-fork (attach-sources)
@ beam-sdks-java-io-hadoop-jdk1.8-tests ---
2017-05-15T20:58:36.866 [INFO] Building jar: F:\jenkins\jenkins-slave\workspace\beam_PostCommit_Java_MavenInstall_Windows\sdks\java\io\hadoop\jdk1.8-tests\target\beam-sdks-java-io-hadoop-jdk1.8-tests-2.1.0-SNAPSHOT-sources.jar
2017-05-15T20:58:38.888 [INFO] 
2017-05-15T20:58:38.888 [INFO] --- maven-source-plugin:3.0.1:test-jar-no-fork (attach-test-sources)
@ beam-sdks-java-io-hadoop-jdk1.8-tests ---
2017-05-15T20:58:38.895 [INFO] Building jar: F:\jenkins\jenkins-slave\workspace\beam_PostCommit_Java_MavenInstall_Windows\sdks\java\io\hadoop\jdk1.8-tests\target\beam-sdks-java-io-hadoop-jdk1.8-tests-2.1.0-SNAPSHOT-test-sources.jar
2017-05-15T20:58:39.636 [INFO] 
2017-05-15T20:58:39.636 [INFO] --- maven-dependency-plugin:3.0.0:analyze-only (default) @
beam-sdks-java-io-hadoop-jdk1.8-tests ---
2017-05-15T20:58:40.195 [INFO] No dependency problems found
2017-05-15T20:58:40.674 [INFO] 
2017-05-15T20:58:40.674 [INFO] --- apache-rat-plugin:0.12:check (default) @ beam-sdks-java-io-hadoop-jdk1.8-tests
---
2017-05-15T20:58:40.693 [INFO] Enabled default license matchers.
2017-05-15T20:58:40.695 [INFO] Will parse SCM ignores for exclusions...
2017-05-15T20:58:40.695 [INFO] Finished adding exclusions from SCM ignore files.
2017-05-15T20:58:40.695 [INFO] 61 implicit excludes (use -debug for more details).
2017-05-15T20:58:40.695 [INFO] Exclude: **/target/**/*
2017-05-15T20:58:40.695 [INFO] Exclude: **/dependency-reduced-pom.xml
2017-05-15T20:58:40.695 [INFO] Exclude: **/hs_err_pid*.log
2017-05-15T20:58:40.695 [INFO] Exclude: .github/**/*
2017-05-15T20:58:40.695 [INFO] Exclude: **/*.iml
2017-05-15T20:58:40.695 [INFO] Exclude: **/.idea/**/*
2017-05-15T20:58:40.695 [INFO] Exclude: **/*.egg-info/**/*
2017-05-15T20:58:40.695 [INFO] Exclude: **/package-list
2017-05-15T20:58:40.695 [INFO] Exclude: **/user.avsc
2017-05-15T20:58:40.695 [INFO] Exclude: **/test/resources/**/*.txt
2017-05-15T20:58:40.695 [INFO] Exclude: **/test/**/.placeholder
2017-05-15T20:58:40.695 [INFO] Exclude: .repository/**/*
2017-05-15T20:58:40.695 [INFO] Exclude: **/nose-*.egg/**/*
2017-05-15T20:58:40.695 [INFO] Exclude: **/.eggs/**/*
2017-05-15T20:58:40.695 [INFO] Exclude: **/.tox/**/*
2017-05-15T20:58:40.695 [INFO] Exclude: **/.checkstyle
2017-05-15T20:58:40.695 [INFO] Exclude: **/.classpath
2017-05-15T20:58:40.695 [INFO] Exclude: **/.factorypath
2017-05-15T20:58:40.695 [INFO] Exclude: **/.project
2017-05-15T20:58:40.695 [INFO] Exclude: **/.settings/**/*
2017-05-15T20:58:40.695 [INFO] Exclude: **/sdks/python/apache_beam/runners/api/*.py
2017-05-15T20:58:40.713 [INFO] 8 resources included (use -debug for more details)
2017-05-15T20:58:40.738 [INFO] Rat check: Summary over all files. Unapproved: 1, unknown:
1, generated: 0, approved: 7 licenses.
2017-05-15T20:58:40.738 [INFO] Enabled default license matchers.
2017-05-15T20:58:40.738 [INFO] Will parse SCM ignores for exclusions...
2017-05-15T20:58:40.738 [INFO] Finished adding exclusions from SCM ignore files.
2017-05-15T20:58:40.738 [INFO] 61 implicit excludes (use -debug for more details).
2017-05-15T20:58:40.738 [INFO] Exclude: **/target/**/*
2017-05-15T20:58:40.738 [INFO] Exclude: **/dependency-reduced-pom.xml
2017-05-15T20:58:40.738 [INFO] Exclude: **/hs_err_pid*.log
2017-05-15T20:58:40.738 [INFO] Exclude: .github/**/*
2017-05-15T20:58:40.738 [INFO] Exclude: **/*.iml
2017-05-15T20:58:40.738 [INFO] Exclude: **/.idea/**/*
2017-05-15T20:58:40.738 [INFO] Exclude: **/*.egg-info/**/*
2017-05-15T20:58:40.738 [INFO] Exclude: **/package-list
2017-05-15T20:58:40.738 [INFO] Exclude: **/user.avsc
2017-05-15T20:58:40.738 [INFO] Exclude: **/test/resources/**/*.txt
2017-05-15T20:58:40.738 [INFO] Exclude: **/test/**/.placeholder
2017-05-15T20:58:40.738 [INFO] Exclude: .repository/**/*
2017-05-15T20:58:40.738 [INFO] Exclude: **/nose-*.egg/**/*
2017-05-15T20:58:40.738 [INFO] Exclude: **/.eggs/**/*
2017-05-15T20:58:40.738 [INFO] Exclude: **/.tox/**/*
2017-05-15T20:58:40.738 [INFO] Exclude: **/.checkstyle
2017-05-15T20:58:40.738 [INFO] Exclude: **/.classpath
2017-05-15T20:58:40.738 [INFO] Exclude: **/.factorypath
2017-05-15T20:58:40.738 [INFO] Exclude: **/.project
2017-05-15T20:58:40.738 [INFO] Exclude: **/.settings/**/*
2017-05-15T20:58:40.738 [INFO] Exclude: **/sdks/python/apache_beam/runners/api/*.py
2017-05-15T20:58:40.756 [INFO] 8 resources included (use -debug for more details)
2017-05-15T20:58:40.768 [WARNING] Files with unapproved licenses:
  F:/jenkins/jenkins-slave/workspace/beam_PostCommit_Java_MavenInstall_Windows/sdks/java/io/hadoop/jdk1.8-tests/.toDelete
[JENKINS] Archiving disabled
2017-05-15T20:58:56.417 [INFO]                                                           
             
2017-05-15T20:58:56.417 [INFO] ------------------------------------------------------------------------
2017-05-15T20:58:56.417 [INFO] Skipping Apache Beam :: Parent
2017-05-15T20:58:56.417 [INFO] This project has been banned from the build due to previous
failures.
2017-05-15T20:58:56.417 [INFO] ------------------------------------------------------------------------
[JENKINS] Archiving disabled
[JENKINS] Archiving disabled
[JENKINS] Archiving disabled
[JENKINS] Archiving disabled
[JENKINS] Archiving disabled
[JENKINS] Archiving disabled
[JENKINS] Archiving disabled
[JENKINS] Archiving disabled
[JENKINS] Archiving disabled
[JENKINS] Archiving disabled
[JENKINS] Archiving disabled
[JENKINS] Archiving disabled
[JENKINS] Archiving disabled
[JENKINS] Archiving disabled
[JENKINS] Archiving disabled
[JENKINS] Archiving disabled
[JENKINS] Archiving disabled
[JENKINS] Archiving disabled
[JENKINS] Archiving disabled
[JENKINS] Archiving disabled
[JENKINS] Archiving disabled
[JENKINS] Archiving disabled
[JENKINS] Archiving disabled
[JENKINS] Archiving disabled
[JENKINS] Archiving disabled
[JENKINS] Archiving disabled
[JENKINS] Archiving disabled
[JENKINS] Archiving disabled
[JENKINS] Archiving disabled
[JENKINS] Archiving disabled
[JENKINS] Archiving disabled
[JENKINS] Archiving disabled
[JENKINS] Archiving disabled
[JENKINS] Archiving disabled
[JENKINS] Archiving disabled
[JENKINS] Archiving disabled
[JENKINS] Archiving disabled
[JENKINS] Archiving disabled
[JENKINS] Archiving disabled
[JENKINS] Archiving disabled
[JENKINS] Archiving disabled
[JENKINS] Archiving disabled
[JENKINS] Archiving disabled
[JENKINS] Archiving disabled
[JENKINS] Archiving disabled
[JENKINS] Archiving disabled
[JENKINS] Archiving disabled
[JENKINS] Archiving disabled
2017-05-15T21:00:04.214 [INFO] ------------------------------------------------------------------------
2017-05-15T21:00:04.214 [INFO] Reactor Summary:
2017-05-15T21:00:04.214 [INFO] 
2017-05-15T21:00:04.214 [INFO] Apache Beam :: Parent .............................. SUCCESS
[ 24.967 s]
2017-05-15T21:00:04.214 [INFO] Apache Beam :: SDKs :: Java :: Build Tools ......... SUCCESS
[ 21.507 s]
2017-05-15T21:00:04.214 [INFO] Apache Beam :: SDKs ................................ SUCCESS
[  9.753 s]
2017-05-15T21:00:04.215 [INFO] Apache Beam :: SDKs :: Common ...................... SUCCESS
[  5.870 s]
2017-05-15T21:00:04.215 [INFO] Apache Beam :: SDKs :: Common :: Fn API ............ SUCCESS
[ 26.398 s]
2017-05-15T21:00:04.215 [INFO] Apache Beam :: SDKs :: Common :: Runner API ........ SUCCESS
[ 19.467 s]
2017-05-15T21:00:04.215 [INFO] Apache Beam :: SDKs :: Java ........................ SUCCESS
[  6.648 s]
2017-05-15T21:00:04.215 [INFO] Apache Beam :: SDKs :: Java :: Core ................ SUCCESS
[04:24 min]
2017-05-15T21:00:04.215 [INFO] Apache Beam :: SDKs :: Java :: IO .................. SUCCESS
[  7.360 s]
2017-05-15T21:00:04.215 [INFO] Apache Beam :: SDKs :: Java :: IO :: Common ........ SUCCESS
[  9.975 s]
2017-05-15T21:00:04.215 [INFO] Apache Beam :: Runners ............................. SUCCESS
[  6.400 s]
2017-05-15T21:00:04.215 [INFO] Apache Beam :: Runners :: Core Construction Java ... SUCCESS
[ 41.705 s]
2017-05-15T21:00:04.215 [INFO] Apache Beam :: Runners :: Core Java ................ SUCCESS
[01:24 min]
2017-05-15T21:00:04.215 [INFO] Apache Beam :: Runners :: Direct Java .............. SUCCESS
[03:37 min]
2017-05-15T21:00:04.215 [INFO] Apache Beam :: SDKs :: Java :: IO :: Elasticsearch . SUCCESS
[01:03 min]
2017-05-15T21:00:04.215 [INFO] Apache Beam :: SDKs :: Java :: Extensions .......... SUCCESS
[  6.561 s]
2017-05-15T21:00:04.215 [INFO] Apache Beam :: SDKs :: Java :: Extensions :: Google Cloud Platform
Core SUCCESS [01:08 min]
2017-05-15T21:00:04.215 [INFO] Apache Beam :: SDKs :: Java :: Extensions :: Protobuf SUCCESS
[ 38.877 s]
2017-05-15T21:00:04.215 [INFO] Apache Beam :: SDKs :: Java :: IO :: Google Cloud Platform
SUCCESS [01:47 min]
2017-05-15T21:00:04.215 [INFO] Apache Beam :: SDKs :: Java :: IO :: Hadoop Common . SUCCESS
[ 36.118 s]
2017-05-15T21:00:04.215 [INFO] Apache Beam :: SDKs :: Java :: IO :: Hadoop File System SUCCESS
[ 46.729 s]
2017-05-15T21:00:04.215 [INFO] Apache Beam :: SDKs :: Java :: IO :: Hadoop ........ SUCCESS
[ 12.357 s]
2017-05-15T21:00:04.215 [INFO] Apache Beam :: SDKs :: Java :: IO :: Hadoop :: input-format
SUCCESS [ 44.408 s]
2017-05-15T21:00:04.216 [INFO] Apache Beam :: SDKs :: Java :: IO :: Hadoop :: jdk1.8-tests
FAILURE [01:54 min]
2017-05-15T21:00:04.216 [INFO] Apache Beam :: SDKs :: Java :: IO :: HBase ......... SKIPPED
2017-05-15T21:00:04.216 [INFO] Apache Beam :: SDKs :: Java :: IO :: JDBC .......... SKIPPED
2017-05-15T21:00:04.216 [INFO] Apache Beam :: SDKs :: Java :: IO :: JMS ........... SKIPPED
2017-05-15T21:00:04.216 [INFO] Apache Beam :: SDKs :: Java :: IO :: Kafka ......... SKIPPED
2017-05-15T21:00:04.216 [INFO] Apache Beam :: SDKs :: Java :: IO :: Kinesis ....... SKIPPED
2017-05-15T21:00:04.216 [INFO] Apache Beam :: SDKs :: Java :: IO :: MongoDB ....... SKIPPED
2017-05-15T21:00:04.216 [INFO] Apache Beam :: SDKs :: Java :: IO :: MQTT .......... SKIPPED
2017-05-15T21:00:04.216 [INFO] Apache Beam :: SDKs :: Java :: IO :: XML ........... SKIPPED
2017-05-15T21:00:04.216 [INFO] Apache Beam :: SDKs :: Java :: Maven Archetypes .... SKIPPED
2017-05-15T21:00:04.216 [INFO] Apache Beam :: SDKs :: Java :: Maven Archetypes :: Starter
SKIPPED
2017-05-15T21:00:04.216 [INFO] Apache Beam :: SDKs :: Java :: Extensions :: Jackson SKIPPED
2017-05-15T21:00:04.216 [INFO] Apache Beam :: SDKs :: Java :: Extensions :: Join library SKIPPED
2017-05-15T21:00:04.216 [INFO] Apache Beam :: SDKs :: Java :: Extensions :: Sorter  SKIPPED
2017-05-15T21:00:04.216 [INFO] Apache Beam :: Runners :: Google Cloud Dataflow .... SKIPPED
2017-05-15T21:00:04.216 [INFO] Apache Beam :: SDKs :: Java :: Harness ............. SKIPPED
2017-05-15T21:00:04.216 [INFO] Apache Beam :: SDKs :: Java :: Java 8 Tests ........ SKIPPED
2017-05-15T21:00:04.216 [INFO] Apache Beam :: SDKs :: Python ...................... SKIPPED
2017-05-15T21:00:04.216 [INFO] Apache Beam :: Runners :: Flink .................... SKIPPED
2017-05-15T21:00:04.216 [INFO] Apache Beam :: Runners :: Spark .................... SKIPPED
2017-05-15T21:00:04.216 [INFO] Apache Beam :: Runners :: Apex ..................... SKIPPED
2017-05-15T21:00:04.216 [INFO] Apache Beam :: Examples ............................ SKIPPED
2017-05-15T21:00:04.216 [INFO] Apache Beam :: Examples :: Java .................... SKIPPED
2017-05-15T21:00:04.216 [INFO] Apache Beam :: Examples :: Java 8 .................. SKIPPED
2017-05-15T21:00:04.216 [INFO] Apache Beam :: SDKs :: Java :: Aggregated Javadoc .. SKIPPED
2017-05-15T21:00:04.216 [INFO] ------------------------------------------------------------------------
2017-05-15T21:00:04.216 [INFO] BUILD FAILURE
2017-05-15T21:00:04.216 [INFO] ------------------------------------------------------------------------
2017-05-15T21:00:04.216 [INFO] Total time: 24:38 min
2017-05-15T21:00:04.217 [INFO] Finished at: 2017-05-15T21:00:04+00:00
2017-05-15T21:00:05.157 [INFO] Final Memory: 219M/2463M
2017-05-15T21:00:05.157 [INFO] ------------------------------------------------------------------------
Waiting for Jenkins to finish collecting data
2017-05-15T21:02:16.593 [ERROR] Failed to execute goal org.apache.rat:apache-rat-plugin:0.12:check
(default) on project beam-sdks-java-io-hadoop-jdk1.8-tests: Too many files with unapproved
license: 1 See RAT report in: F:\jenkins\jenkins-slave\workspace\beam_PostCommit_Java_MavenInstall_Windows\sdks\java\io\hadoop\jdk1.8-tests\target\beam-sdks-java-io-hadoop-jdk1.8-tests-2.1.0-SNAPSHOT.rat
-> [Help 1]
org.apache.maven.lifecycle.LifecycleExecutionException: Failed to execute goal org.apache.rat:apache-rat-plugin:0.12:check
(default) on project beam-sdks-java-io-hadoop-jdk1.8-tests: Too many files with unapproved
license: 1 See RAT report in: F:\jenkins\jenkins-slave\workspace\beam_PostCommit_Java_MavenInstall_Windows\sdks\java\io\hadoop\jdk1.8-tests\target\beam-sdks-java-io-hadoop-jdk1.8-tests-2.1.0-SNAPSHOT.rat
	at org.apache.maven.lifecycle.internal.MojoExecutor.execute(MojoExecutor.java:212)
	at org.apache.maven.lifecycle.internal.MojoExecutor.execute(MojoExecutor.java:153)
	at org.apache.maven.lifecycle.internal.MojoExecutor.execute(MojoExecutor.java:145)
	at org.apache.maven.lifecycle.internal.LifecycleModuleBuilder.buildProject(LifecycleModuleBuilder.java:116)
	at org.apache.maven.lifecycle.internal.LifecycleModuleBuilder.buildProject(LifecycleModuleBuilder.java:80)
	at org.apache.maven.lifecycle.internal.builder.singlethreaded.SingleThreadedBuilder.build(SingleThreadedBuilder.java:51)
	at org.apache.maven.lifecycle.internal.LifecycleStarter.execute(LifecycleStarter.java:128)
	at org.apache.maven.DefaultMaven.doExecute(DefaultMaven.java:307)
	at org.apache.maven.DefaultMaven.doExecute(DefaultMaven.java:193)
	at org.apache.maven.DefaultMaven.execute(DefaultMaven.java:106)
	at org.jvnet.hudson.maven3.launcher.Maven33Launcher.main(Maven33Launcher.java:129)
	at sun.reflect.NativeMethodAccessorImpl.invoke0(Native Method)
	at sun.reflect.NativeMethodAccessorImpl.invoke(NativeMethodAccessorImpl.java:62)
	at sun.reflect.DelegatingMethodAccessorImpl.invoke(DelegatingMethodAccessorImpl.java:43)
	at java.lang.reflect.Method.invoke(Method.java:498)
	at org.codehaus.plexus.classworlds.launcher.Launcher.launchStandard(Launcher.java:330)
	at org.codehaus.plexus.classworlds.launcher.Launcher.launch(Launcher.java:238)
	at jenkins.maven3.agent.Maven33Main.launch(Maven33Main.java:176)
	at sun.reflect.NativeMethodAccessorImpl.invoke0(Native Method)
	at sun.reflect.NativeMethodAccessorImpl.invoke(NativeMethodAccessorImpl.java:62)
	at sun.reflect.DelegatingMethodAccessorImpl.invoke(DelegatingMethodAccessorImpl.java:43)
	at java.lang.reflect.Method.invoke(Method.java:498)
	at hudson.maven.Maven3Builder.call(Maven3Builder.java:139)
	at hudson.maven.Maven3Builder.call(Maven3Builder.java:70)
	at hudson.remoting.UserRequest.perform(UserRequest.java:153)
	at hudson.remoting.UserRequest.perform(UserRequest.java:50)
	at hudson.remoting.Request$2.run(Request.java:336)
	at hudson.remoting.InterceptingExecutorService$1.call(InterceptingExecutorService.java:68)
	at java.util.concurrent.FutureTask.run(FutureTask.java:266)
	at java.util.concurrent.ThreadPoolExecutor.runWorker(ThreadPoolExecutor.java:1142)
	at java.util.concurrent.ThreadPoolExecutor$Worker.run(ThreadPoolExecutor.java:617)
	at java.lang.Thread.run(Thread.java:745)
Caused by: org.apache.rat.mp.RatCheckException: Too many files with unapproved license: 1
See RAT report in: F:\jenkins\jenkins-slave\workspace\beam_PostCommit_Java_MavenInstall_Windows\sdks\java\io\hadoop\jdk1.8-tests\target\beam-sdks-java-io-hadoop-jdk1.8-tests-2.1.0-SNAPSHOT.rat
	at org.apache.rat.mp.RatCheckMojo.check(RatCheckMojo.java:183)
	at org.apache.rat.mp.RatCheckMojo.execute(RatCheckMojo.java:156)
	at org.apache.maven.plugin.DefaultBuildPluginManager.executeMojo(DefaultBuildPluginManager.java:134)
	at org.apache.maven.lifecycle.internal.MojoExecutor.execute(MojoExecutor.java:208)
	... 31 more
2017-05-15T21:02:16.597 [ERROR] 
2017-05-15T21:02:16.597 [ERROR] Re-run Maven using the -X switch to enable full debug logging.
2017-05-15T21:02:16.597 [ERROR] 
2017-05-15T21:02:16.597 [ERROR] For more information about the errors and possible solutions,
please read the following articles:
2017-05-15T21:02:16.597 [ERROR] [Help 1] http://cwiki.apache.org/confluence/display/MAVEN/MojoFailureException
2017-05-15T21:02:16.598 [ERROR] 
2017-05-15T21:02:16.598 [ERROR] After correcting the problems, you can resume the build with
the command
2017-05-15T21:02:16.598 [ERROR]   mvn <goals> -rf :beam-sdks-java-io-hadoop-jdk1.8-tests
channel stopped
Not sending mail to unregistered user github@nakomis.com

Mime
View raw message