beam-commits mailing list archives

Site index · List index
Message view « Date » · « Thread »
Top « Date » · « Thread »
From Apache Jenkins Server <jenk...@builds.apache.org>
Subject Build failed in Jenkins: beam_PostCommit_Java_JDK_Versions_Test » OpenJDK 8 (on Ubuntu only),beam #22
Date Tue, 23 May 2017 01:50:46 GMT
See <https://builds.apache.org/job/beam_PostCommit_Java_JDK_Versions_Test/jdk=OpenJDK%208%20(on%20Ubuntu%20only),label=beam/22/display/redirect?page=changes>

Changes:

[tgroh] Add ReadTranslator

[klk] Add WindowIntoTranslator

------------------------------------------
[...truncated 438.76 KB...]
2017-05-23\T\01:50:40.798 [INFO] Starting audit...
Audit done.
2017-05-23\T\01:50:40.799 [INFO] 
2017-05-23\T\01:50:40.799 [INFO] --- maven-surefire-plugin:2.20:test (default-test) @ beam-sdks-java-io-common
---
2017-05-23\T\01:50:40.802 [INFO] 
2017-05-23\T\01:50:40.802 [INFO] --- build-helper-maven-plugin:3.0.0:regex-properties (render-artifact-id)
@ beam-sdks-java-io-common ---
2017-05-23\T\01:50:40.802 [INFO] 
2017-05-23\T\01:50:40.802 [INFO] --- maven-jar-plugin:3.0.2:jar (default-jar) @ beam-sdks-java-io-common
---
2017-05-23\T\01:50:40.804 [INFO] Building jar: <https://builds.apache.org/job/beam_PostCommit_Java_JDK_Versions_Test/jdk=OpenJDK%208%20(on%20Ubuntu%20only),label=beam/ws/sdks/java/io/common/target/beam-sdks-java-io-common-2.1.0-SNAPSHOT.jar>
2017-05-23\T\01:50:40.809 [INFO] 
2017-05-23\T\01:50:40.809 [INFO] --- maven-site-plugin:3.5.1:attach-descriptor (attach-descriptor)
@ beam-sdks-java-io-common ---
2017-05-23\T\01:50:40.810 [INFO] 
2017-05-23\T\01:50:40.810 [INFO] --- maven-jar-plugin:3.0.2:test-jar (default-test-jar) @
beam-sdks-java-io-common ---
2017-05-23\T\01:50:40.813 [INFO] Building jar: <https://builds.apache.org/job/beam_PostCommit_Java_JDK_Versions_Test/jdk=OpenJDK%208%20(on%20Ubuntu%20only),label=beam/ws/sdks/java/io/common/target/beam-sdks-java-io-common-2.1.0-SNAPSHOT-tests.jar>
2017-05-23\T\01:50:40.819 [INFO] 
2017-05-23\T\01:50:40.819 [INFO] --- maven-shade-plugin:3.0.0:shade (bundle-and-repackage)
@ beam-sdks-java-io-common ---
2017-05-23\T\01:50:40.821 [INFO] Excluding org.apache.beam:beam-sdks-java-core:jar:2.1.0-SNAPSHOT
from the shaded jar.
2017-05-23\T\01:50:40.821 [INFO] Excluding com.google.protobuf:protobuf-java:jar:3.2.0 from
the shaded jar.
2017-05-23\T\01:50:40.821 [INFO] Excluding com.google.code.findbugs:jsr305:jar:3.0.1 from
the shaded jar.
2017-05-23\T\01:50:40.821 [INFO] Excluding com.fasterxml.jackson.core:jackson-core:jar:2.8.8
from the shaded jar.
2017-05-23\T\01:50:40.821 [INFO] Excluding com.fasterxml.jackson.core:jackson-annotations:jar:2.8.8
from the shaded jar.
2017-05-23\T\01:50:40.821 [INFO] Excluding com.fasterxml.jackson.core:jackson-databind:jar:2.8.8
from the shaded jar.
2017-05-23\T\01:50:40.821 [INFO] Excluding org.slf4j:slf4j-api:jar:1.7.14 from the shaded
jar.
2017-05-23\T\01:50:40.821 [INFO] Excluding net.bytebuddy:byte-buddy:jar:1.6.8 from the shaded
jar.
2017-05-23\T\01:50:40.821 [INFO] Excluding org.apache.avro:avro:jar:1.8.1 from the shaded
jar.
2017-05-23\T\01:50:40.821 [INFO] Excluding org.codehaus.jackson:jackson-core-asl:jar:1.9.13
from the shaded jar.
2017-05-23\T\01:50:40.821 [INFO] Excluding org.codehaus.jackson:jackson-mapper-asl:jar:1.9.13
from the shaded jar.
2017-05-23\T\01:50:40.821 [INFO] Excluding com.thoughtworks.paranamer:paranamer:jar:2.7 from
the shaded jar.
2017-05-23\T\01:50:40.821 [INFO] Excluding org.tukaani:xz:jar:1.5 from the shaded jar.
2017-05-23\T\01:50:40.821 [INFO] Excluding org.xerial.snappy:snappy-java:jar:1.1.4-M3 from
the shaded jar.
2017-05-23\T\01:50:40.821 [INFO] Excluding org.apache.commons:commons-compress:jar:1.9 from
the shaded jar.
2017-05-23\T\01:50:40.821 [INFO] Excluding org.apache.commons:commons-lang3:jar:3.5 from the
shaded jar.
2017-05-23\T\01:50:40.821 [INFO] Excluding joda-time:joda-time:jar:2.4 from the shaded jar.
2017-05-23\T\01:50:40.821 [INFO] Including com.google.guava:guava:jar:20.0 in the shaded jar.
2017-05-23\T\01:50:42.696 [INFO] Replacing original artifact with shaded artifact.
2017-05-23\T\01:50:42.696 [INFO] Replacing <https://builds.apache.org/job/beam_PostCommit_Java_JDK_Versions_Test/jdk=OpenJDK%208%20(on%20Ubuntu%20only),label=beam/ws/sdks/java/io/common/target/beam-sdks-java-io-common-2.1.0-SNAPSHOT.jar>
with <https://builds.apache.org/job/beam_PostCommit_Java_JDK_Versions_Test/jdk=OpenJDK%208%20(on%20Ubuntu%20only),label=beam/ws/sdks/java/io/common/target/beam-sdks-java-io-common-2.1.0-SNAPSHOT-shaded.jar>
2017-05-23\T\01:50:42.696 [INFO] Replacing original test artifact with shaded test artifact.
2017-05-23\T\01:50:42.696 [INFO] Replacing <https://builds.apache.org/job/beam_PostCommit_Java_JDK_Versions_Test/jdk=OpenJDK%208%20(on%20Ubuntu%20only),label=beam/ws/sdks/java/io/common/target/beam-sdks-java-io-common-2.1.0-SNAPSHOT-tests.jar>
with <https://builds.apache.org/job/beam_PostCommit_Java_JDK_Versions_Test/jdk=OpenJDK%208%20(on%20Ubuntu%20only),label=beam/ws/sdks/java/io/common/target/beam-sdks-java-io-common-2.1.0-SNAPSHOT-shaded-tests.jar>
2017-05-23\T\01:50:42.697 [INFO] Dependency-reduced POM written at: <https://builds.apache.org/job/beam_PostCommit_Java_JDK_Versions_Test/jdk=OpenJDK%208%20(on%20Ubuntu%20only),label=beam/ws/sdks/java/io/common/dependency-reduced-pom.xml>
2017-05-23\T\01:50:42.737 [INFO] 
2017-05-23\T\01:50:42.737 [INFO] --- maven-dependency-plugin:3.0.0:analyze-only (default)
@ beam-sdks-java-io-common ---
2017-05-23\T\01:50:42.764 [INFO] No dependency problems found
2017-05-23\T\01:50:42.764 [INFO] 
2017-05-23\T\01:50:42.764 [INFO] --- maven-install-plugin:2.5.2:install (default-install)
@ beam-sdks-java-io-common ---
2017-05-23\T\01:50:42.765 [INFO] Installing <https://builds.apache.org/job/beam_PostCommit_Java_JDK_Versions_Test/jdk=OpenJDK%208%20(on%20Ubuntu%20only),label=beam/ws/sdks/java/io/common/target/beam-sdks-java-io-common-2.1.0-SNAPSHOT.jar>
to <https://builds.apache.org/job/beam_PostCommit_Java_JDK_Versions_Test/jdk=OpenJDK%208%20(on%20Ubuntu%20only),label=beam/ws/.repository/org/apache/beam/beam-sdks-java-io-common/2.1.0-SNAPSHOT/beam-sdks-java-io-common-2.1.0-SNAPSHOT.jar>
2017-05-23\T\01:50:42.768 [INFO] Installing <https://builds.apache.org/job/beam_PostCommit_Java_JDK_Versions_Test/jdk=OpenJDK%208%20(on%20Ubuntu%20only),label=beam/ws/sdks/java/io/common/dependency-reduced-pom.xml>
to <https://builds.apache.org/job/beam_PostCommit_Java_JDK_Versions_Test/jdk=OpenJDK%208%20(on%20Ubuntu%20only),label=beam/ws/.repository/org/apache/beam/beam-sdks-java-io-common/2.1.0-SNAPSHOT/beam-sdks-java-io-common-2.1.0-SNAPSHOT.pom>
2017-05-23\T\01:50:42.769 [INFO] Installing <https://builds.apache.org/job/beam_PostCommit_Java_JDK_Versions_Test/jdk=OpenJDK%208%20(on%20Ubuntu%20only),label=beam/ws/sdks/java/io/common/target/beam-sdks-java-io-common-2.1.0-SNAPSHOT-tests.jar>
to <https://builds.apache.org/job/beam_PostCommit_Java_JDK_Versions_Test/jdk=OpenJDK%208%20(on%20Ubuntu%20only),label=beam/ws/.repository/org/apache/beam/beam-sdks-java-io-common/2.1.0-SNAPSHOT/beam-sdks-java-io-common-2.1.0-SNAPSHOT-tests.jar>
2017-05-23\T\01:50:42.770 [INFO] Installing <https://builds.apache.org/job/beam_PostCommit_Java_JDK_Versions_Test/jdk=OpenJDK%208%20(on%20Ubuntu%20only),label=beam/ws/sdks/java/io/common/target/beam-sdks-java-io-common-2.1.0-SNAPSHOT-tests.jar>
to <https://builds.apache.org/job/beam_PostCommit_Java_JDK_Versions_Test/jdk=OpenJDK%208%20(on%20Ubuntu%20only),label=beam/ws/.repository/org/apache/beam/beam-sdks-java-io-common/2.1.0-SNAPSHOT/beam-sdks-java-io-common-2.1.0-SNAPSHOT-tests.jar>
2017-05-23\T\01:50:42.772 [INFO]                                                         
               
2017-05-23\T\01:50:42.772 [INFO] ------------------------------------------------------------------------
2017-05-23\T\01:50:42.772 [INFO] Building Apache Beam :: Runners 2.1.0-SNAPSHOT
2017-05-23\T\01:50:42.772 [INFO] ------------------------------------------------------------------------
2017-05-23\T\01:50:42.774 [INFO] 
2017-05-23\T\01:50:42.774 [INFO] --- maven-clean-plugin:3.0.0:clean (default-clean) @ beam-runners-parent
---
2017-05-23\T\01:50:42.775 [INFO] Deleting <https://builds.apache.org/job/beam_PostCommit_Java_JDK_Versions_Test/jdk=OpenJDK%208%20(on%20Ubuntu%20only),label=beam/ws/runners>
(includes = [**/*.pyc, **/*.egg-info/, **/sdks/python/LICENSE, **/sdks/python/NOTICE, **/sdks/python/README.md],
excludes = [])
2017-05-23\T\01:50:42.790 [INFO] 
2017-05-23\T\01:50:42.790 [INFO] --- maven-enforcer-plugin:1.4.1:enforce (enforce) @ beam-runners-parent
---
2017-05-23\T\01:50:42.791 [INFO] 
2017-05-23\T\01:50:42.791 [INFO] --- maven-enforcer-plugin:1.4.1:enforce (enforce-banned-dependencies)
@ beam-runners-parent ---
2017-05-23\T\01:50:42.793 [INFO] 
2017-05-23\T\01:50:42.793 [INFO] --- maven-remote-resources-plugin:1.5:process (process-resource-bundles)
@ beam-runners-parent ---
2017-05-23\T\01:50:42.799 [INFO] 
2017-05-23\T\01:50:42.799 [INFO] --- maven-compiler-plugin:3.6.1:compile (default-compile)
@ beam-runners-parent ---
2017-05-23\T\01:50:42.800 [INFO] No sources to compile
2017-05-23\T\01:50:42.800 [INFO] 
2017-05-23\T\01:50:42.800 [INFO] --- maven-compiler-plugin:3.6.1:compile (compile-package-info)
@ beam-runners-parent ---
2017-05-23\T\01:50:42.802 [INFO] No sources to compile
2017-05-23\T\01:50:42.802 [INFO] 
2017-05-23\T\01:50:42.802 [INFO] --- maven-checkstyle-plugin:2.17:check (default) @ beam-runners-parent
---
2017-05-23\T\01:50:43.171 [INFO] Starting audit...
Audit done.
2017-05-23\T\01:50:43.171 [INFO] 
2017-05-23\T\01:50:43.171 [INFO] --- build-helper-maven-plugin:3.0.0:regex-properties (render-artifact-id)
@ beam-runners-parent ---
2017-05-23\T\01:50:43.171 [INFO] 
2017-05-23\T\01:50:43.171 [INFO] --- maven-site-plugin:3.5.1:attach-descriptor (attach-descriptor)
@ beam-runners-parent ---
2017-05-23\T\01:50:43.172 [INFO] 
2017-05-23\T\01:50:43.172 [INFO] --- maven-jar-plugin:3.0.2:jar (default-jar) @ beam-runners-parent
---
2017-05-23\T\01:50:43.173 [INFO] Skipping packaging of the jar
2017-05-23\T\01:50:43.173 [INFO] 
2017-05-23\T\01:50:43.173 [INFO] --- maven-jar-plugin:3.0.2:test-jar (default-test-jar) @
beam-runners-parent ---
2017-05-23\T\01:50:43.173 [INFO] Skipping packaging of the test-jar
2017-05-23\T\01:50:43.173 [INFO] 
2017-05-23\T\01:50:43.173 [INFO] --- maven-shade-plugin:3.0.0:shade (bundle-and-repackage)
@ beam-runners-parent ---
2017-05-23\T\01:50:43.176 [INFO] Replacing original artifact with shaded artifact.
2017-05-23\T\01:50:43.176 [INFO] 
2017-05-23\T\01:50:43.176 [INFO] --- maven-dependency-plugin:3.0.0:analyze-only (default)
@ beam-runners-parent ---
2017-05-23\T\01:50:43.176 [INFO] Skipping pom project
2017-05-23\T\01:50:43.176 [INFO] 
2017-05-23\T\01:50:43.176 [INFO] --- maven-install-plugin:2.5.2:install (default-install)
@ beam-runners-parent ---
2017-05-23\T\01:50:43.177 [INFO] Installing <https://builds.apache.org/job/beam_PostCommit_Java_JDK_Versions_Test/jdk=OpenJDK%208%20(on%20Ubuntu%20only),label=beam/ws/runners/pom.xml>
to <https://builds.apache.org/job/beam_PostCommit_Java_JDK_Versions_Test/jdk=OpenJDK%208%20(on%20Ubuntu%20only),label=beam/ws/.repository/org/apache/beam/beam-runners-parent/2.1.0-SNAPSHOT/beam-runners-parent-2.1.0-SNAPSHOT.pom>
2017-05-23\T\01:50:43.178 [INFO]                                                         
               
2017-05-23\T\01:50:43.178 [INFO] ------------------------------------------------------------------------
2017-05-23\T\01:50:43.178 [INFO] Building Apache Beam :: Runners :: Core Construction Java
2.1.0-SNAPSHOT
2017-05-23\T\01:50:43.178 [INFO] ------------------------------------------------------------------------
2017-05-23\T\01:50:43.184 [INFO] 
2017-05-23\T\01:50:43.184 [INFO] --- maven-clean-plugin:3.0.0:clean (default-clean) @ beam-runners-core-construction-java
---
2017-05-23\T\01:50:43.185 [INFO] Deleting <https://builds.apache.org/job/beam_PostCommit_Java_JDK_Versions_Test/jdk=OpenJDK%208%20(on%20Ubuntu%20only),label=beam/ws/runners/core-construction-java>
(includes = [**/*.pyc, **/*.egg-info/, **/sdks/python/LICENSE, **/sdks/python/NOTICE, **/sdks/python/README.md],
excludes = [])
2017-05-23\T\01:50:43.186 [INFO] 
2017-05-23\T\01:50:43.186 [INFO] --- maven-enforcer-plugin:1.4.1:enforce (enforce) @ beam-runners-core-construction-java
---
2017-05-23\T\01:50:43.380 [INFO] 
2017-05-23\T\01:50:43.380 [INFO] --- maven-enforcer-plugin:1.4.1:enforce (enforce-banned-dependencies)
@ beam-runners-core-construction-java ---
2017-05-23\T\01:50:43.384 [INFO] 
2017-05-23\T\01:50:43.384 [INFO] --- maven-remote-resources-plugin:1.5:process (process-resource-bundles)
@ beam-runners-core-construction-java ---
2017-05-23\T\01:50:43.518 [INFO] 
2017-05-23\T\01:50:43.519 [INFO] --- maven-resources-plugin:3.0.2:resources (default-resources)
@ beam-runners-core-construction-java ---
2017-05-23\T\01:50:43.519 [INFO] Using 'UTF-8' encoding to copy filtered resources.
2017-05-23\T\01:50:43.519 [INFO] skip non existing resourceDirectory <https://builds.apache.org/job/beam_PostCommit_Java_JDK_Versions_Test/jdk=OpenJDK%208%20(on%20Ubuntu%20only),label=beam/ws/runners/core-construction-java/src/main/resources>
2017-05-23\T\01:50:43.520 [INFO] Copying 3 resources
2017-05-23\T\01:50:43.520 [INFO] 
2017-05-23\T\01:50:43.520 [INFO] --- maven-compiler-plugin:3.6.1:compile (default-compile)
@ beam-runners-core-construction-java ---
2017-05-23\T\01:50:43.526 [INFO] Changes detected - recompiling the module!
2017-05-23\T\01:50:43.526 [INFO] Compiling 30 source files to <https://builds.apache.org/job/beam_PostCommit_Java_JDK_Versions_Test/jdk=OpenJDK%208%20(on%20Ubuntu%20only),label=beam/ws/runners/core-construction-java/target/classes>
2017-05-23\T\01:50:44.322 [INFO] <https://builds.apache.org/job/beam_PostCommit_Java_JDK_Versions_Test/jdk=OpenJDK%208%20(on%20Ubuntu%20only),label=beam/ws/runners/core-construction-java/src/main/java/org/apache/beam/runners/core/construction/Triggers.java>:
Some input files use or override a deprecated API.
2017-05-23\T\01:50:44.322 [INFO] <https://builds.apache.org/job/beam_PostCommit_Java_JDK_Versions_Test/jdk=OpenJDK%208%20(on%20Ubuntu%20only),label=beam/ws/runners/core-construction-java/src/main/java/org/apache/beam/runners/core/construction/Triggers.java>:
Recompile with -Xlint:deprecation for details.
2017-05-23\T\01:50:44.322 [INFO] <https://builds.apache.org/job/beam_PostCommit_Java_JDK_Versions_Test/jdk=OpenJDK%208%20(on%20Ubuntu%20only),label=beam/ws/runners/core-construction-java/src/main/java/org/apache/beam/runners/core/construction/PTransformReplacements.java>:
Some input files use unchecked or unsafe operations.
2017-05-23\T\01:50:44.322 [INFO] <https://builds.apache.org/job/beam_PostCommit_Java_JDK_Versions_Test/jdk=OpenJDK%208%20(on%20Ubuntu%20only),label=beam/ws/runners/core-construction-java/src/main/java/org/apache/beam/runners/core/construction/PTransformReplacements.java>:
Recompile with -Xlint:unchecked for details.
2017-05-23\T\01:50:44.322 [INFO] 
2017-05-23\T\01:50:44.322 [INFO] --- maven-compiler-plugin:3.6.1:compile (compile-package-info)
@ beam-runners-core-construction-java ---
2017-05-23\T\01:50:44.328 [INFO] Changes detected - recompiling the module!
2017-05-23\T\01:50:44.329 [INFO] Compiling 2 source files to <https://builds.apache.org/job/beam_PostCommit_Java_JDK_Versions_Test/jdk=OpenJDK%208%20(on%20Ubuntu%20only),label=beam/ws/runners/core-construction-java/target/classes>
2017-05-23\T\01:50:44.395 [INFO] 
2017-05-23\T\01:50:44.395 [INFO] --- maven-resources-plugin:3.0.2:testResources (default-testResources)
@ beam-runners-core-construction-java ---
2017-05-23\T\01:50:44.396 [INFO] Using 'UTF-8' encoding to copy filtered resources.
2017-05-23\T\01:50:44.396 [INFO] skip non existing resourceDirectory <https://builds.apache.org/job/beam_PostCommit_Java_JDK_Versions_Test/jdk=OpenJDK%208%20(on%20Ubuntu%20only),label=beam/ws/runners/core-construction-java/src/test/resources>
2017-05-23\T\01:50:44.397 [INFO] Copying 3 resources
2017-05-23\T\01:50:44.397 [INFO] 
2017-05-23\T\01:50:44.397 [INFO] --- maven-compiler-plugin:3.6.1:testCompile (default-testCompile)
@ beam-runners-core-construction-java ---
2017-05-23\T\01:50:44.405 [INFO] Changes detected - recompiling the module!
2017-05-23\T\01:50:44.405 [INFO] Compiling 23 source files to <https://builds.apache.org/job/beam_PostCommit_Java_JDK_Versions_Test/jdk=OpenJDK%208%20(on%20Ubuntu%20only),label=beam/ws/runners/core-construction-java/target/test-classes>
2017-05-23\T\01:50:44.915 [INFO] <https://builds.apache.org/job/beam_PostCommit_Java_JDK_Versions_Test/jdk=OpenJDK%208%20(on%20Ubuntu%20only),label=beam/ws/runners/core-construction-java/src/test/java/org/apache/beam/runners/core/construction/ReadTranslatorTest.java>:
Some input files use or override a deprecated API.
2017-05-23\T\01:50:44.915 [INFO] <https://builds.apache.org/job/beam_PostCommit_Java_JDK_Versions_Test/jdk=OpenJDK%208%20(on%20Ubuntu%20only),label=beam/ws/runners/core-construction-java/src/test/java/org/apache/beam/runners/core/construction/ReadTranslatorTest.java>:
Recompile with -Xlint:deprecation for details.
2017-05-23\T\01:50:44.915 [INFO] <https://builds.apache.org/job/beam_PostCommit_Java_JDK_Versions_Test/jdk=OpenJDK%208%20(on%20Ubuntu%20only),label=beam/ws/runners/core-construction-java/src/test/java/org/apache/beam/runners/core/construction/UnsupportedOverrideFactoryTest.java>:
Some input files use unchecked or unsafe operations.
2017-05-23\T\01:50:44.915 [INFO] <https://builds.apache.org/job/beam_PostCommit_Java_JDK_Versions_Test/jdk=OpenJDK%208%20(on%20Ubuntu%20only),label=beam/ws/runners/core-construction-java/src/test/java/org/apache/beam/runners/core/construction/UnsupportedOverrideFactoryTest.java>:
Recompile with -Xlint:unchecked for details.
2017-05-23\T\01:50:44.915 [INFO] -------------------------------------------------------------
2017-05-23\T\01:50:44.915 [ERROR] COMPILATION ERROR : 
2017-05-23\T\01:50:44.915 [INFO] -------------------------------------------------------------
2017-05-23\T\01:50:44.915 [ERROR] <https://builds.apache.org/job/beam_PostCommit_Java_JDK_Versions_Test/jdk=OpenJDK%208%20(on%20Ubuntu%20only),label=beam/ws/runners/core-construction-java/src/test/java/org/apache/beam/runners/core/construction/WindowIntoTranslatorTest.java>:[87,67]
method toAppliedPTransform in class org.apache.beam.sdk.runners.TransformHierarchy.Node cannot
be applied to given types;
  required: org.apache.beam.sdk.Pipeline
  found: no arguments
  reason: actual and formal argument lists differ in length
2017-05-23\T\01:50:44.915 [INFO] 1 error
2017-05-23\T\01:50:44.915 [INFO] -------------------------------------------------------------
2017-05-23\T\01:50:44.915 [INFO] ------------------------------------------------------------------------
2017-05-23\T\01:50:44.915 [INFO] Reactor Summary:
2017-05-23\T\01:50:44.915 [INFO] 
2017-05-23\T\01:50:44.916 [INFO] Apache Beam :: Parent .............................. SUCCESS
[ 18.513 s]
2017-05-23\T\01:50:44.916 [INFO] Apache Beam :: SDKs :: Java :: Build Tools ......... SUCCESS
[  5.577 s]
2017-05-23\T\01:50:44.916 [INFO] Apache Beam :: SDKs ................................ SUCCESS
[  0.495 s]
2017-05-23\T\01:50:44.916 [INFO] Apache Beam :: SDKs :: Common ...................... SUCCESS
[  0.443 s]
2017-05-23\T\01:50:44.916 [INFO] Apache Beam :: SDKs :: Common :: Fn API ............ SUCCESS
[  9.334 s]
2017-05-23\T\01:50:44.916 [INFO] Apache Beam :: SDKs :: Common :: Runner API ........ SUCCESS
[  2.288 s]
2017-05-23\T\01:50:44.916 [INFO] Apache Beam :: SDKs :: Java ........................ SUCCESS
[  0.425 s]
2017-05-23\T\01:50:44.916 [INFO] Apache Beam :: SDKs :: Java :: Core ................ SUCCESS
[01:39 min]
2017-05-23\T\01:50:44.916 [INFO] Apache Beam :: SDKs :: Java :: IO .................. SUCCESS
[  0.409 s]
2017-05-23\T\01:50:44.916 [INFO] Apache Beam :: SDKs :: Java :: IO :: Common ........ SUCCESS
[  2.670 s]
2017-05-23\T\01:50:44.916 [INFO] Apache Beam :: Runners ............................. SUCCESS
[  0.405 s]
2017-05-23\T\01:50:44.916 [INFO] Apache Beam :: Runners :: Core Construction Java ... FAILURE
[  1.738 s]
2017-05-23\T\01:50:44.916 [INFO] Apache Beam :: Runners :: Core Java ................ SKIPPED
2017-05-23\T\01:50:44.916 [INFO] Apache Beam :: Runners :: Direct Java .............. SKIPPED
2017-05-23\T\01:50:44.916 [INFO] Apache Beam :: SDKs :: Java :: IO :: Elasticsearch . SKIPPED
2017-05-23\T\01:50:44.916 [INFO] Apache Beam :: SDKs :: Java :: Extensions .......... SKIPPED
2017-05-23\T\01:50:44.916 [INFO] Apache Beam :: SDKs :: Java :: Extensions :: Google Cloud
Platform Core SKIPPED
2017-05-23\T\01:50:44.916 [INFO] Apache Beam :: SDKs :: Java :: Extensions :: Protobuf SKIPPED
2017-05-23\T\01:50:44.916 [INFO] Apache Beam :: SDKs :: Java :: IO :: Google Cloud Platform
SKIPPED
2017-05-23\T\01:50:44.916 [INFO] Apache Beam :: SDKs :: Java :: IO :: Hadoop Common . SKIPPED
2017-05-23\T\01:50:44.916 [INFO] Apache Beam :: SDKs :: Java :: IO :: Hadoop File System SKIPPED
2017-05-23\T\01:50:44.916 [INFO] Apache Beam :: SDKs :: Java :: IO :: Hadoop ........ SKIPPED
2017-05-23\T\01:50:44.916 [INFO] Apache Beam :: SDKs :: Java :: IO :: Hadoop :: input-format
SKIPPED
2017-05-23\T\01:50:44.916 [INFO] Apache Beam :: SDKs :: Java :: IO :: HBase ......... SKIPPED
2017-05-23\T\01:50:44.916 [INFO] Apache Beam :: Runners :: Google Cloud Dataflow .... SKIPPED
2017-05-23\T\01:50:44.916 [INFO] Apache Beam :: SDKs :: Java :: IO :: JDBC .......... SKIPPED
2017-05-23\T\01:50:44.916 [INFO] Apache Beam :: SDKs :: Java :: IO :: JMS ........... SKIPPED
2017-05-23\T\01:50:44.916 [INFO] Apache Beam :: SDKs :: Java :: IO :: Kafka ......... SKIPPED
2017-05-23\T\01:50:44.916 [INFO] Apache Beam :: SDKs :: Java :: IO :: Kinesis ....... SKIPPED
2017-05-23\T\01:50:44.916 [INFO] Apache Beam :: SDKs :: Java :: IO :: MongoDB ....... SKIPPED
2017-05-23\T\01:50:44.916 [INFO] Apache Beam :: SDKs :: Java :: IO :: MQTT .......... SKIPPED
2017-05-23\T\01:50:44.916 [INFO] Apache Beam :: SDKs :: Java :: IO :: XML ........... SKIPPED
2017-05-23\T\01:50:44.916 [INFO] Apache Beam :: SDKs :: Java :: Maven Archetypes .... SKIPPED
2017-05-23\T\01:50:44.916 [INFO] Apache Beam :: SDKs :: Java :: Maven Archetypes :: Starter
SKIPPED
2017-05-23\T\01:50:44.916 [INFO] Apache Beam :: Examples ............................ SKIPPED
2017-05-23\T\01:50:44.916 [INFO] Apache Beam :: Examples :: Java .................... SKIPPED
2017-05-23\T\01:50:44.916 [INFO] Apache Beam :: SDKs :: Java :: Maven Archetypes :: Examples
SKIPPED
2017-05-23\T\01:50:44.916 [INFO] Apache Beam :: SDKs :: Java :: Extensions :: Jackson SKIPPED
2017-05-23\T\01:50:44.916 [INFO] Apache Beam :: SDKs :: Java :: Extensions :: Join library
SKIPPED
2017-05-23\T\01:50:44.916 [INFO] Apache Beam :: SDKs :: Java :: Extensions :: Sorter  SKIPPED
2017-05-23\T\01:50:44.916 [INFO] Apache Beam :: Runners :: Flink .................... SKIPPED
2017-05-23\T\01:50:44.916 [INFO] Apache Beam :: Runners :: Spark .................... SKIPPED
2017-05-23\T\01:50:44.916 [INFO] Apache Beam :: SDKs :: Java :: Aggregated Javadoc .. SKIPPED
2017-05-23\T\01:50:44.916 [INFO] ------------------------------------------------------------------------
2017-05-23\T\01:50:44.916 [INFO] BUILD FAILURE
2017-05-23\T\01:50:44.916 [INFO] ------------------------------------------------------------------------
2017-05-23\T\01:50:44.916 [INFO] Total time: 02:25 min
2017-05-23\T\01:50:44.916 [INFO] Finished at: 2017-05-23T01:50:44+00:00
2017-05-23\T\01:50:45.390 [INFO] Final Memory: 104M/1460M
2017-05-23\T\01:50:45.391 [INFO] ------------------------------------------------------------------------
2017-05-23\T\01:50:45.391 [ERROR] Failed to execute goal org.apache.maven.plugins:maven-compiler-plugin:3.6.1:testCompile
(default-testCompile) on project beam-runners-core-construction-java: Compilation failure
2017-05-23\T\01:50:45.391 [ERROR] <https://builds.apache.org/job/beam_PostCommit_Java_JDK_Versions_Test/jdk=OpenJDK%208%20(on%20Ubuntu%20only),label=beam/ws/runners/core-construction-java/src/test/java/org/apache/beam/runners/core/construction/WindowIntoTranslatorTest.java>:[87,67]
method toAppliedPTransform in class org.apache.beam.sdk.runners.TransformHierarchy.Node cannot
be applied to given types;
2017-05-23\T\01:50:45.391 [ERROR] required: org.apache.beam.sdk.Pipeline
2017-05-23\T\01:50:45.391 [ERROR] found: no arguments
2017-05-23\T\01:50:45.391 [ERROR] reason: actual and formal argument lists differ in length
2017-05-23\T\01:50:45.391 [ERROR] -> [Help 1]
org.apache.maven.lifecycle.LifecycleExecutionException: Failed to execute goal org.apache.maven.plugins:maven-compiler-plugin:3.6.1:testCompile
(default-testCompile) on project beam-runners-core-construction-java: Compilation failure
<https://builds.apache.org/job/beam_PostCommit_Java_JDK_Versions_Test/jdk=OpenJDK%208%20(on%20Ubuntu%20only),label=beam/ws/runners/core-construction-java/src/test/java/org/apache/beam/runners/core/construction/WindowIntoTranslatorTest.java>:[87,67]
method toAppliedPTransform in class org.apache.beam.sdk.runners.TransformHierarchy.Node cannot
be applied to given types;
  required: org.apache.beam.sdk.Pipeline
  found: no arguments
  reason: actual and formal argument lists differ in length

	at org.apache.maven.lifecycle.internal.MojoExecutor.execute(MojoExecutor.java:212)
	at org.apache.maven.lifecycle.internal.MojoExecutor.execute(MojoExecutor.java:153)
	at org.apache.maven.lifecycle.internal.MojoExecutor.execute(MojoExecutor.java:145)
	at org.apache.maven.lifecycle.internal.LifecycleModuleBuilder.buildProject(LifecycleModuleBuilder.java:116)
	at org.apache.maven.lifecycle.internal.LifecycleModuleBuilder.buildProject(LifecycleModuleBuilder.java:80)
	at org.apache.maven.lifecycle.internal.builder.singlethreaded.SingleThreadedBuilder.build(SingleThreadedBuilder.java:51)
	at org.apache.maven.lifecycle.internal.LifecycleStarter.execute(LifecycleStarter.java:128)
	at org.apache.maven.DefaultMaven.doExecute(DefaultMaven.java:307)
	at org.apache.maven.DefaultMaven.doExecute(DefaultMaven.java:193)
	at org.apache.maven.DefaultMaven.execute(DefaultMaven.java:106)
	at org.apache.maven.cli.MavenCli.execute(MavenCli.java:862)
	at org.apache.maven.cli.MavenCli.doMain(MavenCli.java:286)
	at org.apache.maven.cli.MavenCli.main(MavenCli.java:197)
	at sun.reflect.NativeMethodAccessorImpl.invoke0(Native Method)
	at sun.reflect.NativeMethodAccessorImpl.invoke(NativeMethodAccessorImpl.java:57)
	at sun.reflect.DelegatingMethodAccessorImpl.invoke(DelegatingMethodAccessorImpl.java:43)
	at java.lang.reflect.Method.invoke(Method.java:606)
	at org.codehaus.plexus.classworlds.launcher.Launcher.launchEnhanced(Launcher.java:289)
	at org.codehaus.plexus.classworlds.launcher.Launcher.launch(Launcher.java:229)
	at org.codehaus.plexus.classworlds.launcher.Launcher.mainWithExitCode(Launcher.java:415)
	at org.codehaus.plexus.classworlds.launcher.Launcher.main(Launcher.java:356)
Caused by: org.apache.maven.plugin.compiler.CompilationFailureException: Compilation failure
<https://builds.apache.org/job/beam_PostCommit_Java_JDK_Versions_Test/jdk=OpenJDK%208%20(on%20Ubuntu%20only),label=beam/ws/runners/core-construction-java/src/test/java/org/apache/beam/runners/core/construction/WindowIntoTranslatorTest.java>:[87,67]
method toAppliedPTransform in class org.apache.beam.sdk.runners.TransformHierarchy.Node cannot
be applied to given types;
  required: org.apache.beam.sdk.Pipeline
  found: no arguments
  reason: actual and formal argument lists differ in length

	at org.apache.maven.plugin.compiler.AbstractCompilerMojo.execute(AbstractCompilerMojo.java:1029)
	at org.apache.maven.plugin.compiler.TestCompilerMojo.execute(TestCompilerMojo.java:170)
	at org.apache.maven.plugin.DefaultBuildPluginManager.executeMojo(DefaultBuildPluginManager.java:134)
	at org.apache.maven.lifecycle.internal.MojoExecutor.execute(MojoExecutor.java:208)
	... 20 more
2017-05-23\T\01:50:45.393 [ERROR] 
2017-05-23\T\01:50:45.393 [ERROR] Re-run Maven using the -X switch to enable full debug logging.
2017-05-23\T\01:50:45.393 [ERROR] 
2017-05-23\T\01:50:45.393 [ERROR] For more information about the errors and possible solutions,
please read the following articles:
2017-05-23\T\01:50:45.393 [ERROR] [Help 1] http://cwiki.apache.org/confluence/display/MAVEN/MojoFailureException
2017-05-23\T\01:50:45.393 [ERROR] 
2017-05-23\T\01:50:45.393 [ERROR] After correcting the problems, you can resume the build
with the command
2017-05-23\T\01:50:45.393 [ERROR]   mvn <goals> -rf :beam-runners-core-construction-java
Build step 'Invoke top-level Maven targets' marked build as failure
Not sending mail to unregistered user klk@google.com

Mime
View raw message