beam-commits mailing list archives

Site index · List index
Message view « Date » · « Thread »
Top « Date » · « Thread »
From Apache Jenkins Server <jenk...@builds.apache.org>
Subject Build failed in Jenkins: beam_PostCommit_Java_MavenInstall #3963
Date Tue, 30 May 2017 21:25:55 GMT
See <https://builds.apache.org/job/beam_PostCommit_Java_MavenInstall/3963/display/redirect?page=changes>

Changes:

[jbonofre] [BEAM-2379] Avoid reading projectId from environment variable in tests.

------------------------------------------
[...truncated 3.07 MB...]
2017-05-30T21:24:31.124 [INFO] Downloading: https://repo.maven.apache.org/maven2/org/apache/flink/flink-core/1.2.1/flink-core-1.2.1-tests.jar
2017-05-30T21:24:31.141 [INFO] Downloaded: https://repo.maven.apache.org/maven2/org/scala-lang/scala-library/2.10.4/scala-library-2.10.4.jar
(6960 KB at 7279.7 KB/sec)
2017-05-30T21:24:31.141 [INFO] Downloading: https://repo.maven.apache.org/maven2/org/apache/flink/flink-runtime_2.10/1.2.1/flink-runtime_2.10-1.2.1-tests.jar
2017-05-30T21:24:31.143 [INFO] Downloaded: https://repo.maven.apache.org/maven2/org/apache/sling/org.apache.sling.commons.json/2.0.6/org.apache.sling.commons.json-2.0.6.jar
(47 KB at 48.8 KB/sec)
2017-05-30T21:24:31.143 [INFO] Downloading: https://repo.maven.apache.org/maven2/org/apache/flink/flink-streaming-java_2.10/1.2.1/flink-streaming-java_2.10-1.2.1-tests.jar
2017-05-30T21:24:31.210 [INFO] Downloaded: https://repo.maven.apache.org/maven2/org/apache/flink/flink-core/1.2.1/flink-core-1.2.1-tests.jar
(716 KB at 698.4 KB/sec)
2017-05-30T21:24:31.210 [INFO] Downloading: https://repo.maven.apache.org/maven2/org/apache/flink/flink-test-utils_2.10/1.2.1/flink-test-utils_2.10-1.2.1.jar
2017-05-30T21:24:31.252 [INFO] Downloaded: https://repo.maven.apache.org/maven2/org/apache/flink/flink-streaming-java_2.10/1.2.1/flink-streaming-java_2.10-1.2.1-tests.jar
(953 KB at 893.0 KB/sec)
2017-05-30T21:24:31.252 [INFO] Downloading: https://repo.maven.apache.org/maven2/org/apache/flink/flink-test-utils-junit/1.2.1/flink-test-utils-junit-1.2.1.jar
2017-05-30T21:24:31.283 [INFO] Downloaded: https://repo.maven.apache.org/maven2/org/apache/flink/flink-test-utils-junit/1.2.1/flink-test-utils-junit-1.2.1.jar
(24 KB at 21.0 KB/sec)
2017-05-30T21:24:31.283 [INFO] Downloading: https://repo.maven.apache.org/maven2/org/apache/curator/curator-test/2.8.0/curator-test-2.8.0.jar
2017-05-30T21:24:31.313 [INFO] Downloaded: https://repo.maven.apache.org/maven2/org/apache/curator/curator-test/2.8.0/curator-test-2.8.0.jar
(39 KB at 34.5 KB/sec)
2017-05-30T21:24:31.374 [INFO] Downloaded: https://repo.maven.apache.org/maven2/org/apache/flink/flink-runtime_2.10/1.2.1/flink-runtime_2.10-1.2.1-tests.jar
(2432 KB at 2045.1 KB/sec)
2017-05-30T21:24:31.384 [INFO] Downloaded: https://repo.maven.apache.org/maven2/org/apache/flink/flink-streaming-java_2.10/1.2.1/flink-streaming-java_2.10-1.2.1.jar
(3035 KB at 2530.6 KB/sec)
2017-05-30T21:24:31.444 [INFO] Downloaded: https://repo.maven.apache.org/maven2/org/apache/flink/flink-test-utils_2.10/1.2.1/flink-test-utils_2.10-1.2.1.jar
(2366 KB at 1879.0 KB/sec)
2017-05-30T21:24:31.646 [INFO] Downloaded: https://repo.maven.apache.org/maven2/org/apache/flink/flink-shaded-hadoop2/1.2.1/flink-shaded-hadoop2-1.2.1.jar
(17860 KB at 12215.7 KB/sec)
2017-05-30T21:24:31.662 [INFO] 
2017-05-30T21:24:31.662 [INFO] --- maven-clean-plugin:3.0.0:clean (default-clean) @ beam-runners-flink_2.10
---
2017-05-30T21:24:31.665 [INFO] Deleting <https://builds.apache.org/job/beam_PostCommit_Java_MavenInstall/ws/runners/flink>
(includes = [**/*.pyc, **/*.egg-info/, **/sdks/python/LICENSE, **/sdks/python/NOTICE, **/sdks/python/README.md],
excludes = [])
2017-05-30T21:24:31.841 [INFO] 
2017-05-30T21:24:31.841 [INFO] --- maven-enforcer-plugin:1.4.1:enforce (enforce) @ beam-runners-flink_2.10
---
2017-05-30T21:24:34.139 [INFO] 
2017-05-30T21:24:34.139 [INFO] --- maven-enforcer-plugin:1.4.1:enforce (enforce-banned-dependencies)
@ beam-runners-flink_2.10 ---
2017-05-30T21:24:35.271 [INFO] 
2017-05-30T21:24:35.271 [INFO] --- maven-remote-resources-plugin:1.5:process (process-resource-bundles)
@ beam-runners-flink_2.10 ---
2017-05-30T21:24:36.147 [INFO] 
2017-05-30T21:24:36.147 [INFO] --- maven-resources-plugin:3.0.2:resources (default-resources)
@ beam-runners-flink_2.10 ---
2017-05-30T21:24:36.148 [INFO] Using 'UTF-8' encoding to copy filtered resources.
2017-05-30T21:24:36.148 [INFO] Copying 1 resource
2017-05-30T21:24:36.149 [INFO] Copying 3 resources
2017-05-30T21:24:36.269 [INFO] 
2017-05-30T21:24:36.269 [INFO] --- maven-compiler-plugin:3.6.1:compile (default-compile) @
beam-runners-flink_2.10 ---
2017-05-30T21:24:36.343 [INFO] Changes detected - recompiling the module!
2017-05-30T21:24:36.343 [INFO] Compiling 75 source files to <https://builds.apache.org/job/beam_PostCommit_Java_MavenInstall/ws/runners/flink/target/classes>
2017-05-30T21:24:37.485 [WARNING] bootstrap class path not set in conjunction with -source
1.7
2017-05-30T21:24:37.486 [INFO] <https://builds.apache.org/job/beam_PostCommit_Java_MavenInstall/ws/runners/flink/src/main/java/org/apache/beam/runners/flink/FlinkStreamingTransformTranslators.java>:
Some input files use or override a deprecated API.
2017-05-30T21:24:37.486 [INFO] <https://builds.apache.org/job/beam_PostCommit_Java_MavenInstall/ws/runners/flink/src/main/java/org/apache/beam/runners/flink/FlinkStreamingTransformTranslators.java>:
Recompile with -Xlint:deprecation for details.
2017-05-30T21:24:37.486 [INFO] <https://builds.apache.org/job/beam_PostCommit_Java_MavenInstall/ws/runners/flink/src/main/java/org/apache/beam/runners/flink/translation/wrappers/streaming/state/FlinkKeyGroupStateInternals.java>:
Some input files use unchecked or unsafe operations.
2017-05-30T21:24:37.486 [INFO] <https://builds.apache.org/job/beam_PostCommit_Java_MavenInstall/ws/runners/flink/src/main/java/org/apache/beam/runners/flink/translation/wrappers/streaming/state/FlinkKeyGroupStateInternals.java>:
Recompile with -Xlint:unchecked for details.
2017-05-30T21:24:37.561 [INFO] 
2017-05-30T21:24:37.561 [INFO] --- maven-resources-plugin:3.0.2:testResources (default-testResources)
@ beam-runners-flink_2.10 ---
2017-05-30T21:24:37.562 [INFO] Using 'UTF-8' encoding to copy filtered resources.
2017-05-30T21:24:37.566 [INFO] Copying 1 resource
2017-05-30T21:24:37.580 [INFO] Copying 3 resources
2017-05-30T21:24:37.632 [INFO] 
2017-05-30T21:24:37.632 [INFO] --- maven-compiler-plugin:3.6.1:testCompile (default-testCompile)
@ beam-runners-flink_2.10 ---
2017-05-30T21:24:37.654 [INFO] Changes detected - recompiling the module!
2017-05-30T21:24:37.654 [INFO] Compiling 17 source files to <https://builds.apache.org/job/beam_PostCommit_Java_MavenInstall/ws/runners/flink/target/test-classes>
2017-05-30T21:24:38.464 [INFO] <https://builds.apache.org/job/beam_PostCommit_Java_MavenInstall/ws/runners/flink/src/test/java/org/apache/beam/runners/flink/streaming/FlinkKeyGroupStateInternalsTest.java>:
Some input files use unchecked or unsafe operations.
2017-05-30T21:24:38.464 [INFO] <https://builds.apache.org/job/beam_PostCommit_Java_MavenInstall/ws/runners/flink/src/test/java/org/apache/beam/runners/flink/streaming/FlinkKeyGroupStateInternalsTest.java>:
Recompile with -Xlint:unchecked for details.
2017-05-30T21:24:38.513 [INFO] 
2017-05-30T21:24:38.513 [INFO] --- maven-checkstyle-plugin:2.17:check (default) @ beam-runners-flink_2.10
---
2017-05-30T21:24:40.526 [INFO] Starting audit...
Audit done.
2017-05-30T21:24:40.618 [INFO] 
2017-05-30T21:24:40.618 [INFO] >>> findbugs-maven-plugin:3.0.4:check (default) >
:findbugs @ beam-runners-flink_2.10 >>>
2017-05-30T21:24:40.656 [INFO] 
2017-05-30T21:24:40.656 [INFO] --- findbugs-maven-plugin:3.0.4:findbugs (findbugs) @ beam-runners-flink_2.10
---
2017-05-30T21:24:40.665 [INFO] Fork Value is true
     [java] Warnings generated: 2
2017-05-30T21:25:05.798 [INFO] Done FindBugs Analysis....
2017-05-30T21:25:05.967 [INFO] 
2017-05-30T21:25:05.967 [INFO] <<< findbugs-maven-plugin:3.0.4:check (default) <
:findbugs @ beam-runners-flink_2.10 <<<
2017-05-30T21:25:05.967 [INFO] 
2017-05-30T21:25:05.967 [INFO] --- findbugs-maven-plugin:3.0.4:check (default) @ beam-runners-flink_2.10
---
2017-05-30T21:25:05.975 [INFO] BugInstance size is 2
2017-05-30T21:25:05.975 [INFO] Error size is 0
2017-05-30T21:25:05.979 [INFO] Total bugs: 2
2017-05-30T21:25:05.985 [INFO] Possible null pointer dereference of FlinkDoFnFunction.outputMap
in org.apache.beam.runners.flink.translation.functions.FlinkDoFnFunction.mapPartition(Iterable,
Collector) [org.apache.beam.runners.flink.translation.functions.FlinkDoFnFunction, org.apache.beam.runners.flink.translation.functions.FlinkDoFnFunction,
org.apache.beam.runners.flink.translation.functions.FlinkDoFnFunction] Dereferenced at FlinkDoFnFunction.java:[line
101]Null value at FlinkDoFnFunction.java:[line 93]Known null at FlinkDoFnFunction.java:[line
94] NP_NULL_ON_SOME_PATH
2017-05-30T21:25:05.985 [INFO] Possible null pointer dereference of FlinkStatefulDoFnFunction.outputMap
in org.apache.beam.runners.flink.translation.functions.FlinkStatefulDoFnFunction.reduce(Iterable,
Collector) [org.apache.beam.runners.flink.translation.functions.FlinkStatefulDoFnFunction,
org.apache.beam.runners.flink.translation.functions.FlinkStatefulDoFnFunction, org.apache.beam.runners.flink.translation.functions.FlinkStatefulDoFnFunction]
Dereferenced at FlinkStatefulDoFnFunction.java:[line 118]Null value at FlinkStatefulDoFnFunction.java:[line
94]Known null at FlinkStatefulDoFnFunction.java:[line 95] NP_NULL_ON_SOME_PATH
2017-05-30T21:25:05.985 [INFO] 


To see bug detail using the Findbugs GUI, use the following command "mvn findbugs:gui"



[JENKINS] Archiving disabled
2017-05-30T21:25:07.569 [INFO]                                                           
             
2017-05-30T21:25:07.569 [INFO] ------------------------------------------------------------------------
2017-05-30T21:25:07.569 [INFO] Skipping Apache Beam :: Parent
2017-05-30T21:25:07.569 [INFO] This project has been banned from the build due to previous
failures.
2017-05-30T21:25:07.569 [INFO] ------------------------------------------------------------------------
[JENKINS] Archiving disabled
[JENKINS] Archiving disabled
[JENKINS] Archiving disabled
[JENKINS] Archiving disabled
[JENKINS] Archiving disabled
[JENKINS] Archiving disabled
[JENKINS] Archiving disabled
[JENKINS] Archiving disabled
[JENKINS] Archiving disabled
[JENKINS] Archiving disabled
[JENKINS] Archiving disabled
[JENKINS] Archiving disabled
[JENKINS] Archiving disabled
[JENKINS] Archiving disabled
[JENKINS] Archiving disabled
[JENKINS] Archiving disabled
[JENKINS] Archiving disabled
[JENKINS] Archiving disabled
[JENKINS] Archiving disabled
[JENKINS] Archiving disabled
[JENKINS] Archiving disabled
[JENKINS] Archiving disabled
[JENKINS] Archiving disabled
[JENKINS] Archiving disabled
[JENKINS] Archiving disabled
[JENKINS] Archiving disabled
[JENKINS] Archiving disabled
[JENKINS] Archiving disabled
[JENKINS] Archiving disabled
[JENKINS] Archiving disabled
[JENKINS] Archiving disabled
[JENKINS] Archiving disabled
[JENKINS] Archiving disabled
[JENKINS] Archiving disabled
[JENKINS] Archiving disabled
[JENKINS] Archiving disabled
[JENKINS] Archiving disabled
[JENKINS] Archiving disabled
[JENKINS] Archiving disabled
[JENKINS] Archiving disabled
[JENKINS] Archiving disabled
[JENKINS] Archiving disabled
[JENKINS] Archiving disabled
[JENKINS] Archiving disabled
[JENKINS] Archiving disabled
[JENKINS] Archiving disabled2017-05-30T21:25:34.627 [INFO] ------------------------------------------------------------------------
2017-05-30T21:25:34.627 [INFO] Reactor Summary:
2017-05-30T21:25:34.627 [INFO] 
2017-05-30T21:25:34.627 [INFO] Apache Beam :: Parent .............................. SUCCESS
[ 27.748 s]
2017-05-30T21:25:34.627 [INFO] Apache Beam :: SDKs :: Java :: Build Tools ......... SUCCESS
[  9.211 s]
2017-05-30T21:25:34.627 [INFO] Apache Beam :: SDKs ................................ SUCCESS
[  5.007 s]
2017-05-30T21:25:34.627 [INFO] Apache Beam :: SDKs :: Common ...................... SUCCESS
[  2.422 s]
2017-05-30T21:25:34.627 [INFO] Apache Beam :: SDKs :: Common :: Fn API ............ SUCCESS
[ 18.971 s]
2017-05-30T21:25:34.627 [INFO] Apache Beam :: SDKs :: Common :: Runner API ........ SUCCESS
[ 13.660 s]
2017-05-30T21:25:34.627 [INFO] Apache Beam :: SDKs :: Java ........................ SUCCESS
[  1.734 s]
2017-05-30T21:25:34.627 [INFO] Apache Beam :: SDKs :: Java :: Core ................ SUCCESS
[03:04 min]
2017-05-30T21:25:34.627 [INFO] Apache Beam :: SDKs :: Java :: IO .................. SUCCESS
[  2.982 s]
2017-05-30T21:25:34.627 [INFO] Apache Beam :: SDKs :: Java :: IO :: Common ........ SUCCESS
[  6.336 s]
2017-05-30T21:25:34.627 [INFO] Apache Beam :: Runners ............................. SUCCESS
[  3.723 s]
2017-05-30T21:25:34.627 [INFO] Apache Beam :: Runners :: Core Construction Java ... SUCCESS
[ 41.251 s]
2017-05-30T21:25:34.627 [INFO] Apache Beam :: Runners :: Core Java ................ SUCCESS
[01:24 min]
2017-05-30T21:25:34.627 [INFO] Apache Beam :: Runners :: Direct Java .............. SUCCESS
[04:41 min]
2017-05-30T21:25:34.627 [INFO] Apache Beam :: SDKs :: Java :: IO :: Elasticsearch . SUCCESS
[ 49.402 s]
2017-05-30T21:25:34.627 [INFO] Apache Beam :: SDKs :: Java :: Extensions .......... SUCCESS
[  2.951 s]
2017-05-30T21:25:34.627 [INFO] Apache Beam :: SDKs :: Java :: Extensions :: Google Cloud Platform
Core SUCCESS [ 48.135 s]
2017-05-30T21:25:34.627 [INFO] Apache Beam :: SDKs :: Java :: Extensions :: Protobuf SUCCESS
[ 19.706 s]
2017-05-30T21:25:34.627 [INFO] Apache Beam :: SDKs :: Java :: IO :: Google Cloud Platform
SUCCESS [01:11 min]
2017-05-30T21:25:34.627 [INFO] Apache Beam :: SDKs :: Java :: IO :: Hadoop Common . SUCCESS
[ 21.135 s]
2017-05-30T21:25:34.627 [INFO] Apache Beam :: SDKs :: Java :: IO :: Hadoop File System SUCCESS
[ 33.888 s]
2017-05-30T21:25:34.627 [INFO] Apache Beam :: SDKs :: Java :: IO :: Hadoop ........ SUCCESS
[  5.571 s]
2017-05-30T21:25:34.627 [INFO] Apache Beam :: SDKs :: Java :: IO :: Hadoop :: input-format
SUCCESS [ 20.348 s]
2017-05-30T21:25:34.627 [INFO] Apache Beam :: Runners :: Google Cloud Dataflow .... SUCCESS
[05:59 min]
2017-05-30T21:25:34.627 [INFO] Apache Beam :: SDKs :: Java :: IO :: Hadoop :: jdk1.8-tests
SUCCESS [01:45 min]
2017-05-30T21:25:34.627 [INFO] Apache Beam :: SDKs :: Java :: IO :: HBase ......... SUCCESS
[01:17 min]
2017-05-30T21:25:34.627 [INFO] Apache Beam :: SDKs :: Java :: IO :: JDBC .......... SUCCESS
[ 55.152 s]

2017-05-30T21:25:34.627 [INFO] Apache Beam :: SDKs :: Java :: IO :: JMS ........... SUCCESS
[ 27.528 s]
2017-05-30T21:25:34.627 [INFO] Apache Beam :: SDKs :: Java :: IO :: Kafka ......... SUCCESS
[ 27.856 s]
2017-05-30T21:25:34.627 [INFO] Apache Beam :: SDKs :: Java :: IO :: Kinesis ....... SUCCESS
[ 30.680 s]
2017-05-30T21:25:34.627 [INFO] Apache Beam :: SDKs :: Java :: IO :: MongoDB ....... SUCCESS
[ 41.003 s]
2017-05-30T21:25:34.627 [INFO] Apache Beam :: SDKs :: Java :: IO :: MQTT .......... SUCCESS
[ 25.876 s]
2017-05-30T21:25:34.627 [INFO] Apache Beam :: SDKs :: Java :: IO :: XML ........... SUCCESS
[ 31.021 s]
2017-05-30T21:25:34.627 [INFO] Apache Beam :: SDKs :: Java :: Maven Archetypes .... SUCCESS
[  1.608 s]
2017-05-30T21:25:34.628 [INFO] Apache Beam :: SDKs :: Java :: Maven Archetypes :: Starter
SUCCESS [ 16.707 s]
2017-05-30T21:25:34.628 [INFO] Apache Beam :: Examples ............................ SUCCESS
[  2.156 s]
2017-05-30T21:25:34.628 [INFO] Apache Beam :: Examples :: Java .................... SUCCESS
[08:59 min]
2017-05-30T21:25:34.628 [INFO] Apache Beam :: SDKs :: Java :: Maven Archetypes :: Examples
SUCCESS [ 45.878 s]
2017-05-30T21:25:34.628 [INFO] Apache Beam :: Examples :: Java 8 .................. SUCCESS
[ 26.803 s]
2017-05-30T21:25:34.628 [INFO] Apache Beam :: SDKs :: Java :: Maven Archetypes :: Examples
- Java 8 SUCCESS [ 44.429 s]
2017-05-30T21:25:34.628 [INFO] Apache Beam :: SDKs :: Java :: Extensions :: Jackson SUCCESS
[ 22.004 s]
2017-05-30T21:25:34.628 [INFO] Apache Beam :: SDKs :: Java :: Extensions :: Join library SUCCESS
[ 24.849 s]
2017-05-30T21:25:34.628 [INFO] Apache Beam :: SDKs :: Java :: Extensions :: Sorter  SUCCESS
[ 48.335 s]
2017-05-30T21:25:34.628 [INFO] Apache Beam :: SDKs :: Java :: Harness ............. SUCCESS
[ 44.843 s]
2017-05-30T21:25:34.628 [INFO] Apache Beam :: SDKs :: Java :: Java 8 Tests ........ SUCCESS
[ 16.141 s]
2017-05-30T21:25:34.628 [INFO] Apache Beam :: SDKs :: Python ...................... SUCCESS
[29:32 min]
2017-05-30T21:25:34.628 [INFO] Apache Beam :: Runners :: Flink .................... FAILURE
[ 37.796 s]
2017-05-30T21:25:34.628 [INFO] Apache Beam :: Runners :: Spark .................... SKIPPED
2017-05-30T21:25:34.628 [INFO] Apache Beam :: Runners :: Apex ..................... SKIPPED
2017-05-30T21:25:34.628 [INFO] Apache Beam :: SDKs :: Java :: Aggregated Javadoc .. SKIPPED
2017-05-30T21:25:34.628 [INFO] ------------------------------------------------------------------------
2017-05-30T21:25:34.628 [INFO] BUILD FAILURE
2017-05-30T21:25:34.628 [INFO] ------------------------------------------------------------------------
2017-05-30T21:25:34.628 [INFO] Total time: 01:14 h
2017-05-30T21:25:34.628 [INFO] Finished at: 2017-05-30T21:25:34+00:00
2017-05-30T21:25:35.766 [INFO] Final Memory: 255M/2155M
2017-05-30T21:25:35.766 [INFO] ------------------------------------------------------------------------
Waiting for Jenkins to finish collecting data
2017-05-30T21:25:50.256 [ERROR] Failed to execute goal org.codehaus.mojo:findbugs-maven-plugin:3.0.4:check
(default) on project beam-runners-flink_2.10: failed with 2 bugs and 0 errors -> [Help
1]
org.apache.maven.lifecycle.LifecycleExecutionException: Failed to execute goal org.codehaus.mojo:findbugs-maven-plugin:3.0.4:check
(default) on project beam-runners-flink_2.10: failed with 2 bugs and 0 errors 
	at org.apache.maven.lifecycle.internal.MojoExecutor.execute(MojoExecutor.java:216)
	at org.apache.maven.lifecycle.internal.MojoExecutor.execute(MojoExecutor.java:153)
	at org.apache.maven.lifecycle.internal.MojoExecutor.execute(MojoExecutor.java:145)
	at org.apache.maven.lifecycle.internal.LifecycleModuleBuilder.buildProject(LifecycleModuleBuilder.java:116)
	at org.apache.maven.lifecycle.internal.LifecycleModuleBuilder.buildProject(LifecycleModuleBuilder.java:80)
	at org.apache.maven.lifecycle.internal.builder.singlethreaded.SingleThreadedBuilder.build(SingleThreadedBuilder.java:51)
	at org.apache.maven.lifecycle.internal.LifecycleStarter.execute(LifecycleStarter.java:128)
	at org.apache.maven.DefaultMaven.doExecute(DefaultMaven.java:307)
	at org.apache.maven.DefaultMaven.doExecute(DefaultMaven.java:193)
	at org.apache.maven.DefaultMaven.execute(DefaultMaven.java:106)
	at org.jvnet.hudson.maven3.launcher.Maven33Launcher.main(Maven33Launcher.java:129)
	at sun.reflect.NativeMethodAccessorImpl.invoke0(Native Method)
	at sun.reflect.NativeMethodAccessorImpl.invoke(NativeMethodAccessorImpl.java:62)
	at sun.reflect.DelegatingMethodAccessorImpl.invoke(DelegatingMethodAccessorImpl.java:43)
	at java.lang.reflect.Method.invoke(Method.java:498)
	at org.codehaus.plexus.classworlds.launcher.Launcher.launchStandard(Launcher.java:330)
	at org.codehaus.plexus.classworlds.launcher.Launcher.launch(Launcher.java:238)
	at jenkins.maven3.agent.Maven33Main.launch(Maven33Main.java:176)
	at sun.reflect.NativeMethodAccessorImpl.invoke0(Native Method)
	at sun.reflect.NativeMethodAccessorImpl.invoke(NativeMethodAccessorImpl.java:62)
	at sun.reflect.DelegatingMethodAccessorImpl.invoke(DelegatingMethodAccessorImpl.java:43)
	at java.lang.reflect.Method.invoke(Method.java:498)
	at hudson.maven.Maven3Builder.call(Maven3Builder.java:139)
	at hudson.maven.Maven3Builder.call(Maven3Builder.java:70)
	at hudson.remoting.UserRequest.perform(UserRequest.java:153)
	at hudson.remoting.UserRequest.perform(UserRequest.java:50)
	at hudson.remoting.Request$2.run(Request.java:336)
	at hudson.remoting.InterceptingExecutorService$1.call(InterceptingExecutorService.java:68)
	at java.util.concurrent.FutureTask.run(FutureTask.java:266)
	at java.util.concurrent.ThreadPoolExecutor.runWorker(ThreadPoolExecutor.java:1142)
	at java.util.concurrent.ThreadPoolExecutor$Worker.run(ThreadPoolExecutor.java:617)
	at java.lang.Thread.run(Thread.java:745)
Caused by: org.apache.maven.plugin.MojoExecutionException: failed with 2 bugs and 0 errors

	at sun.reflect.NativeConstructorAccessorImpl.newInstance0(Native Method)
	at sun.reflect.NativeConstructorAccessorImpl.newInstance(NativeConstructorAccessorImpl.java:62)
	at sun.reflect.DelegatingConstructorAccessorImpl.newInstance(DelegatingConstructorAccessorImpl.java:45)
	at java.lang.reflect.Constructor.newInstance(Constructor.java:423)
	at org.codehaus.groovy.reflection.CachedConstructor.invoke(CachedConstructor.java:83)
	at org.codehaus.groovy.reflection.CachedConstructor.doConstructorInvoke(CachedConstructor.java:77)
	at org.codehaus.groovy.runtime.callsite.ConstructorSite$ConstructorSiteNoUnwrap.callConstructor(ConstructorSite.java:84)
	at org.codehaus.groovy.runtime.callsite.CallSiteArray.defaultCallConstructor(CallSiteArray.java:60)
	at org.codehaus.groovy.runtime.callsite.AbstractCallSite.callConstructor(AbstractCallSite.java:235)
	at org.codehaus.groovy.runtime.callsite.AbstractCallSite.callConstructor(AbstractCallSite.java:247)
	at org.codehaus.mojo.findbugs.FindbugsViolationCheckMojo.execute(FindbugsViolationCheckMojo.groovy:529)
	at org.apache.maven.plugin.DefaultBuildPluginManager.executeMojo(DefaultBuildPluginManager.java:134)
	at org.apache.maven.lifecycle.internal.MojoExecutor.execute(MojoExecutor.java:208)
	... 31 more
2017-05-30T21:25:50.264 [ERROR] 
2017-05-30T21:25:50.264 [ERROR] Re-run Maven using the -X switch to enable full debug logging.
2017-05-30T21:25:50.264 [ERROR] 
2017-05-30T21:25:50.264 [ERROR] For more information about the errors and possible solutions,
please read the following articles:
2017-05-30T21:25:50.264 [ERROR] [Help 1] http://cwiki.apache.org/confluence/display/MAVEN/MojoExecutionException
2017-05-30T21:25:50.265 [ERROR] 
2017-05-30T21:25:50.265 [ERROR] After correcting the problems, you can resume the build with
the command
2017-05-30T21:25:50.265 [ERROR]   mvn <goals> -rf :beam-runners-flink_2.10
channel stopped
Not sending mail to unregistered user aljoscha.krettek@gmail.com

Mime
View raw message