beam-commits mailing list archives

Site index · List index
Message view « Date » · « Thread »
Top « Date » · « Thread »
From Apache Jenkins Server <jenk...@builds.apache.org>
Subject Build failed in Jenkins: beam_PostCommit_Java_JDK_Versions_Test » OpenJDK 7 (on Ubuntu only),beam #4
Date Wed, 03 May 2017 00:09:36 GMT
See <https://builds.apache.org/job/beam_PostCommit_Java_JDK_Versions_Test/jdk=OpenJDK%207%20(on%20Ubuntu%20only),label=beam/4/display/redirect?page=changes>

Changes:

[davor] Include LICENSE and NOTICE in python dist files

------------------------------------------
[...truncated 726.31 KB...]
2017-05-03\T\00:09:03.659 [INFO] Downloading: https://repo.maven.apache.org/maven2/commons-codec/commons-codec/1.9/commons-codec-1.9.jar
2017-05-03\T\00:09:03.696 [INFO] Downloaded: https://repo.maven.apache.org/maven2/org/apache/hadoop/hadoop-minicluster/2.7.3/hadoop-minicluster-2.7.3.jar
(25 KB at 609.6 KB/sec)
2017-05-03\T\00:09:03.696 [INFO] Downloading: https://repo.maven.apache.org/maven2/org/apache/hadoop/hadoop-yarn-server-tests/2.7.3/hadoop-yarn-server-tests-2.7.3-tests.jar
2017-05-03\T\00:09:03.697 [INFO] Downloaded: https://repo.maven.apache.org/maven2/org/apache/avro/avro-ipc/1.8.1/avro-ipc-1.8.1.jar
(129 KB at 2996.0 KB/sec)
2017-05-03\T\00:09:03.697 [INFO] Downloading: https://repo.maven.apache.org/maven2/org/apache/hadoop/hadoop-yarn-server-nodemanager/2.7.3/hadoop-yarn-server-nodemanager-2.7.3.jar
2017-05-03\T\00:09:03.702 [INFO] Downloaded: https://repo.maven.apache.org/maven2/org/apache/avro/avro-mapred/1.8.1/avro-mapred-1.8.1-hadoop2.jar
(182 KB at 3712.1 KB/sec)
2017-05-03\T\00:09:03.702 [INFO] Downloading: https://repo.maven.apache.org/maven2/org/apache/hadoop/hadoop-yarn-server-resourcemanager/2.7.3/hadoop-yarn-server-resourcemanager-2.7.3.jar
2017-05-03\T\00:09:03.716 [INFO] Downloaded: https://repo.maven.apache.org/maven2/commons-codec/commons-codec/1.9/commons-codec-1.9.jar
(258 KB at 4157.7 KB/sec)
2017-05-03\T\00:09:03.716 [INFO] Downloading: https://repo.maven.apache.org/maven2/org/apache/hadoop/hadoop-yarn-server-applicationhistoryservice/2.7.3/hadoop-yarn-server-applicationhistoryservice-2.7.3.jar
2017-05-03\T\00:09:03.730 [INFO] Downloaded: https://repo.maven.apache.org/maven2/org/apache/hadoop/hadoop-yarn-server-tests/2.7.3/hadoop-yarn-server-tests-2.7.3-tests.jar
(75 KB at 1019.8 KB/sec)
2017-05-03\T\00:09:03.730 [INFO] Downloading: https://repo.maven.apache.org/maven2/org/apache/hadoop/hadoop-yarn-server-web-proxy/2.7.3/hadoop-yarn-server-web-proxy-2.7.3.jar
2017-05-03\T\00:09:03.768 [INFO] Downloaded: https://repo.maven.apache.org/maven2/org/apache/hadoop/hadoop-yarn-server-web-proxy/2.7.3/hadoop-yarn-server-web-proxy-2.7.3.jar
(58 KB at 513.9 KB/sec)
2017-05-03\T\00:09:03.768 [INFO] Downloading: https://repo.maven.apache.org/maven2/org/apache/zookeeper/zookeeper/3.4.6/zookeeper-3.4.6-tests.jar
2017-05-03\T\00:09:03.778 [INFO] Downloaded: https://repo.maven.apache.org/maven2/org/apache/hadoop/hadoop-yarn-server-applicationhistoryservice/2.7.3/hadoop-yarn-server-applicationhistoryservice-2.7.3.jar
(216 KB at 1779.0 KB/sec)
2017-05-03\T\00:09:03.778 [INFO] Downloading: https://repo.maven.apache.org/maven2/org/apache/hadoop/hadoop-mapreduce-client-jobclient/2.7.3/hadoop-mapreduce-client-jobclient-2.7.3-tests.jar
2017-05-03\T\00:09:03.794 [INFO] Downloaded: https://repo.maven.apache.org/maven2/org/apache/hadoop/hadoop-yarn-server-nodemanager/2.7.3/hadoop-yarn-server-nodemanager-2.7.3.jar
(703 KB at 5124.6 KB/sec)
2017-05-03\T\00:09:03.794 [INFO] Downloading: https://repo.maven.apache.org/maven2/org/apache/hadoop/hadoop-mapreduce-client-hs/2.7.3/hadoop-mapreduce-client-hs-2.7.3.jar
2017-05-03\T\00:09:03.821 [INFO] Downloaded: https://repo.maven.apache.org/maven2/org/apache/hadoop/hadoop-yarn-server-resourcemanager/2.7.3/hadoop-yarn-server-resourcemanager-2.7.3.jar
(1257 KB at 7664.1 KB/sec)
2017-05-03\T\00:09:03.821 [INFO] Downloading: https://repo.maven.apache.org/maven2/org/apache/hadoop/hadoop-hdfs/2.7.3/hadoop-hdfs-2.7.3-tests.jar
2017-05-03\T\00:09:03.833 [INFO] Downloaded: https://repo.maven.apache.org/maven2/org/apache/hadoop/hadoop-mapreduce-client-hs/2.7.3/hadoop-mapreduce-client-hs-2.7.3.jar
(188 KB at 1063.6 KB/sec)
2017-05-03\T\00:09:03.833 [INFO] Downloading: https://repo.maven.apache.org/maven2/commons-daemon/commons-daemon/1.0.13/commons-daemon-1.0.13.jar
2017-05-03\T\00:09:03.841 [INFO] Downloaded: https://repo.maven.apache.org/maven2/org/apache/hadoop/hadoop-common/2.7.3/hadoop-common-2.7.3-tests.jar
(1878 KB at 10205.5 KB/sec)
2017-05-03\T\00:09:03.842 [INFO] Downloaded: https://repo.maven.apache.org/maven2/org/apache/zookeeper/zookeeper/3.4.6/zookeeper-3.4.6-tests.jar
(527 KB at 2846.6 KB/sec)
2017-05-03\T\00:09:03.863 [INFO] Downloaded: https://repo.maven.apache.org/maven2/commons-daemon/commons-daemon/1.0.13/commons-daemon-1.0.13.jar
(24 KB at 114.9 KB/sec)
2017-05-03\T\00:09:03.927 [INFO] Downloaded: https://repo.maven.apache.org/maven2/org/apache/hadoop/hadoop-mapreduce-client-jobclient/2.7.3/hadoop-mapreduce-client-jobclient-2.7.3-tests.jar
(1521 KB at 5652.8 KB/sec)
2017-05-03\T\00:09:04.043 [INFO] Downloaded: https://repo.maven.apache.org/maven2/org/apache/hadoop/hadoop-hdfs/2.7.3/hadoop-hdfs-2.7.3-tests.jar
(3277 KB at 8487.5 KB/sec)
2017-05-03\T\00:09:04.050 [INFO] 
2017-05-03\T\00:09:04.051 [INFO] --- maven-clean-plugin:3.0.0:clean (default-clean) @ beam-sdks-java-io-hadoop-file-system
---
2017-05-03\T\00:09:04.053 [INFO] Deleting <https://builds.apache.org/job/beam_PostCommit_Java_JDK_Versions_Test/jdk=OpenJDK%207%20(on%20Ubuntu%20only),label=beam/ws/sdks/java/io/hadoop-file-system>
(includes = [**/*.pyc, **/*.egg-info/, **/sdks/python/LICENSE, **/sdks/python/NOTICE], excludes
= [])
2017-05-03\T\00:09:04.055 [INFO] 
2017-05-03\T\00:09:04.056 [INFO] --- maven-enforcer-plugin:1.4.1:enforce (enforce) @ beam-sdks-java-io-hadoop-file-system
---
2017-05-03\T\00:09:06.080 [INFO] 
2017-05-03\T\00:09:06.080 [INFO] --- maven-remote-resources-plugin:1.5:process (process-resource-bundles)
@ beam-sdks-java-io-hadoop-file-system ---
2017-05-03\T\00:09:06.495 [INFO] 
2017-05-03\T\00:09:06.495 [INFO] --- maven-resources-plugin:3.0.2:resources (default-resources)
@ beam-sdks-java-io-hadoop-file-system ---
2017-05-03\T\00:09:06.496 [INFO] Using 'UTF-8' encoding to copy filtered resources.
2017-05-03\T\00:09:06.496 [INFO] skip non existing resourceDirectory <https://builds.apache.org/job/beam_PostCommit_Java_JDK_Versions_Test/jdk=OpenJDK%207%20(on%20Ubuntu%20only),label=beam/ws/sdks/java/io/hadoop-file-system/src/main/resources>
2017-05-03\T\00:09:06.497 [INFO] Copying 3 resources
2017-05-03\T\00:09:06.498 [INFO] 
2017-05-03\T\00:09:06.498 [INFO] --- maven-compiler-plugin:3.6.1:compile (default-compile)
@ beam-sdks-java-io-hadoop-file-system ---
2017-05-03\T\00:09:06.503 [INFO] Changes detected - recompiling the module!
2017-05-03\T\00:09:06.503 [INFO] Compiling 11 source files to <https://builds.apache.org/job/beam_PostCommit_Java_JDK_Versions_Test/jdk=OpenJDK%207%20(on%20Ubuntu%20only),label=beam/ws/sdks/java/io/hadoop-file-system/target/classes>
2017-05-03\T\00:09:07.990 [INFO] <https://builds.apache.org/job/beam_PostCommit_Java_JDK_Versions_Test/jdk=OpenJDK%207%20(on%20Ubuntu%20only),label=beam/ws/sdks/java/io/hadoop-file-system/src/main/java/org/apache/beam/sdk/io/hdfs/HDFSFileSink.java>:
Some input files use or override a deprecated API.
2017-05-03\T\00:09:07.990 [INFO] <https://builds.apache.org/job/beam_PostCommit_Java_JDK_Versions_Test/jdk=OpenJDK%207%20(on%20Ubuntu%20only),label=beam/ws/sdks/java/io/hadoop-file-system/src/main/java/org/apache/beam/sdk/io/hdfs/HDFSFileSink.java>:
Recompile with -Xlint:deprecation for details.
2017-05-03\T\00:09:07.990 [INFO] <https://builds.apache.org/job/beam_PostCommit_Java_JDK_Versions_Test/jdk=OpenJDK%207%20(on%20Ubuntu%20only),label=beam/ws/sdks/java/io/hadoop-file-system/src/main/java/org/apache/beam/sdk/io/hdfs/HDFSFileSink.java>:
Some input files use unchecked or unsafe operations.
2017-05-03\T\00:09:07.990 [INFO] <https://builds.apache.org/job/beam_PostCommit_Java_JDK_Versions_Test/jdk=OpenJDK%207%20(on%20Ubuntu%20only),label=beam/ws/sdks/java/io/hadoop-file-system/src/main/java/org/apache/beam/sdk/io/hdfs/HDFSFileSink.java>:
Recompile with -Xlint:unchecked for details.
2017-05-03\T\00:09:07.990 [INFO] 
2017-05-03\T\00:09:07.990 [INFO] --- maven-compiler-plugin:3.6.1:compile (compile-package-info)
@ beam-sdks-java-io-hadoop-file-system ---
2017-05-03\T\00:09:07.995 [INFO] Changes detected - recompiling the module!
2017-05-03\T\00:09:07.996 [INFO] Compiling 1 source file to <https://builds.apache.org/job/beam_PostCommit_Java_JDK_Versions_Test/jdk=OpenJDK%207%20(on%20Ubuntu%20only),label=beam/ws/sdks/java/io/hadoop-file-system/target/classes>
2017-05-03\T\00:09:08.150 [INFO] 
2017-05-03\T\00:09:08.150 [INFO] --- maven-resources-plugin:3.0.2:testResources (default-testResources)
@ beam-sdks-java-io-hadoop-file-system ---
2017-05-03\T\00:09:08.152 [INFO] Using 'UTF-8' encoding to copy filtered resources.
2017-05-03\T\00:09:08.152 [INFO] skip non existing resourceDirectory <https://builds.apache.org/job/beam_PostCommit_Java_JDK_Versions_Test/jdk=OpenJDK%207%20(on%20Ubuntu%20only),label=beam/ws/sdks/java/io/hadoop-file-system/src/test/resources>
2017-05-03\T\00:09:08.152 [INFO] Copying 3 resources
2017-05-03\T\00:09:08.153 [INFO] 
2017-05-03\T\00:09:08.153 [INFO] --- maven-compiler-plugin:3.6.1:testCompile (default-testCompile)
@ beam-sdks-java-io-hadoop-file-system ---
2017-05-03\T\00:09:08.166 [INFO] Changes detected - recompiling the module!
2017-05-03\T\00:09:08.167 [INFO] Compiling 7 source files to <https://builds.apache.org/job/beam_PostCommit_Java_JDK_Versions_Test/jdk=OpenJDK%207%20(on%20Ubuntu%20only),label=beam/ws/sdks/java/io/hadoop-file-system/target/test-classes>
2017-05-03\T\00:09:08.562 [INFO] <https://builds.apache.org/job/beam_PostCommit_Java_JDK_Versions_Test/jdk=OpenJDK%207%20(on%20Ubuntu%20only),label=beam/ws/sdks/java/io/hadoop-file-system/src/test/java/org/apache/beam/sdk/io/hdfs/HDFSFileSinkTest.java>:
<https://builds.apache.org/job/beam_PostCommit_Java_JDK_Versions_Test/jdk=OpenJDK%207%20(on%20Ubuntu%20only),label=beam/ws/sdks/java/io/hadoop-file-system/src/test/java/org/apache/beam/sdk/io/hdfs/HDFSFileSinkTest.java>
uses or overrides a deprecated API.
2017-05-03\T\00:09:08.562 [INFO] <https://builds.apache.org/job/beam_PostCommit_Java_JDK_Versions_Test/jdk=OpenJDK%207%20(on%20Ubuntu%20only),label=beam/ws/sdks/java/io/hadoop-file-system/src/test/java/org/apache/beam/sdk/io/hdfs/HDFSFileSinkTest.java>:
Recompile with -Xlint:deprecation for details.
2017-05-03\T\00:09:08.562 [INFO] <https://builds.apache.org/job/beam_PostCommit_Java_JDK_Versions_Test/jdk=OpenJDK%207%20(on%20Ubuntu%20only),label=beam/ws/sdks/java/io/hadoop-file-system/src/test/java/org/apache/beam/sdk/io/hdfs/HadoopFileSystemOptionsTest.java>:
Some input files use unchecked or unsafe operations.
2017-05-03\T\00:09:08.562 [INFO] <https://builds.apache.org/job/beam_PostCommit_Java_JDK_Versions_Test/jdk=OpenJDK%207%20(on%20Ubuntu%20only),label=beam/ws/sdks/java/io/hadoop-file-system/src/test/java/org/apache/beam/sdk/io/hdfs/HadoopFileSystemOptionsTest.java>:
Recompile with -Xlint:unchecked for details.
2017-05-03\T\00:09:08.562 [INFO] 
2017-05-03\T\00:09:08.562 [INFO] --- maven-checkstyle-plugin:2.17:check (default) @ beam-sdks-java-io-hadoop-file-system
---
2017-05-03\T\00:09:09.635 [INFO] Starting audit...
Audit done.
2017-05-03\T\00:09:09.636 [INFO] 
2017-05-03\T\00:09:09.636 [INFO] --- maven-surefire-plugin:2.20:test (default-test) @ beam-sdks-java-io-hadoop-file-system
---
2017-05-03\T\00:09:09.639 [INFO] Surefire report directory: <https://builds.apache.org/job/beam_PostCommit_Java_JDK_Versions_Test/jdk=OpenJDK%207%20(on%20Ubuntu%20only),label=beam/ws/sdks/java/io/hadoop-file-system/target/surefire-reports>
2017-05-03\T\00:09:09.640 [INFO] Using configured provider org.apache.maven.surefire.junitcore.JUnitCoreProvider
2017-05-03\T\00:09:09.640 [INFO] parallel='none', perCoreThreadCount=true, threadCount=0,
useUnlimitedThreads=false, threadCountSuites=0, threadCountClasses=0, threadCountMethods=0,
parallelOptimized=true
2017-05-03\T\00:09:09.641 [INFO] 
2017-05-03\T\00:09:09.641 [INFO] -------------------------------------------------------
2017-05-03\T\00:09:09.641 [INFO]  T E S T S
2017-05-03\T\00:09:09.641 [INFO] -------------------------------------------------------
2017-05-03\T\00:09:11.317 [INFO] Running org.apache.beam.sdk.io.hdfs.HadoopFileSystemTest
2017-05-03\T\00:09:30.729 [WARNING] Tests run: 7, Failures: 0, Errors: 0, Skipped: 1, Time
elapsed: 19.411 s - in org.apache.beam.sdk.io.hdfs.HadoopFileSystemTest
2017-05-03\T\00:09:30.729 [INFO] Running org.apache.beam.sdk.io.hdfs.HadoopFileSystemRegistrarTest
2017-05-03\T\00:09:31.703 [INFO] Tests run: 1, Failures: 0, Errors: 0, Skipped: 0, Time elapsed:
0.972 s - in org.apache.beam.sdk.io.hdfs.HadoopFileSystemRegistrarTest
2017-05-03\T\00:09:31.703 [INFO] Running org.apache.beam.sdk.io.hdfs.HDFSFileSourceTest
2017-05-03\T\00:09:33.560 [INFO] Tests run: 6, Failures: 0, Errors: 0, Skipped: 0, Time elapsed:
1.856 s - in org.apache.beam.sdk.io.hdfs.HDFSFileSourceTest
2017-05-03\T\00:09:33.560 [INFO] Running org.apache.beam.sdk.io.hdfs.HadoopFileSystemOptionsRegistrarTest
2017-05-03\T\00:09:33.562 [INFO] Tests run: 1, Failures: 0, Errors: 0, Skipped: 0, Time elapsed:
0 s - in org.apache.beam.sdk.io.hdfs.HadoopFileSystemOptionsRegistrarTest
2017-05-03\T\00:09:33.562 [INFO] Running org.apache.beam.sdk.io.hdfs.HadoopFileSystemOptionsTest
2017-05-03\T\00:09:33.628 [INFO] Tests run: 1, Failures: 0, Errors: 0, Skipped: 0, Time elapsed:
0.065 s - in org.apache.beam.sdk.io.hdfs.HadoopFileSystemOptionsTest
2017-05-03\T\00:09:33.628 [INFO] Running org.apache.beam.sdk.io.hdfs.HadoopFileSystemModuleTest
2017-05-03\T\00:09:33.655 [ERROR] Tests run: 2, Failures: 1, Errors: 0, Skipped: 0, Time elapsed:
0.024 s <<< FAILURE! - in org.apache.beam.sdk.io.hdfs.HadoopFileSystemModuleTest
2017-05-03\T\00:09:33.655 [ERROR] testConfigurationSerializationDeserialization(org.apache.beam.sdk.io.hdfs.HadoopFileSystemModuleTest)
 Time elapsed: 0.023 s  <<< FAILURE!
java.lang.AssertionError: 

Expected: iterable containing [<testPropertyA=A>, <testPropertyB=B>, <testPropertyC=baseC>]
     but: item 0: was <testPropertyC=baseC>
	at org.hamcrest.MatcherAssert.assertThat(MatcherAssert.java:20)
	at org.junit.Assert.assertThat(Assert.java:956)
	at org.junit.Assert.assertThat(Assert.java:923)
	at org.apache.beam.sdk.io.hdfs.HadoopFileSystemModuleTest.testConfigurationSerializationDeserialization(HadoopFileSystemModuleTest.java:60)
	at sun.reflect.NativeMethodAccessorImpl.invoke0(Native Method)
	at sun.reflect.NativeMethodAccessorImpl.invoke(NativeMethodAccessorImpl.java:57)
	at sun.reflect.DelegatingMethodAccessorImpl.invoke(DelegatingMethodAccessorImpl.java:43)
	at java.lang.reflect.Method.invoke(Method.java:606)
	at org.junit.runners.model.FrameworkMethod$1.runReflectiveCall(FrameworkMethod.java:50)
	at org.junit.internal.runners.model.ReflectiveCallable.run(ReflectiveCallable.java:12)
	at org.junit.runners.model.FrameworkMethod.invokeExplosively(FrameworkMethod.java:47)
	at org.junit.internal.runners.statements.InvokeMethod.evaluate(InvokeMethod.java:17)
	at org.junit.runners.ParentRunner.runLeaf(ParentRunner.java:325)
	at org.junit.runners.BlockJUnit4ClassRunner.runChild(BlockJUnit4ClassRunner.java:78)
	at org.junit.runners.BlockJUnit4ClassRunner.runChild(BlockJUnit4ClassRunner.java:57)
	at org.junit.runners.ParentRunner$3.run(ParentRunner.java:290)
	at org.junit.runners.ParentRunner$1.schedule(ParentRunner.java:71)
	at org.junit.runners.ParentRunner.runChildren(ParentRunner.java:288)
	at org.junit.runners.ParentRunner.access$000(ParentRunner.java:58)
	at org.junit.runners.ParentRunner$2.evaluate(ParentRunner.java:268)
	at org.junit.runners.ParentRunner.run(ParentRunner.java:363)
	at org.junit.runners.Suite.runChild(Suite.java:128)
	at org.junit.runners.Suite.runChild(Suite.java:27)
	at org.junit.runners.ParentRunner$3.run(ParentRunner.java:290)
	at org.junit.runners.ParentRunner$1.schedule(ParentRunner.java:71)
	at org.junit.runners.ParentRunner.runChildren(ParentRunner.java:288)
	at org.junit.runners.ParentRunner.access$000(ParentRunner.java:58)
	at org.junit.runners.ParentRunner$2.evaluate(ParentRunner.java:268)
	at org.junit.runners.ParentRunner.run(ParentRunner.java:363)
	at org.apache.maven.surefire.junitcore.JUnitCore.run(JUnitCore.java:55)
	at org.apache.maven.surefire.junitcore.JUnitCoreWrapper.createRequestAndRun(JUnitCoreWrapper.java:137)
	at org.apache.maven.surefire.junitcore.JUnitCoreWrapper.executeEager(JUnitCoreWrapper.java:107)
	at org.apache.maven.surefire.junitcore.JUnitCoreWrapper.execute(JUnitCoreWrapper.java:83)
	at org.apache.maven.surefire.junitcore.JUnitCoreWrapper.execute(JUnitCoreWrapper.java:75)
	at org.apache.maven.surefire.junitcore.JUnitCoreProvider.invoke(JUnitCoreProvider.java:157)
	at org.apache.maven.surefire.booter.ForkedBooter.invokeProviderInSameClassLoader(ForkedBooter.java:386)
	at org.apache.maven.surefire.booter.ForkedBooter.runSuitesInProcess(ForkedBooter.java:323)
	at org.apache.maven.surefire.booter.ForkedBooter.main(ForkedBooter.java:143)

2017-05-03\T\00:09:33.655 [INFO] Running org.apache.beam.sdk.io.hdfs.HDFSFileSinkTest
2017-05-03\T\00:09:33.884 [INFO] Tests run: 3, Failures: 0, Errors: 0, Skipped: 0, Time elapsed:
0.228 s - in org.apache.beam.sdk.io.hdfs.HDFSFileSinkTest
2017-05-03\T\00:09:34.368 [INFO] 
2017-05-03\T\00:09:34.368 [INFO] Results:
2017-05-03\T\00:09:34.368 [INFO] 
2017-05-03\T\00:09:34.368 [ERROR] Failures: 
2017-05-03\T\00:09:34.368 [ERROR]   HadoopFileSystemModuleTest.testConfigurationSerializationDeserialization:60

Expected: iterable containing [<testPropertyA=A>, <testPropertyB=B>, <testPropertyC=baseC>]
     but: item 0: was <testPropertyC=baseC>
2017-05-03\T\00:09:34.368 [INFO] 
2017-05-03\T\00:09:34.368 [ERROR] Tests run: 21, Failures: 1, Errors: 0, Skipped: 1
2017-05-03\T\00:09:34.368 [INFO] 
2017-05-03\T\00:09:34.369 [INFO] ------------------------------------------------------------------------
2017-05-03\T\00:09:34.369 [INFO] Reactor Summary:
2017-05-03\T\00:09:34.369 [INFO] 
2017-05-03\T\00:09:34.369 [INFO] Apache Beam :: Parent .............................. SUCCESS
[ 34.837 s]
2017-05-03\T\00:09:34.369 [INFO] Apache Beam :: SDKs :: Java :: Build Tools ......... SUCCESS
[ 11.197 s]
2017-05-03\T\00:09:34.369 [INFO] Apache Beam :: SDKs ................................ SUCCESS
[  1.227 s]
2017-05-03\T\00:09:34.369 [INFO] Apache Beam :: SDKs :: Common ...................... SUCCESS
[  0.914 s]
2017-05-03\T\00:09:34.369 [INFO] Apache Beam :: SDKs :: Common :: Fn API ............ SUCCESS
[ 15.127 s]
2017-05-03\T\00:09:34.369 [INFO] Apache Beam :: SDKs :: Common :: Runner API ........ SUCCESS
[  1.842 s]
2017-05-03\T\00:09:34.369 [INFO] Apache Beam :: SDKs :: Java ........................ SUCCESS
[  1.044 s]
2017-05-03\T\00:09:34.369 [INFO] Apache Beam :: SDKs :: Java :: Core ................ SUCCESS
[01:40 min]
2017-05-03\T\00:09:34.369 [INFO] Apache Beam :: SDKs :: Java :: IO .................. SUCCESS
[  0.782 s]
2017-05-03\T\00:09:34.370 [INFO] Apache Beam :: SDKs :: Java :: IO :: Common ........ SUCCESS
[  3.110 s]
2017-05-03\T\00:09:34.370 [INFO] Apache Beam :: Runners ............................. SUCCESS
[  0.475 s]
2017-05-03\T\00:09:34.370 [INFO] Apache Beam :: Runners :: Core Construction Java ... SUCCESS
[ 13.411 s]
2017-05-03\T\00:09:34.370 [INFO] Apache Beam :: Runners :: Core Java ................ SUCCESS
[ 42.672 s]
2017-05-03\T\00:09:34.370 [INFO] Apache Beam :: Runners :: Direct Java .............. SUCCESS
[03:16 min]
2017-05-03\T\00:09:34.370 [INFO] Apache Beam :: SDKs :: Java :: IO :: Elasticsearch . SUCCESS
[ 38.720 s]
2017-05-03\T\00:09:34.370 [INFO] Apache Beam :: SDKs :: Java :: Extensions .......... SUCCESS
[  0.812 s]
2017-05-03\T\00:09:34.370 [INFO] Apache Beam :: SDKs :: Java :: Extensions :: Google Cloud
Platform Core SUCCESS [ 23.858 s]
2017-05-03\T\00:09:34.370 [INFO] Apache Beam :: SDKs :: Java :: Extensions :: Protobuf SUCCESS
[ 16.086 s]
2017-05-03\T\00:09:34.370 [INFO] Apache Beam :: SDKs :: Java :: IO :: Google Cloud Platform
SUCCESS [01:26 min]
2017-05-03\T\00:09:34.370 [INFO] Apache Beam :: SDKs :: Java :: IO :: Hadoop Common . SUCCESS
[ 16.962 s]
2017-05-03\T\00:09:34.370 [INFO] Apache Beam :: SDKs :: Java :: IO :: Hadoop File System FAILURE
[ 31.294 s]
2017-05-03\T\00:09:34.370 [INFO] Apache Beam :: SDKs :: Java :: IO :: Hadoop ........ SKIPPED
2017-05-03\T\00:09:34.370 [INFO] Apache Beam :: SDKs :: Java :: IO :: Hadoop :: input-format
SKIPPED
2017-05-03\T\00:09:34.370 [INFO] Apache Beam :: SDKs :: Java :: IO :: HBase ......... SKIPPED
2017-05-03\T\00:09:34.370 [INFO] Apache Beam :: Runners :: Google Cloud Dataflow .... SKIPPED
2017-05-03\T\00:09:34.370 [INFO] Apache Beam :: SDKs :: Java :: IO :: JDBC .......... SKIPPED
2017-05-03\T\00:09:34.370 [INFO] Apache Beam :: SDKs :: Java :: IO :: JMS ........... SKIPPED
2017-05-03\T\00:09:34.370 [INFO] Apache Beam :: SDKs :: Java :: IO :: Kafka ......... SKIPPED
2017-05-03\T\00:09:34.370 [INFO] Apache Beam :: SDKs :: Java :: IO :: Kinesis ....... SKIPPED
2017-05-03\T\00:09:34.370 [INFO] Apache Beam :: SDKs :: Java :: IO :: MongoDB ....... SKIPPED
2017-05-03\T\00:09:34.370 [INFO] Apache Beam :: SDKs :: Java :: IO :: MQTT .......... SKIPPED
2017-05-03\T\00:09:34.370 [INFO] Apache Beam :: SDKs :: Java :: IO :: XML ........... SKIPPED
2017-05-03\T\00:09:34.370 [INFO] Apache Beam :: SDKs :: Java :: Maven Archetypes .... SKIPPED
2017-05-03\T\00:09:34.370 [INFO] Apache Beam :: SDKs :: Java :: Maven Archetypes :: Starter
SKIPPED
2017-05-03\T\00:09:34.370 [INFO] Apache Beam :: SDKs :: Java :: Maven Archetypes :: Examples
SKIPPED
2017-05-03\T\00:09:34.370 [INFO] Apache Beam :: SDKs :: Java :: Extensions :: Jackson SKIPPED
2017-05-03\T\00:09:34.370 [INFO] Apache Beam :: SDKs :: Java :: Extensions :: Join library
SKIPPED
2017-05-03\T\00:09:34.370 [INFO] Apache Beam :: SDKs :: Java :: Extensions :: Sorter  SKIPPED
2017-05-03\T\00:09:34.370 [INFO] Apache Beam :: Runners :: Flink .................... SKIPPED
2017-05-03\T\00:09:34.370 [INFO] Apache Beam :: Runners :: Spark .................... SKIPPED
2017-05-03\T\00:09:34.370 [INFO] Apache Beam :: Runners :: Apex ..................... SKIPPED
2017-05-03\T\00:09:34.370 [INFO] Apache Beam :: Examples ............................ SKIPPED
2017-05-03\T\00:09:34.370 [INFO] Apache Beam :: Examples :: Java .................... SKIPPED
2017-05-03\T\00:09:34.370 [INFO] Apache Beam :: SDKs :: Java :: Aggregated Javadoc .. SKIPPED
2017-05-03\T\00:09:34.370 [INFO] ------------------------------------------------------------------------
2017-05-03\T\00:09:34.370 [INFO] BUILD FAILURE
2017-05-03\T\00:09:34.370 [INFO] ------------------------------------------------------------------------
2017-05-03\T\00:09:34.370 [INFO] Total time: 10:44 min
2017-05-03\T\00:09:34.370 [INFO] Finished at: 2017-05-03T00:09:34+00:00
2017-05-03\T\00:09:35.204 [INFO] Final Memory: 147M/1390M
2017-05-03\T\00:09:35.204 [INFO] ------------------------------------------------------------------------
2017-05-03\T\00:09:35.205 [ERROR] Failed to execute goal org.apache.maven.plugins:maven-surefire-plugin:2.20:test
(default-test) on project beam-sdks-java-io-hadoop-file-system: There are test failures.
2017-05-03\T\00:09:35.205 [ERROR] 
2017-05-03\T\00:09:35.205 [ERROR] Please refer to <https://builds.apache.org/job/beam_PostCommit_Java_JDK_Versions_Test/jdk=OpenJDK%207%20(on%20Ubuntu%20only),label=beam/ws/sdks/java/io/hadoop-file-system/target/surefire-reports>
for the individual test results.
2017-05-03\T\00:09:35.205 [ERROR] Please refer to dump files (if any exist) [date]-jvmRun[N].dump,
[date].dumpstream and [date]-jvmRun[N].dumpstream.
2017-05-03\T\00:09:35.205 [ERROR] -> [Help 1]
org.apache.maven.lifecycle.LifecycleExecutionException: Failed to execute goal org.apache.maven.plugins:maven-surefire-plugin:2.20:test
(default-test) on project beam-sdks-java-io-hadoop-file-system: There are test failures.

Please refer to <https://builds.apache.org/job/beam_PostCommit_Java_JDK_Versions_Test/jdk=OpenJDK%207%20(on%20Ubuntu%20only),label=beam/ws/sdks/java/io/hadoop-file-system/target/surefire-reports>
for the individual test results.
Please refer to dump files (if any exist) [date]-jvmRun[N].dump, [date].dumpstream and [date]-jvmRun[N].dumpstream.
	at org.apache.maven.lifecycle.internal.MojoExecutor.execute(MojoExecutor.java:212)
	at org.apache.maven.lifecycle.internal.MojoExecutor.execute(MojoExecutor.java:153)
	at org.apache.maven.lifecycle.internal.MojoExecutor.execute(MojoExecutor.java:145)
	at org.apache.maven.lifecycle.internal.LifecycleModuleBuilder.buildProject(LifecycleModuleBuilder.java:116)
	at org.apache.maven.lifecycle.internal.LifecycleModuleBuilder.buildProject(LifecycleModuleBuilder.java:80)
	at org.apache.maven.lifecycle.internal.builder.singlethreaded.SingleThreadedBuilder.build(SingleThreadedBuilder.java:51)
	at org.apache.maven.lifecycle.internal.LifecycleStarter.execute(LifecycleStarter.java:128)
	at org.apache.maven.DefaultMaven.doExecute(DefaultMaven.java:307)
	at org.apache.maven.DefaultMaven.doExecute(DefaultMaven.java:193)
	at org.apache.maven.DefaultMaven.execute(DefaultMaven.java:106)
	at org.apache.maven.cli.MavenCli.execute(MavenCli.java:862)
	at org.apache.maven.cli.MavenCli.doMain(MavenCli.java:286)
	at org.apache.maven.cli.MavenCli.main(MavenCli.java:197)
	at sun.reflect.NativeMethodAccessorImpl.invoke0(Native Method)
	at sun.reflect.NativeMethodAccessorImpl.invoke(NativeMethodAccessorImpl.java:57)
	at sun.reflect.DelegatingMethodAccessorImpl.invoke(DelegatingMethodAccessorImpl.java:43)
	at java.lang.reflect.Method.invoke(Method.java:606)
	at org.codehaus.plexus.classworlds.launcher.Launcher.launchEnhanced(Launcher.java:289)
	at org.codehaus.plexus.classworlds.launcher.Launcher.launch(Launcher.java:229)
	at org.codehaus.plexus.classworlds.launcher.Launcher.mainWithExitCode(Launcher.java:415)
	at org.codehaus.plexus.classworlds.launcher.Launcher.main(Launcher.java:356)
Caused by: org.apache.maven.plugin.MojoFailureException: There are test failures.

Please refer to <https://builds.apache.org/job/beam_PostCommit_Java_JDK_Versions_Test/jdk=OpenJDK%207%20(on%20Ubuntu%20only),label=beam/ws/sdks/java/io/hadoop-file-system/target/surefire-reports>
for the individual test results.
Please refer to dump files (if any exist) [date]-jvmRun[N].dump, [date].dumpstream and [date]-jvmRun[N].dumpstream.
	at org.apache.maven.plugin.surefire.SurefireHelper.throwException(SurefireHelper.java:204)
	at org.apache.maven.plugin.surefire.SurefireHelper.reportExecution(SurefireHelper.java:98)
	at org.apache.maven.plugin.surefire.SurefirePlugin.handleSummary(SurefirePlugin.java:334)
	at org.apache.maven.plugin.surefire.AbstractSurefireMojo.executeAfterPreconditionsChecked(AbstractSurefireMojo.java:937)
	at org.apache.maven.plugin.surefire.AbstractSurefireMojo.execute(AbstractSurefireMojo.java:785)
	at org.apache.maven.plugin.DefaultBuildPluginManager.executeMojo(DefaultBuildPluginManager.java:134)
	at org.apache.maven.lifecycle.internal.MojoExecutor.execute(MojoExecutor.java:208)
	... 20 more
2017-05-03\T\00:09:35.206 [ERROR] 
2017-05-03\T\00:09:35.206 [ERROR] Re-run Maven using the -X switch to enable full debug logging.
2017-05-03\T\00:09:35.206 [ERROR] 
2017-05-03\T\00:09:35.206 [ERROR] For more information about the errors and possible solutions,
please read the following articles:
2017-05-03\T\00:09:35.206 [ERROR] [Help 1] http://cwiki.apache.org/confluence/display/MAVEN/MojoFailureException
2017-05-03\T\00:09:35.206 [ERROR] 
2017-05-03\T\00:09:35.206 [ERROR] After correcting the problems, you can resume the build
with the command
2017-05-03\T\00:09:35.206 [ERROR]   mvn <goals> -rf :beam-sdks-java-io-hadoop-file-system
Build step 'Invoke top-level Maven targets' marked build as failure

Mime
View raw message