beam-commits mailing list archives

Site index · List index
Message view « Date » · « Thread »
Top « Date » · « Thread »
From Apache Jenkins Server <jenk...@builds.apache.org>
Subject Build failed in Jenkins: beam_PostCommit_Java_MavenInstall #3603
Date Wed, 03 May 2017 00:41:05 GMT
See <https://builds.apache.org/job/beam_PostCommit_Java_MavenInstall/3603/display/redirect?page=changes>

Changes:

[robertwb] Deprecate <pipeline>.options usage

------------------------------------------
[...truncated 269.89 KB...]
2017-05-03T00:40:21.180 [INFO] Downloaded: https://repo.maven.apache.org/maven2/net/revelc/code/formatter/jsdt-core/2.0.1/jsdt-core-2.0.1.pom
(2 KB at 48.7 KB/sec)
2017-05-03T00:40:21.184 [INFO] Downloading: https://repo.maven.apache.org/maven2/org/apache/commons/commons-digester3/3.2/commons-digester3-3.2.pom
2017-05-03T00:40:21.212 [INFO] Downloaded: https://repo.maven.apache.org/maven2/org/apache/commons/commons-digester3/3.2/commons-digester3-3.2.pom
(18 KB at 613.5 KB/sec)
2017-05-03T00:40:21.217 [INFO] Downloading: https://repo.maven.apache.org/maven2/cglib/cglib/2.2.2/cglib-2.2.2.pom
2017-05-03T00:40:21.242 [INFO] Downloaded: https://repo.maven.apache.org/maven2/cglib/cglib/2.2.2/cglib-2.2.2.pom
(2 KB at 57.5 KB/sec)
2017-05-03T00:40:21.245 [INFO] Downloading: https://repo.maven.apache.org/maven2/asm/asm/3.3.1/asm-3.3.1.pom
2017-05-03T00:40:21.271 [INFO] Downloaded: https://repo.maven.apache.org/maven2/asm/asm/3.3.1/asm-3.3.1.pom
(266 B at 9.6 KB/sec)
2017-05-03T00:40:21.273 [INFO] Downloading: https://repo.maven.apache.org/maven2/asm/asm-parent/3.3.1/asm-parent-3.3.1.pom
2017-05-03T00:40:21.301 [INFO] Downloaded: https://repo.maven.apache.org/maven2/asm/asm-parent/3.3.1/asm-parent-3.3.1.pom
(5 KB at 151.1 KB/sec)
2017-05-03T00:40:21.303 [INFO] Downloading: https://repo.maven.apache.org/maven2/commons-beanutils/commons-beanutils/1.8.3/commons-beanutils-1.8.3.pom
2017-05-03T00:40:21.332 [INFO] Downloaded: https://repo.maven.apache.org/maven2/commons-beanutils/commons-beanutils/1.8.3/commons-beanutils-1.8.3.pom
(11 KB at 377.1 KB/sec)
2017-05-03T00:40:21.334 [INFO] Downloading: https://repo.maven.apache.org/maven2/org/apache/commons/commons-parent/14/commons-parent-14.pom
2017-05-03T00:40:21.363 [INFO] Downloaded: https://repo.maven.apache.org/maven2/org/apache/commons/commons-parent/14/commons-parent-14.pom
(31 KB at 1057.0 KB/sec)
2017-05-03T00:40:21.367 [INFO] Downloading: https://repo.maven.apache.org/maven2/org/apache/maven/plugin-tools/maven-plugin-annotations/3.5/maven-plugin-annotations-3.5.pom
2017-05-03T00:40:21.393 [INFO] Downloaded: https://repo.maven.apache.org/maven2/org/apache/maven/plugin-tools/maven-plugin-annotations/3.5/maven-plugin-annotations-3.5.pom
(2 KB at 62.7 KB/sec)
2017-05-03T00:40:21.394 [INFO] Downloading: https://repo.maven.apache.org/maven2/org/apache/maven/plugin-tools/maven-plugin-tools/3.5/maven-plugin-tools-3.5.pom
2017-05-03T00:40:21.422 [INFO] Downloaded: https://repo.maven.apache.org/maven2/org/apache/maven/plugin-tools/maven-plugin-tools/3.5/maven-plugin-tools-3.5.pom
(16 KB at 564.7 KB/sec)
2017-05-03T00:40:21.426 [INFO] Downloading: https://repo.maven.apache.org/maven2/org/codehaus/plexus/plexus-resources/1.0.1/plexus-resources-1.0.1.pom
2017-05-03T00:40:21.452 [INFO] Downloaded: https://repo.maven.apache.org/maven2/org/codehaus/plexus/plexus-resources/1.0.1/plexus-resources-1.0.1.pom
(2 KB at 49.5 KB/sec)
2017-05-03T00:40:21.455 [INFO] Downloading: https://repo.maven.apache.org/maven2/org/codehaus/plexus/plexus-utils/3.0.8/plexus-utils-3.0.8.pom
2017-05-03T00:40:21.482 [INFO] Downloaded: https://repo.maven.apache.org/maven2/org/codehaus/plexus/plexus-utils/3.0.8/plexus-utils-3.0.8.pom
(4 KB at 113.6 KB/sec)
2017-05-03T00:40:21.488 [INFO] Downloading: https://repo.maven.apache.org/maven2/com/google/guava/guava/20.0/guava-20.0.jar
2017-05-03T00:40:21.489 [INFO] Downloading: https://repo.maven.apache.org/maven2/net/revelc/code/formatter/jdt-core/2.0.1/jdt-core-2.0.1.jar
2017-05-03T00:40:21.489 [INFO] Downloading: https://repo.maven.apache.org/maven2/net/revelc/code/formatter/jsdt-core/2.0.1/jsdt-core-2.0.1.jar
2017-05-03T00:40:21.490 [INFO] Downloading: https://repo.maven.apache.org/maven2/org/apache/commons/commons-digester3/3.2/commons-digester3-3.2.jar
2017-05-03T00:40:21.490 [INFO] Downloading: https://repo.maven.apache.org/maven2/cglib/cglib/2.2.2/cglib-2.2.2.jar
2017-05-03T00:40:21.548 [INFO] Downloaded: https://repo.maven.apache.org/maven2/org/apache/commons/commons-digester3/3.2/commons-digester3-3.2.jar
(236 KB at 3999.2 KB/sec)
2017-05-03T00:40:21.549 [INFO] Downloading: https://repo.maven.apache.org/maven2/asm/asm/3.3.1/asm-3.3.1.jar
2017-05-03T00:40:21.612 [INFO] Downloaded: https://repo.maven.apache.org/maven2/cglib/cglib/2.2.2/cglib-2.2.2.jar
(281 KB at 2298.9 KB/sec)
2017-05-03T00:40:21.612 [INFO] Downloading: https://repo.maven.apache.org/maven2/commons-beanutils/commons-beanutils/1.8.3/commons-beanutils-1.8.3.jar
2017-05-03T00:40:21.677 [INFO] Downloaded: https://repo.maven.apache.org/maven2/asm/asm/3.3.1/asm-3.3.1.jar
(43 KB at 227.6 KB/sec)
2017-05-03T00:40:21.678 [INFO] Downloading: https://repo.maven.apache.org/maven2/org/apache/maven/plugin-tools/maven-plugin-annotations/3.5/maven-plugin-annotations-3.5.jar
2017-05-03T00:40:21.689 [INFO] Downloading: https://repo.maven.apache.org/maven2/org/codehaus/plexus/plexus-resources/1.0.1/plexus-resources-1.0.1.jar
2017-05-03T00:40:21.706 [INFO] Downloaded: https://repo.maven.apache.org/maven2/commons-beanutils/commons-beanutils/1.8.3/commons-beanutils-1.8.3.jar
(227 KB at 1049.0 KB/sec)
2017-05-03T00:40:21.711 [INFO] Downloaded: https://repo.maven.apache.org/maven2/org/apache/maven/plugin-tools/maven-plugin-annotations/3.5/maven-plugin-annotations-3.5.jar
(14 KB at 63.2 KB/sec)
2017-05-03T00:40:21.793 [INFO] Downloaded: https://repo.maven.apache.org/maven2/org/codehaus/plexus/plexus-resources/1.0.1/plexus-resources-1.0.1.jar
(22 KB at 70.5 KB/sec)
2017-05-03T00:40:21.836 [INFO] Downloaded: https://repo.maven.apache.org/maven2/com/google/guava/guava/20.0/guava-20.0.jar
(2386 KB at 6834.9 KB/sec)
2017-05-03T00:40:23.326 [INFO] Downloaded: https://repo.maven.apache.org/maven2/net/revelc/code/formatter/jsdt-core/2.0.1/jsdt-core-2.0.1.jar
(17934 KB at 9762.6 KB/sec)
[WARNING] Failed to getClass for net.revelc.code.formatter.FormatterMojo
[JENKINS] Archiving disabled
2017-05-03T00:40:23.946 [INFO]                                                           
             
2017-05-03T00:40:23.946 [INFO] ------------------------------------------------------------------------
2017-05-03T00:40:23.946 [INFO] Skipping Apache Beam :: Parent
2017-05-03T00:40:23.946 [INFO] This project has been banned from the build due to previous
failures.
2017-05-03T00:40:23.946 [INFO] ------------------------------------------------------------------------
[JENKINS] Archiving disabled
[JENKINS] Archiving disabled
[JENKINS] Archiving disabled
[JENKINS] Archiving disabled
[JENKINS] Archiving disabled
[JENKINS] Archiving disabled
[JENKINS] Archiving disabled
[JENKINS] Archiving disabled
[JENKINS] Archiving disabled
[JENKINS] Archiving disabled
[JENKINS] Archiving disabled
[JENKINS] Archiving disabled
[JENKINS] Archiving disabled
[JENKINS] Archiving disabled
[JENKINS] Archiving disabled
[JENKINS] Archiving disabled
[JENKINS] Archiving disabled
[JENKINS] Archiving disabled
[JENKINS] Archiving disabled
[JENKINS] Archiving disabled
[JENKINS] Archiving disabled
[JENKINS] Archiving disabled
[JENKINS] Archiving disabled
[JENKINS] Archiving disabled
[JENKINS] Archiving disabled
[JENKINS] Archiving disabled
[JENKINS] Archiving disabled
[JENKINS] Archiving disabled
[JENKINS] Archiving disabled
[JENKINS] Archiving disabled
[JENKINS] Archiving disabled
[JENKINS] Archiving disabled
[JENKINS] Archiving disabled
[JENKINS] Archiving disabled
[JENKINS] Archiving disabled
[JENKINS] Archiving disabled
[JENKINS] Archiving disabled
[JENKINS] Archiving disabled
[JENKINS] Archiving disabled
[JENKINS] Archiving disabled
[JENKINS] Archiving disabled
[JENKINS] Archiving disabled
[JENKINS] Archiving disabled
[JENKINS] Archiving disabled
[JENKINS] Archiving disabled
[JENKINS] Archiving disabled
2017-05-03T00:40:33.560 [INFO] ------------------------------------------------------------------------
2017-05-03T00:40:33.560 [INFO] Reactor Summary:
2017-05-03T00:40:33.560 [INFO] 
2017-05-03T00:40:33.560 [INFO] Apache Beam :: Parent .............................. SUCCESS
[ 32.529 s]
2017-05-03T00:40:33.560 [INFO] Apache Beam :: SDKs :: Java :: Build Tools ......... FAILURE
[  3.469 s]
2017-05-03T00:40:33.560 [INFO] Apache Beam :: SDKs ................................ SKIPPED
2017-05-03T00:40:33.560 [INFO] Apache Beam :: SDKs :: Common ...................... SKIPPED
2017-05-03T00:40:33.560 [INFO] Apache Beam :: SDKs :: Common :: Fn API ............ SKIPPED
2017-05-03T00:40:33.560 [INFO] Apache Beam :: SDKs :: Common :: Runner API ........ SKIPPED
2017-05-03T00:40:33.560 [INFO] Apache Beam :: SDKs :: Java ........................ SKIPPED
2017-05-03T00:40:33.560 [INFO] Apache Beam :: SDKs :: Java :: Core ................ SKIPPED
2017-05-03T00:40:33.560 [INFO] Apache Beam :: SDKs :: Java :: IO .................. SKIPPED
2017-05-03T00:40:33.560 [INFO] Apache Beam :: SDKs :: Java :: IO :: Common ........ SKIPPED
2017-05-03T00:40:33.560 [INFO] Apache Beam :: Runners ............................. SKIPPED
2017-05-03T00:40:33.560 [INFO] Apache Beam :: Runners :: Core Construction Java ... SKIPPED
2017-05-03T00:40:33.560 [INFO] Apache Beam :: Runners :: Core Java ................ SKIPPED
2017-05-03T00:40:33.560 [INFO] Apache Beam :: Runners :: Direct Java .............. SKIPPED
2017-05-03T00:40:33.560 [INFO] Apache Beam :: SDKs :: Java :: IO :: Elasticsearch . SKIPPED
2017-05-03T00:40:33.560 [INFO] Apache Beam :: SDKs :: Java :: Extensions .......... SKIPPED
2017-05-03T00:40:33.560 [INFO] Apache Beam :: SDKs :: Java :: Extensions :: Google Cloud Platform
Core SKIPPED
2017-05-03T00:40:33.561 [INFO] Apache Beam :: SDKs :: Java :: Extensions :: Protobuf SKIPPED
2017-05-03T00:40:33.561 [INFO] Apache Beam :: SDKs :: Java :: IO :: Google Cloud Platform
SKIPPED
2017-05-03T00:40:33.561 [INFO] Apache Beam :: SDKs :: Java :: IO :: Hadoop Common . SKIPPED
2017-05-03T00:40:33.561 [INFO] Apache Beam :: SDKs :: Java :: IO :: Hadoop File System SKIPPED
2017-05-03T00:40:33.561 [INFO] Apache Beam :: SDKs :: Java :: IO :: Hadoop ........ SKIPPED
2017-05-03T00:40:33.561 [INFO] Apache Beam :: SDKs :: Java :: IO :: Hadoop :: input-format
SKIPPED
2017-05-03T00:40:33.561 [INFO] Apache Beam :: Runners :: Google Cloud Dataflow .... SKIPPED
2017-05-03T00:40:33.561 [INFO] Apache Beam :: SDKs :: Java :: IO :: Hadoop :: jdk1.8-tests
SKIPPED
2017-05-03T00:40:33.561 [INFO] Apache Beam :: SDKs :: Java :: IO :: HBase ......... SKIPPED
2017-05-03T00:40:33.561 [INFO] Apache Beam :: SDKs :: Java :: IO :: JDBC .......... SKIPPED
2017-05-03T00:40:33.561 [INFO] Apache Beam :: SDKs :: Java :: IO :: JMS ........... SKIPPED
2017-05-03T00:40:33.561 [INFO] Apache Beam :: SDKs :: Java :: IO :: Kafka ......... SKIPPED
2017-05-03T00:40:33.561 [INFO] Apache Beam :: SDKs :: Java :: IO :: Kinesis ....... SKIPPED
2017-05-03T00:40:33.561 [INFO] Apache Beam :: SDKs :: Java :: IO :: MongoDB ....... SKIPPED
2017-05-03T00:40:33.561 [INFO] Apache Beam :: SDKs :: Java :: IO :: MQTT .......... SKIPPED
2017-05-03T00:40:33.561 [INFO] Apache Beam :: SDKs :: Java :: IO :: XML ........... SKIPPED
2017-05-03T00:40:33.561 [INFO] Apache Beam :: SDKs :: Java :: Maven Archetypes .... SKIPPED
2017-05-03T00:40:33.561 [INFO] Apache Beam :: SDKs :: Java :: Maven Archetypes :: Starter
SKIPPED
2017-05-03T00:40:33.561 [INFO] Apache Beam :: SDKs :: Java :: Maven Archetypes :: Examples
SKIPPED
2017-05-03T00:40:33.561 [INFO] Apache Beam :: SDKs :: Java :: Maven Archetypes :: Examples
- Java 8 SKIPPED
2017-05-03T00:40:33.561 [INFO] Apache Beam :: SDKs :: Java :: Extensions :: Jackson SKIPPED
2017-05-03T00:40:33.561 [INFO] Apache Beam :: SDKs :: Java :: Extensions :: Join library SKIPPED
2017-05-03T00:40:33.561 [INFO] Apache Beam :: SDKs :: Java :: Extensions :: Sorter  SKIPPED
2017-05-03T00:40:33.561 [INFO] Apache Beam :: SDKs :: Java :: Harness ............. SKIPPED
2017-05-03T00:40:33.561 [INFO] Apache Beam :: SDKs :: Java :: Java 8 Tests ........ SKIPPED
2017-05-03T00:40:33.561 [INFO] Apache Beam :: SDKs :: Python ...................... SKIPPED
2017-05-03T00:40:33.561 [INFO] Apache Beam :: Runners :: Flink .................... SKIPPED
2017-05-03T00:40:33.561 [INFO] Apache Beam :: Runners :: Spark .................... SKIPPED
2017-05-03T00:40:33.561 [INFO] Apache Beam :: Runners :: Apex ..................... SKIPPED
2017-05-03T00:40:33.561 [INFO] Apache Beam :: Examples ............................ SKIPPED
2017-05-03T00:40:33.561 [INFO] Apache Beam :: Examples :: Java .................... SKIPPED
2017-05-03T00:40:33.561 [INFO] Apache Beam :: Examples :: Java 8 .................. SKIPPED
2017-05-03T00:40:33.561 [INFO] Apache Beam :: SDKs :: Java :: Aggregated Javadoc .. SKIPPED
2017-05-03T00:40:33.561 [INFO] ------------------------------------------------------------------------
2017-05-03T00:40:33.561 [INFO] BUILD FAILURE
2017-05-03T00:40:33.561 [INFO] ------------------------------------------------------------------------
2017-05-03T00:40:33.561 [INFO] Total time: 56.254 s
2017-05-03T00:40:33.562 [INFO] Finished at: 2017-05-03T00:40:33+00:00
2017-05-03T00:40:34.012 [INFO] Final Memory: 65M/820M
2017-05-03T00:40:34.013 [INFO] ------------------------------------------------------------------------
Waiting for Jenkins to finish collecting data
2017-05-03T00:40:34.454 [ERROR] Failed to execute goal net.revelc.code.formatter:formatter-maven-plugin:2.0.1:format
(test-code-style) on project beam-sdks-java-build-tools: Execution test-code-style of goal
net.revelc.code.formatter:formatter-maven-plugin:2.0.1:format failed: Plugin net.revelc.code.formatter:formatter-maven-plugin:2.0.1
or one of its dependencies could not be resolved: Could not transfer artifact net.revelc.code.formatter:jdt-core:jar:2.0.1
from/to central (https://repo.maven.apache.org/maven2): GET request of: net/revelc/code/formatter/jdt-core/2.0.1/jdt-core-2.0.1.jar
from central failed: Connection reset -> [Help 1]
org.apache.maven.lifecycle.LifecycleExecutionException: Failed to execute goal net.revelc.code.formatter:formatter-maven-plugin:2.0.1:format
(test-code-style) on project beam-sdks-java-build-tools: Execution test-code-style of goal
net.revelc.code.formatter:formatter-maven-plugin:2.0.1:format failed: Plugin net.revelc.code.formatter:formatter-maven-plugin:2.0.1
or one of its dependencies could not be resolved: Could not transfer artifact net.revelc.code.formatter:jdt-core:jar:2.0.1
from/to central (https://repo.maven.apache.org/maven2): GET request of: net/revelc/code/formatter/jdt-core/2.0.1/jdt-core-2.0.1.jar
from central failed
	at org.apache.maven.lifecycle.internal.MojoExecutor.execute(MojoExecutor.java:224)
	at org.apache.maven.lifecycle.internal.MojoExecutor.execute(MojoExecutor.java:153)
	at org.apache.maven.lifecycle.internal.MojoExecutor.execute(MojoExecutor.java:145)
	at org.apache.maven.lifecycle.internal.LifecycleModuleBuilder.buildProject(LifecycleModuleBuilder.java:116)
	at org.apache.maven.lifecycle.internal.LifecycleModuleBuilder.buildProject(LifecycleModuleBuilder.java:80)
	at org.apache.maven.lifecycle.internal.builder.singlethreaded.SingleThreadedBuilder.build(SingleThreadedBuilder.java:51)
	at org.apache.maven.lifecycle.internal.LifecycleStarter.execute(LifecycleStarter.java:128)
	at org.apache.maven.DefaultMaven.doExecute(DefaultMaven.java:307)
	at org.apache.maven.DefaultMaven.doExecute(DefaultMaven.java:193)
	at org.apache.maven.DefaultMaven.execute(DefaultMaven.java:106)
	at org.jvnet.hudson.maven3.launcher.Maven33Launcher.main(Maven33Launcher.java:129)
	at sun.reflect.NativeMethodAccessorImpl.invoke0(Native Method)
	at sun.reflect.NativeMethodAccessorImpl.invoke(NativeMethodAccessorImpl.java:62)
	at sun.reflect.DelegatingMethodAccessorImpl.invoke(DelegatingMethodAccessorImpl.java:43)
	at java.lang.reflect.Method.invoke(Method.java:498)
	at org.codehaus.plexus.classworlds.launcher.Launcher.launchStandard(Launcher.java:330)
	at org.codehaus.plexus.classworlds.launcher.Launcher.launch(Launcher.java:238)
	at jenkins.maven3.agent.Maven33Main.launch(Maven33Main.java:176)
	at sun.reflect.NativeMethodAccessorImpl.invoke0(Native Method)
	at sun.reflect.NativeMethodAccessorImpl.invoke(NativeMethodAccessorImpl.java:62)
	at sun.reflect.DelegatingMethodAccessorImpl.invoke(DelegatingMethodAccessorImpl.java:43)
	at java.lang.reflect.Method.invoke(Method.java:498)
	at hudson.maven.Maven3Builder.call(Maven3Builder.java:139)
	at hudson.maven.Maven3Builder.call(Maven3Builder.java:70)
	at hudson.remoting.UserRequest.perform(UserRequest.java:153)
	at hudson.remoting.UserRequest.perform(UserRequest.java:50)
	at hudson.remoting.Request$2.run(Request.java:336)
	at hudson.remoting.InterceptingExecutorService$1.call(InterceptingExecutorService.java:68)
	at java.util.concurrent.FutureTask.run(FutureTask.java:266)
	at java.util.concurrent.ThreadPoolExecutor.runWorker(ThreadPoolExecutor.java:1142)
	at java.util.concurrent.ThreadPoolExecutor$Worker.run(ThreadPoolExecutor.java:617)
	at java.lang.Thread.run(Thread.java:745)
Caused by: org.apache.maven.plugin.PluginExecutionException: Execution test-code-style of
goal net.revelc.code.formatter:formatter-maven-plugin:2.0.1:format failed: Plugin net.revelc.code.formatter:formatter-maven-plugin:2.0.1
or one of its dependencies could not be resolved: Could not transfer artifact net.revelc.code.formatter:jdt-core:jar:2.0.1
from/to central (https://repo.maven.apache.org/maven2): GET request of: net/revelc/code/formatter/jdt-core/2.0.1/jdt-core-2.0.1.jar
from central failed
	at org.apache.maven.plugin.DefaultBuildPluginManager.executeMojo(DefaultBuildPluginManager.java:106)
	at org.apache.maven.lifecycle.internal.MojoExecutor.execute(MojoExecutor.java:208)
	... 31 more
Caused by: org.apache.maven.plugin.PluginResolutionException: Plugin net.revelc.code.formatter:formatter-maven-plugin:2.0.1
or one of its dependencies could not be resolved: Could not transfer artifact net.revelc.code.formatter:jdt-core:jar:2.0.1
from/to central (https://repo.maven.apache.org/maven2): GET request of: net/revelc/code/formatter/jdt-core/2.0.1/jdt-core-2.0.1.jar
from central failed
	at org.apache.maven.plugin.internal.DefaultPluginDependenciesResolver.resolveInternal(DefaultPluginDependenciesResolver.java:218)
	at org.apache.maven.plugin.internal.DefaultPluginDependenciesResolver.resolve(DefaultPluginDependenciesResolver.java:149)
	at org.apache.maven.plugin.internal.DefaultMavenPluginManager.createPluginRealm(DefaultMavenPluginManager.java:422)
	at org.apache.maven.plugin.internal.DefaultMavenPluginManager.setupPluginRealm(DefaultMavenPluginManager.java:385)
	at org.apache.maven.plugin.DefaultBuildPluginManager.getPluginRealm(DefaultBuildPluginManager.java:231)
	at org.apache.maven.plugin.DefaultBuildPluginManager.executeMojo(DefaultBuildPluginManager.java:102)
	... 32 more
Caused by: org.eclipse.aether.resolution.ArtifactResolutionException: Could not transfer artifact
net.revelc.code.formatter:jdt-core:jar:2.0.1 from/to central (https://repo.maven.apache.org/maven2):
GET request of: net/revelc/code/formatter/jdt-core/2.0.1/jdt-core-2.0.1.jar from central failed
	at org.eclipse.aether.internal.impl.DefaultArtifactResolver.resolve(DefaultArtifactResolver.java:444)
	at org.eclipse.aether.internal.impl.DefaultArtifactResolver.resolveArtifacts(DefaultArtifactResolver.java:246)
	at org.eclipse.aether.internal.impl.DefaultRepositorySystem.resolveDependencies(DefaultRepositorySystem.java:367)
	at org.apache.maven.plugin.internal.DefaultPluginDependenciesResolver.resolveInternal(DefaultPluginDependenciesResolver.java:210)
	... 37 more
Caused by: org.eclipse.aether.transfer.ArtifactTransferException: Could not transfer artifact
net.revelc.code.formatter:jdt-core:jar:2.0.1 from/to central (https://repo.maven.apache.org/maven2):
GET request of: net/revelc/code/formatter/jdt-core/2.0.1/jdt-core-2.0.1.jar from central failed
	at org.eclipse.aether.connector.basic.ArtifactTransportListener.transferFailed(ArtifactTransportListener.java:43)
	at org.eclipse.aether.connector.basic.BasicRepositoryConnector$TaskRunner.run(BasicRepositoryConnector.java:355)
	at org.eclipse.aether.util.concurrency.RunnableErrorForwarder$1.run(RunnableErrorForwarder.java:67)
	... 3 more
Caused by: org.apache.maven.wagon.TransferFailedException: GET request of: net/revelc/code/formatter/jdt-core/2.0.1/jdt-core-2.0.1.jar
from central failed
	at org.apache.maven.wagon.AbstractWagon.getTransfer(AbstractWagon.java:363)
	at org.apache.maven.wagon.AbstractWagon.getTransfer(AbstractWagon.java:316)
	at org.apache.maven.wagon.AbstractWagon.getTransfer(AbstractWagon.java:285)
	at org.apache.maven.wagon.StreamWagon.getIfNewer(StreamWagon.java:97)
	at org.apache.maven.wagon.StreamWagon.get(StreamWagon.java:61)
	at org.eclipse.aether.transport.wagon.WagonTransporter$GetTaskRunner.run(WagonTransporter.java:560)
	at org.eclipse.aether.transport.wagon.WagonTransporter.execute(WagonTransporter.java:427)
	at org.eclipse.aether.transport.wagon.WagonTransporter.get(WagonTransporter.java:404)
	at org.eclipse.aether.connector.basic.BasicRepositoryConnector$GetTaskRunner.runTask(BasicRepositoryConnector.java:447)
	at org.eclipse.aether.connector.basic.BasicRepositoryConnector$TaskRunner.run(BasicRepositoryConnector.java:350)
	... 4 more
Caused by: java.net.SocketException: Connection reset
	at java.net.SocketInputStream.read(SocketInputStream.java:210)
	at java.net.SocketInputStream.read(SocketInputStream.java:141)
	at sun.security.ssl.InputRecord.readFully(InputRecord.java:465)
	at sun.security.ssl.InputRecord.readV3Record(InputRecord.java:593)
	at sun.security.ssl.InputRecord.read(InputRecord.java:532)
	at sun.security.ssl.SSLSocketImpl.readRecord(SSLSocketImpl.java:973)
	at sun.security.ssl.SSLSocketImpl.readDataRecord(SSLSocketImpl.java:930)
	at sun.security.ssl.AppInputStream.read(AppInputStream.java:105)
	at org.apache.maven.wagon.providers.http.httpclient.impl.io.SessionInputBufferImpl.streamRead(SessionInputBufferImpl.java:136)
	at org.apache.maven.wagon.providers.http.httpclient.impl.io.SessionInputBufferImpl.read(SessionInputBufferImpl.java:195)
	at org.apache.maven.wagon.providers.http.httpclient.impl.io.ContentLengthInputStream.read(ContentLengthInputStream.java:178)
	at org.apache.maven.wagon.providers.http.httpclient.conn.EofSensorInputStream.read(EofSensorInputStream.java:137)
	at org.apache.maven.wagon.AbstractWagon.transfer(AbstractWagon.java:531)
	at org.apache.maven.wagon.AbstractWagon.getTransfer(AbstractWagon.java:353)
	... 13 more
2017-05-03T00:40:34.457 [ERROR] 
2017-05-03T00:40:34.457 [ERROR] Re-run Maven using the -X switch to enable full debug logging.
2017-05-03T00:40:34.457 [ERROR] 
2017-05-03T00:40:34.457 [ERROR] For more information about the errors and possible solutions,
please read the following articles:
2017-05-03T00:40:34.457 [ERROR] [Help 1] http://cwiki.apache.org/confluence/display/MAVEN/PluginResolutionException
2017-05-03T00:40:34.457 [ERROR] 
2017-05-03T00:40:34.457 [ERROR] After correcting the problems, you can resume the build with
the command
2017-05-03T00:40:34.457 [ERROR]   mvn <goals> -rf :beam-sdks-java-build-tools
channel stopped
Not sending mail to unregistered user kirpichov@google.com
Not sending mail to unregistered user wtanaka@yahoo.com
Not sending mail to unregistered user klk@google.com

Mime
View raw message