beam-commits mailing list archives

Site index · List index
Message view « Date » · « Thread »
Top « Date » · « Thread »
From Apache Jenkins Server <jenk...@builds.apache.org>
Subject Build failed in Jenkins: beam_PostCommit_Java_MavenInstall #3937
Date Fri, 26 May 2017 21:23:33 GMT
See <https://builds.apache.org/job/beam_PostCommit_Java_MavenInstall/3937/display/redirect?page=changes>

Changes:

[dhalperi] [BEAM-1542] SpannerIO sink updates

------------------------------------------
[...truncated 1.11 MB...]
	at io.netty.util.concurrent.SingleThreadEventExecutor.runAllTasks(SingleThreadEventExecutor.java:418)
	at io.netty.channel.nio.NioEventLoop.run(NioEventLoop.java:440)
	at io.netty.util.concurrent.SingleThreadEventExecutor$5.run(SingleThreadEventExecutor.java:873)
	at java.lang.Thread.run(Thread.java:745)

2017-05-26T21:21:59.393 [ERROR] org.apache.beam.sdk.io.hadoop.inputformat.HIFIOWithElasticTest
 Time elapsed: 0.008 s  <<< ERROR!
[beamdb] IndexNotFoundException[no such index]
	at org.elasticsearch.cluster.metadata.IndexNameExpressionResolver$WildcardExpressionResolver.infe(IndexNameExpressionResolver.java:661)
	at org.elasticsearch.cluster.metadata.IndexNameExpressionResolver$WildcardExpressionResolver.innerResolve(IndexNameExpressionResolver.java:618)
	at org.elasticsearch.cluster.metadata.IndexNameExpressionResolver$WildcardExpressionResolver.resolve(IndexNameExpressionResolver.java:568)
	at org.elasticsearch.cluster.metadata.IndexNameExpressionResolver.concreteIndices(IndexNameExpressionResolver.java:165)
	at org.elasticsearch.cluster.metadata.IndexNameExpressionResolver.concreteIndexNames(IndexNameExpressionResolver.java:140)
	at org.elasticsearch.cluster.metadata.IndexNameExpressionResolver.concreteIndexNames(IndexNameExpressionResolver.java:73)
	at org.elasticsearch.action.admin.indices.delete.TransportDeleteIndexAction.checkBlock(TransportDeleteIndexAction.java:81)
	at org.elasticsearch.action.admin.indices.delete.TransportDeleteIndexAction.checkBlock(TransportDeleteIndexAction.java:49)
	at org.elasticsearch.action.support.master.TransportMasterNodeAction$AsyncSingleAction.doStart(TransportMasterNodeAction.java:140)
	at org.elasticsearch.action.support.master.TransportMasterNodeAction$AsyncSingleAction.start(TransportMasterNodeAction.java:132)
	at org.elasticsearch.action.support.master.TransportMasterNodeAction.doExecute(TransportMasterNodeAction.java:103)
	at org.elasticsearch.action.admin.indices.delete.TransportDeleteIndexAction.doExecute(TransportDeleteIndexAction.java:76)
	at org.elasticsearch.action.admin.indices.delete.TransportDeleteIndexAction.doExecute(TransportDeleteIndexAction.java:49)
	at org.elasticsearch.action.support.TransportAction$RequestFilterChain.proceed(TransportAction.java:182)
	at org.elasticsearch.action.ingest.IngestActionFilter.apply(IngestActionFilter.java:82)
	at org.elasticsearch.action.support.TransportAction$RequestFilterChain.proceed(TransportAction.java:180)
	at org.elasticsearch.action.support.TransportAction.execute(TransportAction.java:153)
	at org.elasticsearch.action.support.TransportAction.execute(TransportAction.java:87)
	at org.elasticsearch.client.node.NodeClient.executeLocally(NodeClient.java:75)
	at org.elasticsearch.client.node.NodeClient.doExecute(NodeClient.java:64)
	at org.elasticsearch.client.support.AbstractClient.execute(AbstractClient.java:403)
	at org.elasticsearch.client.support.AbstractClient.execute(AbstractClient.java:392)
	at org.elasticsearch.client.support.AbstractClient$IndicesAdmin.execute(AbstractClient.java:1215)
	at org.elasticsearch.client.support.AbstractClient$IndicesAdmin.delete(AbstractClient.java:1357)
	at org.apache.beam.sdk.io.hadoop.inputformat.HIFIOWithElasticTest$ElasticEmbeddedServer.shutdown(HIFIOWithElasticTest.java:245)
	at org.apache.beam.sdk.io.hadoop.inputformat.HIFIOWithElasticTest.shutdownServer(HIFIOWithElasticTest.java:197)
	at sun.reflect.NativeMethodAccessorImpl.invoke0(Native Method)
	at sun.reflect.NativeMethodAccessorImpl.invoke(NativeMethodAccessorImpl.java:62)
	at sun.reflect.DelegatingMethodAccessorImpl.invoke(DelegatingMethodAccessorImpl.java:43)
	at java.lang.reflect.Method.invoke(Method.java:498)
	at org.junit.runners.model.FrameworkMethod$1.runReflectiveCall(FrameworkMethod.java:50)
	at org.junit.internal.runners.model.ReflectiveCallable.run(ReflectiveCallable.java:12)
	at org.junit.runners.model.FrameworkMethod.invokeExplosively(FrameworkMethod.java:47)
	at org.junit.internal.runners.statements.RunAfters.evaluate(RunAfters.java:33)
	at org.junit.rules.ExternalResource$1.evaluate(ExternalResource.java:48)
	at org.junit.rules.RunRules.evaluate(RunRules.java:20)
	at org.junit.runners.ParentRunner.run(ParentRunner.java:363)
	at org.junit.runners.Suite.runChild(Suite.java:128)
	at org.junit.runners.Suite.runChild(Suite.java:27)
	at org.junit.runners.ParentRunner$3.run(ParentRunner.java:290)
	at org.junit.runners.ParentRunner$1.schedule(ParentRunner.java:71)
	at org.junit.runners.ParentRunner.runChildren(ParentRunner.java:288)
	at org.junit.runners.ParentRunner.access$000(ParentRunner.java:58)
	at org.junit.runners.ParentRunner$2.evaluate(ParentRunner.java:268)
	at org.junit.runners.ParentRunner.run(ParentRunner.java:363)
	at org.apache.maven.surefire.junitcore.JUnitCore.run(JUnitCore.java:55)
	at org.apache.maven.surefire.junitcore.JUnitCoreWrapper.createRequestAndRun(JUnitCoreWrapper.java:137)
	at org.apache.maven.surefire.junitcore.JUnitCoreWrapper.executeEager(JUnitCoreWrapper.java:107)
	at org.apache.maven.surefire.junitcore.JUnitCoreWrapper.execute(JUnitCoreWrapper.java:83)
	at org.apache.maven.surefire.junitcore.JUnitCoreWrapper.execute(JUnitCoreWrapper.java:75)
	at org.apache.maven.surefire.junitcore.JUnitCoreProvider.invoke(JUnitCoreProvider.java:157)
	at org.apache.maven.surefire.booter.ForkedBooter.invokeProviderInSameClassLoader(ForkedBooter.java:386)
	at org.apache.maven.surefire.booter.ForkedBooter.runSuitesInProcess(ForkedBooter.java:323)
	at org.apache.maven.surefire.booter.ForkedBooter.main(ForkedBooter.java:143)

2017-05-26T21:21:59.393 [INFO] Running org.apache.beam.sdk.io.hadoop.inputformat.HIFIOWithEmbeddedCassandraTest
2017-05-26T21:22:14.052 [INFO] Tests run: 2, Failures: 0, Errors: 0, Skipped: 0, Time elapsed:
14.658 s - in org.apache.beam.sdk.io.hadoop.inputformat.HIFIOWithEmbeddedCassandraTest
2017-05-26T21:22:16.573 [INFO] 
2017-05-26T21:22:16.573 [INFO] Results:
2017-05-26T21:22:16.573 [INFO] 
2017-05-26T21:22:16.573 [ERROR] Errors: 
2017-05-26T21:22:16.573 [ERROR] org.apache.beam.sdk.io.hadoop.inputformat.HIFIOWithElasticTest.org.apache.beam.sdk.io.hadoop.inputformat.HIFIOWithElasticTest
2017-05-26T21:22:16.574 [ERROR]   Run 1: HIFIOWithElasticTest.startServer:97 » BindHttp Failed
to bind to [9200]
2017-05-26T21:22:16.574 [ERROR]   Run 2: HIFIOWithElasticTest.shutdownServer:197 » IndexNotFound
no such index
2017-05-26T21:22:16.574 [INFO] 
2017-05-26T21:22:16.574 [INFO] 
2017-05-26T21:22:16.574 [ERROR] Tests run: 3, Failures: 0, Errors: 1, Skipped: 0
2017-05-26T21:22:16.574 [INFO] 
2017-05-26T21:22:16.576 [INFO]                                                           
             
2017-05-26T21:22:16.576 [INFO] ------------------------------------------------------------------------
2017-05-26T21:22:16.576 [INFO] Skipping Apache Beam :: Parent
2017-05-26T21:22:16.576 [INFO] This project has been banned from the build due to previous
failures.
2017-05-26T21:22:16.576 [INFO] ------------------------------------------------------------------------
[JENKINS] Archiving disabled
[JENKINS] Archiving disabled
[JENKINS] Archiving disabled
[JENKINS] Archiving disabled
[JENKINS] Archiving disabled
[JENKINS] Archiving disabled
[JENKINS] Archiving disabled
[JENKINS] Archiving disabled
[JENKINS] Archiving disabled
[JENKINS] Archiving disabled
[JENKINS] Archiving disabled
[JENKINS] Archiving disabled
[JENKINS] Archiving disabled
[JENKINS] Archiving disabled
[JENKINS] Archiving disabled
[JENKINS] Archiving disabled
[JENKINS] Archiving disabled
[JENKINS] Archiving disabled
[JENKINS] Archiving disabled
[JENKINS] Archiving disabled
[JENKINS] Archiving disabled
[JENKINS] Archiving disabled
[JENKINS] Archiving disabled
[JENKINS] Archiving disabled
[JENKINS] Archiving disabled
[JENKINS] Archiving disabled
[JENKINS] Archiving disabled
[JENKINS] Archiving disabled
[JENKINS] Archiving disabled
[JENKINS] Archiving disabled
[JENKINS] Archiving disabled
[JENKINS] Archiving disabled
[JENKINS] Archiving disabled
[JENKINS] Archiving disabled
[JENKINS] Archiving disabled
[JENKINS] Archiving disabled
[JENKINS] Archiving disabled
[JENKINS] Archiving disabled
[JENKINS] Archiving disabled
[JENKINS] Archiving disabled
[JENKINS] Archiving disabled
[JENKINS] Archiving disabled
[JENKINS] Archiving disabled
[JENKINS] Archiving disabled
[JENKINS] Archiving disabled
[JENKINS] Archiving disabled
2017-05-26T21:22:34.680 [INFO] ------------------------------------------------------------------------
2017-05-26T21:22:34.680 [INFO] Reactor Summary:
2017-05-26T21:22:34.680 [INFO] 
2017-05-26T21:22:34.680 [INFO] Apache Beam :: Parent .............................. SUCCESS
[ 32.318 s]
2017-05-26T21:22:34.680 [INFO] Apache Beam :: SDKs :: Java :: Build Tools ......... SUCCESS
[ 16.018 s]
2017-05-26T21:22:34.680 [INFO] Apache Beam :: SDKs ................................ SUCCESS
[ 13.653 s]
2017-05-26T21:22:34.680 [INFO] Apache Beam :: SDKs :: Common ...................... SUCCESS
[ 17.963 s]
2017-05-26T21:22:34.680 [INFO] Apache Beam :: SDKs :: Common :: Fn API ............ SUCCESS
[ 31.158 s]
2017-05-26T21:22:34.680 [INFO] Apache Beam :: SDKs :: Common :: Runner API ........ SUCCESS
[ 19.401 s]
2017-05-26T21:22:34.680 [INFO] Apache Beam :: SDKs :: Java ........................ SUCCESS
[ 12.084 s]
2017-05-26T21:22:34.680 [INFO] Apache Beam :: SDKs :: Java :: Core ................ SUCCESS
[02:40 min]
2017-05-26T21:22:34.680 [INFO] Apache Beam :: SDKs :: Java :: IO .................. SUCCESS
[  5.039 s]
2017-05-26T21:22:34.680 [INFO] Apache Beam :: SDKs :: Java :: IO :: Common ........ SUCCESS
[  9.099 s]
2017-05-26T21:22:34.680 [INFO] Apache Beam :: Runners ............................. SUCCESS
[  3.747 s]
2017-05-26T21:22:34.680 [INFO] Apache Beam :: Runners :: Core Construction Java ... SUCCESS
[ 33.240 s]
2017-05-26T21:22:34.680 [INFO] Apache Beam :: Runners :: Core Java ................ SUCCESS
[ 58.070 s]
2017-05-26T21:22:34.680 [INFO] Apache Beam :: Runners :: Direct Java .............. SUCCESS
[03:54 min]
2017-05-26T21:22:34.680 [INFO] Apache Beam :: SDKs :: Java :: IO :: Elasticsearch . SUCCESS
[ 47.859 s]
2017-05-26T21:22:34.681 [INFO] Apache Beam :: SDKs :: Java :: Extensions .......... SUCCESS
[  2.404 s]
2017-05-26T21:22:34.681 [INFO] Apache Beam :: SDKs :: Java :: Extensions :: Google Cloud Platform
Core SUCCESS [ 44.414 s]
2017-05-26T21:22:34.681 [INFO] Apache Beam :: SDKs :: Java :: Extensions :: Protobuf SUCCESS
[ 31.736 s]
2017-05-26T21:22:34.681 [INFO] Apache Beam :: SDKs :: Java :: IO :: Google Cloud Platform
SUCCESS [03:41 min]
2017-05-26T21:22:34.681 [INFO] Apache Beam :: SDKs :: Java :: IO :: Hadoop Common . SUCCESS
[ 28.999 s]
2017-05-26T21:22:34.681 [INFO] Apache Beam :: SDKs :: Java :: IO :: Hadoop File System SUCCESS
[ 40.761 s]
2017-05-26T21:22:34.681 [INFO] Apache Beam :: SDKs :: Java :: IO :: Hadoop ........ SUCCESS
[  5.114 s]
2017-05-26T21:22:34.681 [INFO] Apache Beam :: SDKs :: Java :: IO :: Hadoop :: input-format
SUCCESS [ 34.963 s]
2017-05-26T21:22:34.681 [INFO] Apache Beam :: Runners :: Google Cloud Dataflow .... SUCCESS
[08:04 min]
2017-05-26T21:22:34.681 [INFO] Apache Beam :: SDKs :: Java :: IO :: Hadoop :: jdk1.8-tests
FAILURE [01:50 min]
2017-05-26T21:22:34.681 [INFO] Apache Beam :: SDKs :: Java :: IO :: HBase ......... SKIPPED
2017-05-26T21:22:34.681 [INFO] Apache Beam :: SDKs :: Java :: IO :: JDBC .......... SKIPPED
2017-05-26T21:22:34.681 [INFO] Apache Beam :: SDKs :: Java :: IO :: JMS ........... SKIPPED
2017-05-26T21:22:34.681 [INFO] Apache Beam :: SDKs :: Java :: IO :: Kafka ......... SKIPPED
2017-05-26T21:22:34.681 [INFO] Apache Beam :: SDKs :: Java :: IO :: Kinesis ....... SKIPPED
2017-05-26T21:22:34.681 [INFO] Apache Beam :: SDKs :: Java :: IO :: MongoDB ....... SKIPPED
2017-05-26T21:22:34.681 [INFO] Apache Beam :: SDKs :: Java :: IO :: MQTT .......... SKIPPED
2017-05-26T21:22:34.681 [INFO] Apache Beam :: SDKs :: Java :: IO :: XML ........... SKIPPED
2017-05-26T21:22:34.681 [INFO] Apache Beam :: SDKs :: Java :: Maven Archetypes .... SKIPPED
2017-05-26T21:22:34.681 [INFO] Apache Beam :: SDKs :: Java :: Maven Archetypes :: Starter
SKIPPED
2017-05-26T21:22:34.681 [INFO] Apache Beam :: Examples ............................ SKIPPED
2017-05-26T21:22:34.681 [INFO] Apache Beam :: Examples :: Java .................... SKIPPED
2017-05-26T21:22:34.681 [INFO] Apache Beam :: SDKs :: Java :: Maven Archetypes :: Examples
SKIPPED
2017-05-26T21:22:34.681 [INFO] Apache Beam :: Examples :: Java 8 .................. SKIPPED
2017-05-26T21:22:34.681 [INFO] Apache Beam :: SDKs :: Java :: Maven Archetypes :: Examples
- Java 8 SKIPPED
2017-05-26T21:22:34.681 [INFO] Apache Beam :: SDKs :: Java :: Extensions :: Jackson SKIPPED
2017-05-26T21:22:34.681 [INFO] Apache Beam :: SDKs :: Java :: Extensions :: Join library SKIPPED
2017-05-26T21:22:34.681 [INFO] Apache Beam :: SDKs :: Java :: Extensions :: Sorter  SKIPPED
2017-05-26T21:22:34.681 [INFO] Apache Beam :: SDKs :: Java :: Harness ............. SKIPPED
2017-05-26T21:22:34.681 [INFO] Apache Beam :: SDKs :: Java :: Java 8 Tests ........ SKIPPED
2017-05-26T21:22:34.681 [INFO] Apache Beam :: SDKs :: Python ...................... SKIPPED
2017-05-26T21:22:34.681 [INFO] Apache Beam :: Runners :: Flink .................... SKIPPED
2017-05-26T21:22:34.681 [INFO] Apache Beam :: Runners :: Spark .................... SKIPPED
2017-05-26T21:22:34.681 [INFO] Apache Beam :: Runners :: Apex ..................... SKIPPED
2017-05-26T21:22:34.681 [INFO] Apache Beam :: SDKs :: Java :: Aggregated Javadoc .. SKIPPED
2017-05-26T21:22:34.681 [INFO] ------------------------------------------------------------------------
2017-05-26T21:22:34.681 [INFO] BUILD FAILURE
2017-05-26T21:22:34.681 [INFO] ------------------------------------------------------------------------
2017-05-26T21:22:34.681 [INFO] Total time: 31:02 min
2017-05-26T21:22:34.681 [INFO] Finished at: 2017-05-26T21:22:34+00:00
2017-05-26T21:22:35.326 [INFO] Final Memory: 211M/2095M
2017-05-26T21:22:35.326 [INFO] ------------------------------------------------------------------------
Waiting for Jenkins to finish collecting data
2017-05-26T21:23:18.808 [ERROR] Failed to execute goal org.apache.maven.plugins:maven-surefire-plugin:2.20:test
(default-test) on project beam-sdks-java-io-hadoop-jdk1.8-tests: There are test failures.
2017-05-26T21:23:18.808 [ERROR] 
2017-05-26T21:23:18.808 [ERROR] Please refer to <https://builds.apache.org/job/beam_PostCommit_Java_MavenInstall/ws/sdks/java/io/hadoop/jdk1.8-tests/target/surefire-reports>
for the individual test results.
2017-05-26T21:23:18.808 [ERROR] Please refer to dump files (if any exist) [date]-jvmRun[N].dump,
[date].dumpstream and [date]-jvmRun[N].dumpstream.
2017-05-26T21:23:18.808 [ERROR] -> [Help 1]
org.apache.maven.lifecycle.LifecycleExecutionException: Failed to execute goal org.apache.maven.plugins:maven-surefire-plugin:2.20:test
(default-test) on project beam-sdks-java-io-hadoop-jdk1.8-tests: There are test failures.

Please refer to <https://builds.apache.org/job/beam_PostCommit_Java_MavenInstall/ws/sdks/java/io/hadoop/jdk1.8-tests/target/surefire-reports>
for the individual test results.
Please refer to dump files (if any exist) [date]-jvmRun[N].dump, [date].dumpstream and [date]-jvmRun[N].dumpstream.
	at org.apache.maven.lifecycle.internal.MojoExecutor.execute(MojoExecutor.java:212)
	at org.apache.maven.lifecycle.internal.MojoExecutor.execute(MojoExecutor.java:153)
	at org.apache.maven.lifecycle.internal.MojoExecutor.execute(MojoExecutor.java:145)
	at org.apache.maven.lifecycle.internal.LifecycleModuleBuilder.buildProject(LifecycleModuleBuilder.java:116)
	at org.apache.maven.lifecycle.internal.LifecycleModuleBuilder.buildProject(LifecycleModuleBuilder.java:80)
	at org.apache.maven.lifecycle.internal.builder.singlethreaded.SingleThreadedBuilder.build(SingleThreadedBuilder.java:51)
	at org.apache.maven.lifecycle.internal.LifecycleStarter.execute(LifecycleStarter.java:128)
	at org.apache.maven.DefaultMaven.doExecute(DefaultMaven.java:307)
	at org.apache.maven.DefaultMaven.doExecute(DefaultMaven.java:193)
	at org.apache.maven.DefaultMaven.execute(DefaultMaven.java:106)
	at org.jvnet.hudson.maven3.launcher.Maven33Launcher.main(Maven33Launcher.java:129)
	at sun.reflect.NativeMethodAccessorImpl.invoke0(Native Method)
	at sun.reflect.NativeMethodAccessorImpl.invoke(NativeMethodAccessorImpl.java:62)
	at sun.reflect.DelegatingMethodAccessorImpl.invoke(DelegatingMethodAccessorImpl.java:43)
	at java.lang.reflect.Method.invoke(Method.java:498)
	at org.codehaus.plexus.classworlds.launcher.Launcher.launchStandard(Launcher.java:330)
	at org.codehaus.plexus.classworlds.launcher.Launcher.launch(Launcher.java:238)
	at jenkins.maven3.agent.Maven33Main.launch(Maven33Main.java:176)
	at sun.reflect.NativeMethodAccessorImpl.invoke0(Native Method)
	at sun.reflect.NativeMethodAccessorImpl.invoke(NativeMethodAccessorImpl.java:62)
	at sun.reflect.DelegatingMethodAccessorImpl.invoke(DelegatingMethodAccessorImpl.java:43)
	at java.lang.reflect.Method.invoke(Method.java:498)
	at hudson.maven.Maven3Builder.call(Maven3Builder.java:139)
	at hudson.maven.Maven3Builder.call(Maven3Builder.java:70)
	at hudson.remoting.UserRequest.perform(UserRequest.java:153)
	at hudson.remoting.UserRequest.perform(UserRequest.java:50)
	at hudson.remoting.Request$2.run(Request.java:336)
	at hudson.remoting.InterceptingExecutorService$1.call(InterceptingExecutorService.java:68)
	at java.util.concurrent.FutureTask.run(FutureTask.java:266)
	at java.util.concurrent.ThreadPoolExecutor.runWorker(ThreadPoolExecutor.java:1142)
	at java.util.concurrent.ThreadPoolExecutor$Worker.run(ThreadPoolExecutor.java:617)
	at java.lang.Thread.run(Thread.java:745)
Caused by: org.apache.maven.plugin.MojoFailureException: There are test failures.

Please refer to <https://builds.apache.org/job/beam_PostCommit_Java_MavenInstall/ws/sdks/java/io/hadoop/jdk1.8-tests/target/surefire-reports>
for the individual test results.
Please refer to dump files (if any exist) [date]-jvmRun[N].dump, [date].dumpstream and [date]-jvmRun[N].dumpstream.
	at org.apache.maven.plugin.surefire.SurefireHelper.throwException(SurefireHelper.java:204)
	at org.apache.maven.plugin.surefire.SurefireHelper.reportExecution(SurefireHelper.java:98)
	at org.apache.maven.plugin.surefire.SurefirePlugin.handleSummary(SurefirePlugin.java:334)
	at org.apache.maven.plugin.surefire.AbstractSurefireMojo.executeAfterPreconditionsChecked(AbstractSurefireMojo.java:937)
	at org.apache.maven.plugin.surefire.AbstractSurefireMojo.execute(AbstractSurefireMojo.java:785)
	at org.apache.maven.plugin.DefaultBuildPluginManager.executeMojo(DefaultBuildPluginManager.java:134)
	at org.apache.maven.lifecycle.internal.MojoExecutor.execute(MojoExecutor.java:208)
	... 31 more
2017-05-26T21:23:18.809 [ERROR] 
2017-05-26T21:23:18.809 [ERROR] Re-run Maven using the -X switch to enable full debug logging.
2017-05-26T21:23:18.809 [ERROR] 
2017-05-26T21:23:18.809 [ERROR] For more information about the errors and possible solutions,
please read the following articles:
2017-05-26T21:23:18.809 [ERROR] [Help 1] http://cwiki.apache.org/confluence/display/MAVEN/MojoFailureException
2017-05-26T21:23:18.809 [ERROR] 
2017-05-26T21:23:18.810 [ERROR] After correcting the problems, you can resume the build with
the command
2017-05-26T21:23:18.810 [ERROR]   mvn <goals> -rf :beam-sdks-java-io-hadoop-jdk1.8-tests
channel stopped

Mime
View raw message