beam-commits mailing list archives

Site index · List index
Message view « Date » · « Thread »
Top « Date » · « Thread »
From Apache Jenkins Server <jenk...@builds.apache.org>
Subject Build failed in Jenkins: beam_PostCommit_Java_ValidatesRunner_Apex #1559
Date Thu, 25 May 2017 06:03:06 GMT
See <https://builds.apache.org/job/beam_PostCommit_Java_ValidatesRunner_Apex/1559/display/redirect>

------------------------------------------
Started by timer
[EnvInject] - Loading node environment variables.
Building remotely on beam1 (beam) in workspace <https://builds.apache.org/job/beam_PostCommit_Java_ValidatesRunner_Apex/ws/>
 > git rev-parse --is-inside-work-tree # timeout=10
Fetching changes from the remote Git repository
 > git config remote.origin.url https://github.com/apache/beam.git # timeout=10
Fetching upstream changes from https://github.com/apache/beam.git
 > git --version # timeout=10
 > git fetch --tags --progress https://github.com/apache/beam.git +refs/heads/*:refs/remotes/origin/*
+refs/pull/*:refs/remotes/origin/pr/*
 > git rev-parse origin/master^{commit} # timeout=10
Checking out Revision c0d19f9f7cccb222819dba26be52d85262f3f18f (origin/master)
 > git config core.sparsecheckout # timeout=10
 > git checkout -f c0d19f9f7cccb222819dba26be52d85262f3f18f
 > git rev-list c0d19f9f7cccb222819dba26be52d85262f3f18f # timeout=10
Cleaning workspace
 > git rev-parse --verify HEAD # timeout=10
Resetting working tree
 > git reset --hard # timeout=10
 > git clean -fdx # timeout=10
[EnvInject] - Executing scripts and injecting environment variables after the SCM step.
[EnvInject] - Injecting as environment variables the properties content 
SPARK_LOCAL_IP=127.0.0.1

[EnvInject] - Variables injected successfully.
Parsing POMs
Downloaded artifact http://repo.maven.apache.org/maven2/org/apache/apache/18/apache-18.pom
Modules changed, recalculating dependency graph
Established TCP socket on 49364
maven33-agent.jar already up to date
maven33-interceptor.jar already up to date
maven3-interceptor-commons.jar already up to date
[beam_PostCommit_Java_ValidatesRunner_Apex] $ /home/jenkins/tools/java/latest1.8/bin/java
-Dorg.slf4j.simpleLogger.showDateTime=true -Dorg.slf4j.simpleLogger.dateTimeFormat=yyyy-MM-dd'T'HH:mm:ss.SSS
-XX:+TieredCompilation -XX:TieredStopAtLevel=1 -cp /home/jenkins/jenkins-slave/maven33-agent.jar:/home/jenkins/tools/maven/apache-maven-3.3.3/boot/plexus-classworlds-2.5.2.jar:/home/jenkins/tools/maven/apache-maven-3.3.3/conf/logging
jenkins.maven3.agent.Maven33Main /home/jenkins/tools/maven/apache-maven-3.3.3 /home/jenkins/jenkins-slave/slave.jar
/home/jenkins/jenkins-slave/maven33-interceptor.jar /home/jenkins/jenkins-slave/maven3-interceptor-commons.jar
49364
<===[JENKINS REMOTING CAPACITY]===>   channel started
Executing Maven:  -B -f <https://builds.apache.org/job/beam_PostCommit_Java_ValidatesRunner_Apex/ws/pom.xml>
-Dmaven.repo.local=<https://builds.apache.org/job/beam_PostCommit_Java_ValidatesRunner_Apex/ws/.repository>
clean verify --projects runners/apex --also-make --batch-mode --errors --activate-profiles
validates-runner-tests --activate-profiles local-validates-runner-tests
2017-05-25T06:01:48.143 [INFO] Error stacktraces are turned on.
2017-05-25T06:01:48.213 [INFO] Scanning for projects...
2017-05-25T06:01:48.958 [INFO] Downloading: https://repo.maven.apache.org/maven2/kr/motd/maven/os-maven-plugin/1.5.0.Final/os-maven-plugin-1.5.0.Final.pom
2017-05-25T06:01:49.478 [INFO] Downloaded: https://repo.maven.apache.org/maven2/kr/motd/maven/os-maven-plugin/1.5.0.Final/os-maven-plugin-1.5.0.Final.pom
(7 KB at 11.9 KB/sec)
2017-05-25T06:01:49.486 [INFO] Downloading: https://repo.maven.apache.org/maven2/org/sonatype/oss/oss-parent/9/oss-parent-9.pom
2017-05-25T06:01:49.550 [INFO] Downloaded: https://repo.maven.apache.org/maven2/org/sonatype/oss/oss-parent/9/oss-parent-9.pom
(7 KB at 100.2 KB/sec)
2017-05-25T06:01:49.560 [INFO] Downloading: https://repo.maven.apache.org/maven2/org/apache/maven/maven-plugin-api/3.2.1/maven-plugin-api-3.2.1.pom
2017-05-25T06:01:49.617 [INFO] Downloaded: https://repo.maven.apache.org/maven2/org/apache/maven/maven-plugin-api/3.2.1/maven-plugin-api-3.2.1.pom
(4 KB at 59.0 KB/sec)
2017-05-25T06:01:49.619 [INFO] Downloading: https://repo.maven.apache.org/maven2/org/apache/maven/maven/3.2.1/maven-3.2.1.pom
2017-05-25T06:01:49.712 [INFO] Downloaded: https://repo.maven.apache.org/maven2/org/apache/maven/maven/3.2.1/maven-3.2.1.pom
(23 KB at 237.2 KB/sec)
2017-05-25T06:01:49.717 [INFO] Downloading: https://repo.maven.apache.org/maven2/org/apache/maven/maven-parent/23/maven-parent-23.pom
2017-05-25T06:01:49.788 [INFO] Downloaded: https://repo.maven.apache.org/maven2/org/apache/maven/maven-parent/23/maven-parent-23.pom
(32 KB at 448.2 KB/sec)
2017-05-25T06:01:49.793 [INFO] Downloading: https://repo.maven.apache.org/maven2/org/apache/apache/13/apache-13.pom
2017-05-25T06:01:49.850 [INFO] Downloaded: https://repo.maven.apache.org/maven2/org/apache/apache/13/apache-13.pom
(14 KB at 239.4 KB/sec)
2017-05-25T06:01:49.860 [INFO] Downloading: https://repo.maven.apache.org/maven2/org/apache/maven/maven-model/3.2.1/maven-model-3.2.1.pom
2017-05-25T06:01:49.914 [INFO] Downloaded: https://repo.maven.apache.org/maven2/org/apache/maven/maven-model/3.2.1/maven-model-3.2.1.pom
(5 KB at 74.9 KB/sec)
2017-05-25T06:01:49.920 [INFO] Downloading: https://repo.maven.apache.org/maven2/org/codehaus/plexus/plexus-utils/3.0.17/plexus-utils-3.0.17.pom
2017-05-25T06:01:49.974 [INFO] Downloaded: https://repo.maven.apache.org/maven2/org/codehaus/plexus/plexus-utils/3.0.17/plexus-utils-3.0.17.pom
(4 KB at 61.4 KB/sec)
2017-05-25T06:01:49.977 [INFO] Downloading: https://repo.maven.apache.org/maven2/org/codehaus/plexus/plexus/3.3.1/plexus-3.3.1.pom
2017-05-25T06:01:50.040 [INFO] Downloaded: https://repo.maven.apache.org/maven2/org/codehaus/plexus/plexus/3.3.1/plexus-3.3.1.pom
(20 KB at 322.0 KB/sec)
2017-05-25T06:01:50.047 [INFO] Downloading: https://repo.maven.apache.org/maven2/org/sonatype/spice/spice-parent/17/spice-parent-17.pom
2017-05-25T06:01:50.103 [INFO] Downloaded: https://repo.maven.apache.org/maven2/org/sonatype/spice/spice-parent/17/spice-parent-17.pom
(7 KB at 117.9 KB/sec)
2017-05-25T06:01:50.106 [INFO] Downloading: https://repo.maven.apache.org/maven2/org/sonatype/forge/forge-parent/10/forge-parent-10.pom
2017-05-25T06:01:50.163 [INFO] Downloaded: https://repo.maven.apache.org/maven2/org/sonatype/forge/forge-parent/10/forge-parent-10.pom
(14 KB at 232.3 KB/sec)
2017-05-25T06:01:50.167 [INFO] Downloading: https://repo.maven.apache.org/maven2/org/apache/maven/maven-artifact/3.2.1/maven-artifact-3.2.1.pom
2017-05-25T06:01:50.220 [INFO] Downloaded: https://repo.maven.apache.org/maven2/org/apache/maven/maven-artifact/3.2.1/maven-artifact-3.2.1.pom
(2 KB at 36.3 KB/sec)
2017-05-25T06:01:50.225 [INFO] Downloading: https://repo.maven.apache.org/maven2/org/eclipse/sisu/org.eclipse.sisu.plexus/0.0.0.M5/org.eclipse.sisu.plexus-0.0.0.M5.pom
2017-05-25T06:01:50.278 [INFO] Downloaded: https://repo.maven.apache.org/maven2/org/eclipse/sisu/org.eclipse.sisu.plexus/0.0.0.M5/org.eclipse.sisu.plexus-0.0.0.M5.pom
(5 KB at 89.0 KB/sec)
2017-05-25T06:01:50.280 [INFO] Downloading: https://repo.maven.apache.org/maven2/org/eclipse/sisu/sisu-plexus/0.0.0.M5/sisu-plexus-0.0.0.M5.pom
2017-05-25T06:01:50.338 [INFO] Downloaded: https://repo.maven.apache.org/maven2/org/eclipse/sisu/sisu-plexus/0.0.0.M5/sisu-plexus-0.0.0.M5.pom
(13 KB at 222.3 KB/sec)
2017-05-25T06:01:50.341 [INFO] Downloading: https://repo.maven.apache.org/maven2/org/sonatype/oss/oss-parent/7/oss-parent-7.pom
2017-05-25T06:01:50.398 [INFO] Downloaded: https://repo.maven.apache.org/maven2/org/sonatype/oss/oss-parent/7/oss-parent-7.pom
(5 KB at 82.6 KB/sec)
2017-05-25T06:01:50.404 [INFO] Downloading: https://repo.maven.apache.org/maven2/javax/enterprise/cdi-api/1.0/cdi-api-1.0.pom
2017-05-25T06:01:50.458 [INFO] Downloaded: https://repo.maven.apache.org/maven2/javax/enterprise/cdi-api/1.0/cdi-api-1.0.pom
(2 KB at 25.5 KB/sec)
2017-05-25T06:01:50.463 [INFO] Downloading: https://repo.maven.apache.org/maven2/org/jboss/weld/weld-api-parent/1.0/weld-api-parent-1.0.pom
2017-05-25T06:01:50.518 [INFO] Downloaded: https://repo.maven.apache.org/maven2/org/jboss/weld/weld-api-parent/1.0/weld-api-parent-1.0.pom
(3 KB at 41.8 KB/sec)
2017-05-25T06:01:50.521 [INFO] Downloading: https://repo.maven.apache.org/maven2/org/jboss/weld/weld-api-bom/1.0/weld-api-bom-1.0.pom
2017-05-25T06:01:50.576 [INFO] Downloaded: https://repo.maven.apache.org/maven2/org/jboss/weld/weld-api-bom/1.0/weld-api-bom-1.0.pom
(8 KB at 140.4 KB/sec)
2017-05-25T06:01:50.579 [INFO] Downloading: https://repo.maven.apache.org/maven2/org/jboss/weld/weld-parent/6/weld-parent-6.pom
2017-05-25T06:01:50.638 [INFO] Downloaded: https://repo.maven.apache.org/maven2/org/jboss/weld/weld-parent/6/weld-parent-6.pom
(21 KB at 342.5 KB/sec)
2017-05-25T06:01:50.643 [INFO] Downloading: https://repo.maven.apache.org/maven2/javax/annotation/jsr250-api/1.0/jsr250-api-1.0.pom
2017-05-25T06:01:50.696 [INFO] Downloaded: https://repo.maven.apache.org/maven2/javax/annotation/jsr250-api/1.0/jsr250-api-1.0.pom
(1023 B at 18.8 KB/sec)
2017-05-25T06:01:50.699 [INFO] Downloading: https://repo.maven.apache.org/maven2/javax/inject/javax.inject/1/javax.inject-1.pom
2017-05-25T06:01:50.754 [INFO] Downloaded: https://repo.maven.apache.org/maven2/javax/inject/javax.inject/1/javax.inject-1.pom
(612 B at 10.9 KB/sec)
2017-05-25T06:01:50.757 [INFO] Downloading: https://repo.maven.apache.org/maven2/com/google/guava/guava/10.0.1/guava-10.0.1.pom
2017-05-25T06:01:50.811 [INFO] Downloaded: https://repo.maven.apache.org/maven2/com/google/guava/guava/10.0.1/guava-10.0.1.pom
(6 KB at 97.4 KB/sec)
2017-05-25T06:01:50.813 [INFO] Downloading: https://repo.maven.apache.org/maven2/com/google/guava/guava-parent/10.0.1/guava-parent-10.0.1.pom
2017-05-25T06:01:50.866 [INFO] Downloaded: https://repo.maven.apache.org/maven2/com/google/guava/guava-parent/10.0.1/guava-parent-10.0.1.pom
(2 KB at 36.1 KB/sec)
2017-05-25T06:01:50.870 [INFO] Downloading: https://repo.maven.apache.org/maven2/com/google/code/findbugs/jsr305/1.3.9/jsr305-1.3.9.pom
2017-05-25T06:01:50.924 [INFO] Downloaded: https://repo.maven.apache.org/maven2/com/google/code/findbugs/jsr305/1.3.9/jsr305-1.3.9.pom
(965 B at 17.5 KB/sec)
2017-05-25T06:01:50.926 [INFO] Downloading: https://repo.maven.apache.org/maven2/org/sonatype/sisu/sisu-guice/3.1.0/sisu-guice-3.1.0.pom
2017-05-25T06:01:50.980 [INFO] Downloaded: https://repo.maven.apache.org/maven2/org/sonatype/sisu/sisu-guice/3.1.0/sisu-guice-3.1.0.pom
(10 KB at 183.5 KB/sec)
2017-05-25T06:01:50.983 [INFO] Downloading: https://repo.maven.apache.org/maven2/org/sonatype/sisu/inject/guice-parent/3.1.0/guice-parent-3.1.0.pom
2017-05-25T06:01:51.040 [INFO] Downloaded: https://repo.maven.apache.org/maven2/org/sonatype/sisu/inject/guice-parent/3.1.0/guice-parent-3.1.0.pom
(11 KB at 190.5 KB/sec)
2017-05-25T06:01:51.045 [INFO] Downloading: https://repo.maven.apache.org/maven2/aopalliance/aopalliance/1.0/aopalliance-1.0.pom
2017-05-25T06:01:51.099 [INFO] Downloaded: https://repo.maven.apache.org/maven2/aopalliance/aopalliance/1.0/aopalliance-1.0.pom
(363 B at 6.6 KB/sec)
2017-05-25T06:01:51.102 [INFO] Downloading: https://repo.maven.apache.org/maven2/org/eclipse/sisu/org.eclipse.sisu.inject/0.0.0.M5/org.eclipse.sisu.inject-0.0.0.M5.pom
2017-05-25T06:01:51.157 [INFO] Downloaded: https://repo.maven.apache.org/maven2/org/eclipse/sisu/org.eclipse.sisu.inject/0.0.0.M5/org.eclipse.sisu.inject-0.0.0.M5.pom
(3 KB at 44.7 KB/sec)
2017-05-25T06:01:51.160 [INFO] Downloading: https://repo.maven.apache.org/maven2/org/eclipse/sisu/sisu-inject/0.0.0.M5/sisu-inject-0.0.0.M5.pom
2017-05-25T06:01:51.219 [INFO] Downloaded: https://repo.maven.apache.org/maven2/org/eclipse/sisu/sisu-inject/0.0.0.M5/sisu-inject-0.0.0.M5.pom
(14 KB at 231.6 KB/sec)
2017-05-25T06:01:51.224 [INFO] Downloading: https://repo.maven.apache.org/maven2/org/codehaus/plexus/plexus-component-annotations/1.5.5/plexus-component-annotations-1.5.5.pom
2017-05-25T06:01:51.277 [INFO] Downloaded: https://repo.maven.apache.org/maven2/org/codehaus/plexus/plexus-component-annotations/1.5.5/plexus-component-annotations-1.5.5.pom
(815 B at 15.0 KB/sec)
2017-05-25T06:01:51.279 [INFO] Downloading: https://repo.maven.apache.org/maven2/org/codehaus/plexus/plexus-containers/1.5.5/plexus-containers-1.5.5.pom
2017-05-25T06:01:51.333 [INFO] Downloaded: https://repo.maven.apache.org/maven2/org/codehaus/plexus/plexus-containers/1.5.5/plexus-containers-1.5.5.pom
(5 KB at 76.7 KB/sec)
2017-05-25T06:01:51.336 [INFO] Downloading: https://repo.maven.apache.org/maven2/org/codehaus/plexus/plexus/2.0.7/plexus-2.0.7.pom
2017-05-25T06:01:51.394 [INFO] Downloaded: https://repo.maven.apache.org/maven2/org/codehaus/plexus/plexus/2.0.7/plexus-2.0.7.pom
(17 KB at 291.2 KB/sec)
2017-05-25T06:01:51.399 [INFO] Downloading: https://repo.maven.apache.org/maven2/org/codehaus/plexus/plexus-classworlds/2.4/plexus-classworlds-2.4.pom
2017-05-25T06:01:51.451 [INFO] Downloaded: https://repo.maven.apache.org/maven2/org/codehaus/plexus/plexus-classworlds/2.4/plexus-classworlds-2.4.pom
(4 KB at 72.9 KB/sec)
2017-05-25T06:01:51.455 [INFO] Downloading: https://repo.maven.apache.org/maven2/org/codehaus/plexus/plexus-utils/2.1/plexus-utils-2.1.pom
2017-05-25T06:01:51.507 [INFO] Downloaded: https://repo.maven.apache.org/maven2/org/codehaus/plexus/plexus-utils/2.1/plexus-utils-2.1.pom
(4 KB at 75.8 KB/sec)
2017-05-25T06:01:51.510 [INFO] Downloading: https://repo.maven.apache.org/maven2/org/sonatype/spice/spice-parent/16/spice-parent-16.pom
2017-05-25T06:01:51.565 [INFO] Downloaded: https://repo.maven.apache.org/maven2/org/sonatype/spice/spice-parent/16/spice-parent-16.pom
(9 KB at 148.4 KB/sec)
2017-05-25T06:01:51.568 [INFO] Downloading: https://repo.maven.apache.org/maven2/org/sonatype/forge/forge-parent/5/forge-parent-5.pom
2017-05-25T06:01:51.622 [INFO] Downloaded: https://repo.maven.apache.org/maven2/org/sonatype/forge/forge-parent/5/forge-parent-5.pom
(9 KB at 151.2 KB/sec)
2017-05-25T06:01:51.643 [INFO] Downloading: https://repo.maven.apache.org/maven2/kr/motd/maven/os-maven-plugin/1.5.0.Final/os-maven-plugin-1.5.0.Final.jar
2017-05-25T06:01:51.644 [INFO] Downloading: https://repo.maven.apache.org/maven2/org/apache/maven/maven-plugin-api/3.2.1/maven-plugin-api-3.2.1.jar
2017-05-25T06:01:51.649 [INFO] Downloading: https://repo.maven.apache.org/maven2/org/apache/maven/maven-model/3.2.1/maven-model-3.2.1.jar
2017-05-25T06:01:51.649 [INFO] Downloading: https://repo.maven.apache.org/maven2/org/apache/maven/maven-artifact/3.2.1/maven-artifact-3.2.1.jar
2017-05-25T06:01:51.654 [INFO] Downloading: https://repo.maven.apache.org/maven2/org/eclipse/sisu/org.eclipse.sisu.plexus/0.0.0.M5/org.eclipse.sisu.plexus-0.0.0.M5.jar
2017-05-25T06:01:51.716 [INFO] Downloaded: https://repo.maven.apache.org/maven2/kr/motd/maven/os-maven-plugin/1.5.0.Final/os-maven-plugin-1.5.0.Final.jar
(29 KB at 390.4 KB/sec)
2017-05-25T06:01:51.716 [INFO] Downloading: https://repo.maven.apache.org/maven2/javax/enterprise/cdi-api/1.0/cdi-api-1.0.jar
2017-05-25T06:01:51.788 [INFO] Downloaded: https://repo.maven.apache.org/maven2/javax/enterprise/cdi-api/1.0/cdi-api-1.0.jar
(44 KB at 306.7 KB/sec)
2017-05-25T06:01:51.788 [INFO] Downloading: https://repo.maven.apache.org/maven2/javax/annotation/jsr250-api/1.0/jsr250-api-1.0.jar
2017-05-25T06:01:51.812 [INFO] Downloaded: https://repo.maven.apache.org/maven2/org/apache/maven/maven-plugin-api/3.2.1/maven-plugin-api-3.2.1.jar
(45 KB at 264.8 KB/sec)
2017-05-25T06:01:51.813 [INFO] Downloading: https://repo.maven.apache.org/maven2/javax/inject/javax.inject/1/javax.inject-1.jar
2017-05-25T06:01:51.825 [INFO] Downloaded: https://repo.maven.apache.org/maven2/org/apache/maven/maven-artifact/3.2.1/maven-artifact-3.2.1.jar
(53 KB at 289.5 KB/sec)
2017-05-25T06:01:51.825 [INFO] Downloading: https://repo.maven.apache.org/maven2/com/google/guava/guava/10.0.1/guava-10.0.1.jar
2017-05-25T06:01:51.855 [INFO] Downloaded: https://repo.maven.apache.org/maven2/javax/annotation/jsr250-api/1.0/jsr250-api-1.0.jar
(6 KB at 27.6 KB/sec)
2017-05-25T06:01:51.856 [INFO] Downloading: https://repo.maven.apache.org/maven2/com/google/code/findbugs/jsr305/1.3.9/jsr305-1.3.9.jar
2017-05-25T06:01:51.866 [INFO] Downloaded: https://repo.maven.apache.org/maven2/org/apache/maven/maven-model/3.2.1/maven-model-3.2.1.jar
(157 KB at 703.2 KB/sec)
2017-05-25T06:01:51.866 [INFO] Downloading: https://repo.maven.apache.org/maven2/org/sonatype/sisu/sisu-guice/3.1.0/sisu-guice-3.1.0-no_aop.jar
2017-05-25T06:01:51.868 [INFO] Downloaded: https://repo.maven.apache.org/maven2/javax/inject/javax.inject/1/javax.inject-1.jar
(3 KB at 11.1 KB/sec)
2017-05-25T06:01:51.868 [INFO] Downloading: https://repo.maven.apache.org/maven2/aopalliance/aopalliance/1.0/aopalliance-1.0.jar
2017-05-25T06:01:51.885 [INFO] Downloaded: https://repo.maven.apache.org/maven2/org/eclipse/sisu/org.eclipse.sisu.plexus/0.0.0.M5/org.eclipse.sisu.plexus-0.0.0.M5.jar
(192 KB at 799.7 KB/sec)
2017-05-25T06:01:51.885 [INFO] Downloading: https://repo.maven.apache.org/maven2/org/eclipse/sisu/org.eclipse.sisu.inject/0.0.0.M5/org.eclipse.sisu.inject-0.0.0.M5.jar
2017-05-25T06:01:51.914 [INFO] Downloaded: https://repo.maven.apache.org/maven2/com/google/code/findbugs/jsr305/1.3.9/jsr305-1.3.9.jar
(33 KB at 121.7 KB/sec)
2017-05-25T06:01:51.914 [INFO] Downloading: https://repo.maven.apache.org/maven2/org/codehaus/plexus/plexus-component-annotations/1.5.5/plexus-component-annotations-1.5.5.jar
2017-05-25T06:01:51.920 [INFO] Downloaded: https://repo.maven.apache.org/maven2/aopalliance/aopalliance/1.0/aopalliance-1.0.jar
(5 KB at 16.1 KB/sec)
2017-05-25T06:01:51.920 [INFO] Downloading: https://repo.maven.apache.org/maven2/org/codehaus/plexus/plexus-classworlds/2.4/plexus-classworlds-2.4.jar
2017-05-25T06:01:51.967 [INFO] Downloaded: https://repo.maven.apache.org/maven2/org/codehaus/plexus/plexus-component-annotations/1.5.5/plexus-component-annotations-1.5.5.jar
(5 KB at 12.9 KB/sec)
2017-05-25T06:01:51.969 [INFO] Downloading: https://repo.maven.apache.org/maven2/org/codehaus/plexus/plexus-utils/3.0.17/plexus-utils-3.0.17.jar
2017-05-25T06:01:51.995 [INFO] Downloaded: https://repo.maven.apache.org/maven2/org/codehaus/plexus/plexus-classworlds/2.4/plexus-classworlds-2.4.jar
(46 KB at 132.8 KB/sec)
2017-05-25T06:01:52.049 [INFO] Downloaded: https://repo.maven.apache.org/maven2/org/eclipse/sisu/org.eclipse.sisu.inject/0.0.0.M5/org.eclipse.sisu.inject-0.0.0.M5.jar
(285 KB at 711.4 KB/sec)
2017-05-25T06:01:52.059 [INFO] Downloaded: https://repo.maven.apache.org/maven2/org/sonatype/sisu/sisu-guice/3.1.0/sisu-guice-3.1.0-no_aop.jar
(350 KB at 849.3 KB/sec)
2017-05-25T06:01:52.088 [INFO] Downloaded: https://repo.maven.apache.org/maven2/org/codehaus/plexus/plexus-utils/3.0.17/plexus-utils-3.0.17.jar
(246 KB at 560.1 KB/sec)
2017-05-25T06:01:52.280 [INFO] Downloaded: https://repo.maven.apache.org/maven2/com/google/guava/guava/10.0.1/guava-10.0.1.jar
(1467 KB at 2320.2 KB/sec)
2017-05-25T06:01:52.413 [INFO] Downloading: https://repo.maven.apache.org/maven2/org/apache/maven/archetype/archetype-packaging/2.4/archetype-packaging-2.4.pom
2017-05-25T06:01:52.467 [INFO] Downloaded: https://repo.maven.apache.org/maven2/org/apache/maven/archetype/archetype-packaging/2.4/archetype-packaging-2.4.pom
(2 KB at 28.3 KB/sec)
2017-05-25T06:01:52.469 [INFO] Downloading: https://repo.maven.apache.org/maven2/org/apache/maven/archetype/maven-archetype/2.4/maven-archetype-2.4.pom
2017-05-25T06:01:52.523 [INFO] Downloaded: https://repo.maven.apache.org/maven2/org/apache/maven/archetype/maven-archetype/2.4/maven-archetype-2.4.pom
(13 KB at 238.7 KB/sec)
2017-05-25T06:01:52.526 [INFO] Downloading: https://repo.maven.apache.org/maven2/org/apache/maven/maven-parent/26/maven-parent-26.pom
2017-05-25T06:01:52.584 [INFO] Downloaded: https://repo.maven.apache.org/maven2/org/apache/maven/maven-parent/26/maven-parent-26.pom
(39 KB at 669.9 KB/sec)
2017-05-25T06:01:52.587 [INFO] Downloading: https://repo.maven.apache.org/maven2/org/apache/apache/16/apache-16.pom
2017-05-25T06:01:52.642 [INFO] Downloaded: https://repo.maven.apache.org/maven2/org/apache/apache/16/apache-16.pom
(16 KB at 273.4 KB/sec)
2017-05-25T06:01:52.647 [INFO] Downloading: https://repo.maven.apache.org/maven2/org/codehaus/plexus/plexus-utils/1.1/plexus-utils-1.1.jar
2017-05-25T06:01:52.647 [INFO] Downloading: https://repo.maven.apache.org/maven2/org/apache/maven/archetype/archetype-packaging/2.4/archetype-packaging-2.4.jar
2017-05-25T06:01:52.701 [INFO] Downloaded: https://repo.maven.apache.org/maven2/org/apache/maven/archetype/archetype-packaging/2.4/archetype-packaging-2.4.jar
(8 KB at 133.8 KB/sec)
2017-05-25T06:01:52.735 [INFO] Downloaded: https://repo.maven.apache.org/maven2/org/codehaus/plexus/plexus-utils/1.1/plexus-utils-1.1.jar
(165 KB at 1870.6 KB/sec)
2017-05-25T06:01:52.848 [INFO] ------------------------------------------------------------------------
2017-05-25T06:01:52.849 [INFO] Detecting the operating system and CPU architecture
2017-05-25T06:01:52.849 [INFO] ------------------------------------------------------------------------
2017-05-25T06:01:52.849 [INFO] os.detected.name: linux
2017-05-25T06:01:52.849 [INFO] os.detected.arch: x86_64
2017-05-25T06:01:52.849 [INFO] os.detected.version: 3.19
2017-05-25T06:01:52.849 [INFO] os.detected.version.major: 3
2017-05-25T06:01:52.849 [INFO] os.detected.version.minor: 19
2017-05-25T06:01:52.850 [INFO] os.detected.release: ubuntu
2017-05-25T06:01:52.850 [INFO] os.detected.release.version: 14.04
2017-05-25T06:01:52.850 [INFO] os.detected.release.like.ubuntu: true
2017-05-25T06:01:52.851 [INFO] os.detected.release.like.debian: true
2017-05-25T06:01:52.851 [INFO] os.detected.classifier: linux-x86_64
2017-05-25T06:02:45.759 [INFO] ------------------------------------------------------------------------
2017-05-25T06:02:45.760 [INFO] Reactor Build Order:
2017-05-25T06:02:45.760 [INFO] 
2017-05-25T06:02:45.760 [INFO] Apache Beam :: Parent
2017-05-25T06:02:45.760 [INFO] Apache Beam :: SDKs :: Java :: Build Tools
2017-05-25T06:02:45.760 [INFO] Apache Beam :: SDKs
2017-05-25T06:02:45.760 [INFO] Apache Beam :: SDKs :: Common
2017-05-25T06:02:45.760 [INFO] Apache Beam :: SDKs :: Common :: Fn API
2017-05-25T06:02:45.760 [INFO] Apache Beam :: SDKs :: Common :: Runner API
2017-05-25T06:02:45.760 [INFO] Apache Beam :: SDKs :: Java
2017-05-25T06:02:45.760 [INFO] Apache Beam :: SDKs :: Java :: Core
2017-05-25T06:02:45.760 [INFO] Apache Beam :: Runners
2017-05-25T06:02:45.760 [INFO] Apache Beam :: Runners :: Core Construction Java
2017-05-25T06:02:45.760 [INFO] Apache Beam :: Runners :: Core Java
2017-05-25T06:02:45.760 [INFO] Apache Beam :: Runners :: Apex
2017-05-25T06:02:46.173 [INFO]                                                           
             
2017-05-25T06:02:46.174 [INFO] ------------------------------------------------------------------------
2017-05-25T06:02:46.174 [INFO] Building Apache Beam :: Parent 2.1.0-SNAPSHOT
2017-05-25T06:02:46.174 [INFO] ------------------------------------------------------------------------
2017-05-25T06:02:46.177 [INFO] Downloading: https://repo.maven.apache.org/maven2/org/apache/maven/plugins/maven-remote-resources-plugin/1.5/maven-remote-resources-plugin-1.5.pom
[INFO] I/O exception (java.net.SocketException) caught when processing request to {s}->https://repo.maven.apache.org:443:
Connection reset
[INFO] Retrying request to {s}->https://repo.maven.apache.org:443
[INFO] I/O exception (java.net.SocketException) caught when processing request to {s}->https://repo.maven.apache.org:443:
Connection reset
[INFO] Retrying request to {s}->https://repo.maven.apache.org:443
[INFO] I/O exception (java.net.SocketException) caught when processing request to {s}->https://repo.maven.apache.org:443:
Connection reset
[INFO] Retrying request to {s}->https://repo.maven.apache.org:443
[JENKINS] Archiving disabled
[JENKINS] Archiving disabled
[JENKINS] Archiving disabled
[JENKINS] Archiving disabled
[JENKINS] Archiving disabled
[JENKINS] Archiving disabled
[JENKINS] Archiving disabled
[JENKINS] Archiving disabled
[JENKINS] Archiving disabled
[JENKINS] Archiving disabled
[JENKINS] Archiving disabled
[JENKINS] Archiving disabled
[JENKINS] Archiving disabled
2017-05-25T06:02:50.385 [INFO] ------------------------------------------------------------------------
2017-05-25T06:02:50.385 [INFO] Reactor Summary:
2017-05-25T06:02:50.385 [INFO] 
2017-05-25T06:02:50.386 [INFO] Apache Beam :: Parent .............................. FAILURE
[  0.520 s]
2017-05-25T06:02:50.386 [INFO] Apache Beam :: SDKs :: Java :: Build Tools ......... SKIPPED
2017-05-25T06:02:50.386 [INFO] Apache Beam :: SDKs ................................ SKIPPED
2017-05-25T06:02:50.386 [INFO] Apache Beam :: SDKs :: Common ...................... SKIPPED
2017-05-25T06:02:50.386 [INFO] Apache Beam :: SDKs :: Common :: Fn API ............ SKIPPED
2017-05-25T06:02:50.386 [INFO] Apache Beam :: SDKs :: Common :: Runner API ........ SKIPPED
2017-05-25T06:02:50.386 [INFO] Apache Beam :: SDKs :: Java ........................ SKIPPED
2017-05-25T06:02:50.386 [INFO] Apache Beam :: SDKs :: Java :: Core ................ SKIPPED
2017-05-25T06:02:50.386 [INFO] Apache Beam :: Runners ............................. SKIPPED
2017-05-25T06:02:50.386 [INFO] Apache Beam :: Runners :: Core Construction Java ... SKIPPED
2017-05-25T06:02:50.386 [INFO] Apache Beam :: Runners :: Core Java ................ SKIPPED
2017-05-25T06:02:50.386 [INFO] Apache Beam :: Runners :: Apex ..................... SKIPPED
2017-05-25T06:02:50.386 [INFO] ------------------------------------------------------------------------
2017-05-25T06:02:50.386 [INFO] BUILD FAILURE
2017-05-25T06:02:50.386 [INFO] ------------------------------------------------------------------------
2017-05-25T06:02:50.386 [INFO] Total time: 01:02 min
2017-05-25T06:02:50.386 [INFO] Finished at: 2017-05-25T06:02:50+00:00
2017-05-25T06:02:50.531 [INFO] Final Memory: 36M/349M
2017-05-25T06:02:50.531 [INFO] ------------------------------------------------------------------------
2017-05-25T06:02:50.531 [WARNING] The requested profile "validates-runner-tests" could not
be activated because it does not exist.
2017-05-25T06:02:50.534 [ERROR] Plugin org.apache.maven.plugins:maven-remote-resources-plugin:1.5
or one of its dependencies could not be resolved: Failed to read artifact descriptor for org.apache.maven.plugins:maven-remote-resources-plugin:jar:1.5:
Could not transfer artifact org.apache.maven.plugins:maven-remote-resources-plugin:pom:1.5
from/to central (https://repo.maven.apache.org/maven2): Connection reset -> [Help 1]
2017-05-25T06:02:50.534 [ERROR] 
2017-05-25T06:02:50.534 [ERROR] To see the full stack trace of the errors, re-run Maven with
the -e switch.
2017-05-25T06:02:50.534 [ERROR] Re-run Maven using the -X switch to enable full debug logging.
2017-05-25T06:02:50.534 [ERROR] 
2017-05-25T06:02:50.534 [ERROR] For more information about the errors and possible solutions,
please read the following articles:
2017-05-25T06:02:50.534 [ERROR] [Help 1] http://cwiki.apache.org/confluence/display/MAVEN/PluginResolutionException
channel stopped

Mime
View raw message