beam-commits mailing list archives

Site index · List index
Message view « Date » · « Thread »
Top « Date » · « Thread »
From Apache Jenkins Server <jenk...@builds.apache.org>
Subject Build failed in Jenkins: beam_PostCommit_Java_MavenInstall #3657
Date Fri, 05 May 2017 00:14:18 GMT
See <https://builds.apache.org/job/beam_PostCommit_Java_MavenInstall/3657/display/redirect?page=changes>

Changes:

[kirpichov] [BEAM-2170] PubsubMessageWithAttributesCoder should not NPE on messages

[kirpichov] Makes PubsubMessagePayloadOnlyCoder not require whole-stream context

[kirpichov] Moves coder choice into PubsubSource

[davor] [BEAM-2144] Remove transform.reflect and utils from Javadocs

------------------------------------------
[...truncated 1.55 MB...]
java.lang.AssertionError: 

Expected: iterable containing [<ValueInGlobalWindow{value=FinishBundle, pane=PaneInfo.NO_FIRING}>]
     but: item 0: was <TimestampedValueInGlobalWindow{value=FinishBundle, timestamp=294247-01-09T04:00:54.775Z,
pane=PaneInfo.NO_FIRING}>
	at org.hamcrest.MatcherAssert.assertThat(MatcherAssert.java:20)
	at org.junit.Assert.assertThat(Assert.java:956)
	at org.junit.Assert.assertThat(Assert.java:923)
	at org.apache.beam.fn.harness.control.ProcessBundleHandlerTest.testCreatingAndProcessingDoFn(ProcessBundleHandlerTest.java:436)
	at sun.reflect.NativeMethodAccessorImpl.invoke0(Native Method)
	at sun.reflect.NativeMethodAccessorImpl.invoke(NativeMethodAccessorImpl.java:62)
	at sun.reflect.DelegatingMethodAccessorImpl.invoke(DelegatingMethodAccessorImpl.java:43)
	at java.lang.reflect.Method.invoke(Method.java:498)
	at org.junit.runners.model.FrameworkMethod$1.runReflectiveCall(FrameworkMethod.java:50)
	at org.junit.internal.runners.model.ReflectiveCallable.run(ReflectiveCallable.java:12)
	at org.junit.runners.model.FrameworkMethod.invokeExplosively(FrameworkMethod.java:47)
	at org.junit.internal.runners.statements.InvokeMethod.evaluate(InvokeMethod.java:17)
	at org.junit.internal.runners.statements.RunBefores.evaluate(RunBefores.java:26)
	at org.junit.rules.ExpectedException$ExpectedExceptionStatement.evaluate(ExpectedException.java:239)
	at org.junit.rules.RunRules.evaluate(RunRules.java:20)
	at org.junit.runners.ParentRunner.runLeaf(ParentRunner.java:325)
	at org.junit.runners.BlockJUnit4ClassRunner.runChild(BlockJUnit4ClassRunner.java:78)
	at org.junit.runners.BlockJUnit4ClassRunner.runChild(BlockJUnit4ClassRunner.java:57)
	at org.junit.runners.ParentRunner$3.run(ParentRunner.java:290)
	at org.junit.runners.ParentRunner$1.schedule(ParentRunner.java:71)
	at org.junit.runners.ParentRunner.runChildren(ParentRunner.java:288)
	at org.junit.runners.ParentRunner.access$000(ParentRunner.java:58)
	at org.junit.runners.ParentRunner$2.evaluate(ParentRunner.java:268)
	at org.junit.runners.ParentRunner.run(ParentRunner.java:363)
	at org.junit.runners.Suite.runChild(Suite.java:128)
	at org.junit.runners.Suite.runChild(Suite.java:27)
	at org.junit.runners.ParentRunner$3.run(ParentRunner.java:290)
	at org.junit.runners.ParentRunner$1.schedule(ParentRunner.java:71)
	at org.junit.runners.ParentRunner.runChildren(ParentRunner.java:288)
	at org.junit.runners.ParentRunner.access$000(ParentRunner.java:58)
	at org.junit.runners.ParentRunner$2.evaluate(ParentRunner.java:268)
	at org.junit.runners.ParentRunner.run(ParentRunner.java:363)
	at org.apache.maven.surefire.junitcore.JUnitCore.run(JUnitCore.java:55)
	at org.apache.maven.surefire.junitcore.JUnitCoreWrapper.createRequestAndRun(JUnitCoreWrapper.java:137)
	at org.apache.maven.surefire.junitcore.JUnitCoreWrapper.executeEager(JUnitCoreWrapper.java:107)
	at org.apache.maven.surefire.junitcore.JUnitCoreWrapper.execute(JUnitCoreWrapper.java:83)
	at org.apache.maven.surefire.junitcore.JUnitCoreWrapper.execute(JUnitCoreWrapper.java:75)
	at org.apache.maven.surefire.junitcore.JUnitCoreProvider.invoke(JUnitCoreProvider.java:157)
	at org.apache.maven.surefire.booter.ForkedBooter.invokeProviderInSameClassLoader(ForkedBooter.java:386)
	at org.apache.maven.surefire.booter.ForkedBooter.runSuitesInProcess(ForkedBooter.java:323)
	at org.apache.maven.surefire.booter.ForkedBooter.main(ForkedBooter.java:143)

2017-05-05T00:13:13.602 [INFO] Running org.apache.beam.fn.harness.control.BeamFnControlClientTest
2017-05-05T00:13:13.655 [INFO] Tests run: 1, Failures: 0, Errors: 0, Skipped: 0, Time elapsed:
0.051 s - in org.apache.beam.fn.harness.control.BeamFnControlClientTest
2017-05-05T00:13:13.655 [INFO] Running org.apache.beam.fn.harness.control.RegisterHandlerTest
2017-05-05T00:13:13.774 [INFO] Tests run: 1, Failures: 0, Errors: 0, Skipped: 0, Time elapsed:
0.118 s - in org.apache.beam.fn.harness.control.RegisterHandlerTest
2017-05-05T00:13:13.775 [INFO] Running org.apache.beam.fn.harness.FnHarnessTest
2017-05-05T00:13:14.607 [INFO] Tests run: 1, Failures: 0, Errors: 0, Skipped: 0, Time elapsed:
0.831 s - in org.apache.beam.fn.harness.FnHarnessTest
2017-05-05T00:13:14.607 [INFO] Running org.apache.beam.fn.harness.stream.AdvancingPhaserTest
2017-05-05T00:13:14.610 [INFO] Tests run: 1, Failures: 0, Errors: 0, Skipped: 0, Time elapsed:
0.002 s - in org.apache.beam.fn.harness.stream.AdvancingPhaserTest
2017-05-05T00:13:14.610 [INFO] Running org.apache.beam.fn.harness.stream.ForwardingClientResponseObserverTest
2017-05-05T00:13:14.625 [INFO] Tests run: 1, Failures: 0, Errors: 0, Skipped: 0, Time elapsed:
0.014 s - in org.apache.beam.fn.harness.stream.ForwardingClientResponseObserverTest
2017-05-05T00:13:14.625 [INFO] Running org.apache.beam.fn.harness.stream.DirectStreamObserverTest
2017-05-05T00:13:17.251 [INFO] Tests run: 2, Failures: 0, Errors: 0, Skipped: 0, Time elapsed:
2.624 s - in org.apache.beam.fn.harness.stream.DirectStreamObserverTest
2017-05-05T00:13:17.251 [INFO] Running org.apache.beam.fn.harness.stream.StreamObserverFactoryTest
2017-05-05T00:13:17.274 [INFO] Tests run: 3, Failures: 0, Errors: 0, Skipped: 0, Time elapsed:
0.022 s - in org.apache.beam.fn.harness.stream.StreamObserverFactoryTest
2017-05-05T00:13:17.274 [INFO] Running org.apache.beam.fn.harness.test.TestExecutorsTest
2017-05-05T00:13:27.282 [INFO] Tests run: 4, Failures: 0, Errors: 0, Skipped: 0, Time elapsed:
10.007 s - in org.apache.beam.fn.harness.test.TestExecutorsTest
2017-05-05T00:13:27.282 [INFO] Running org.apache.beam.fn.harness.test.TestStreamsTest
2017-05-05T00:13:27.287 [INFO] Tests run: 5, Failures: 0, Errors: 0, Skipped: 0, Time elapsed:
0.004 s - in org.apache.beam.fn.harness.test.TestStreamsTest
2017-05-05T00:13:27.618 [INFO] 
2017-05-05T00:13:27.618 [INFO] Results:
2017-05-05T00:13:27.618 [INFO] 
2017-05-05T00:13:27.618 [ERROR] Failures: 
2017-05-05T00:13:27.618 [ERROR]   ProcessBundleHandlerTest.testCreatingAndProcessingDoFn:436

Expected: iterable containing [<ValueInGlobalWindow{value=FinishBundle, pane=PaneInfo.NO_FIRING}>]
     but: item 0: was <TimestampedValueInGlobalWindow{value=FinishBundle, timestamp=294247-01-09T04:00:54.775Z,
pane=PaneInfo.NO_FIRING}>
2017-05-05T00:13:27.618 [INFO] 
2017-05-05T00:13:27.618 [ERROR] Tests run: 46, Failures: 1, Errors: 0, Skipped: 0
2017-05-05T00:13:27.618 [INFO] 
2017-05-05T00:13:27.621 [INFO]                                                           
             
2017-05-05T00:13:27.621 [INFO] ------------------------------------------------------------------------
2017-05-05T00:13:27.621 [INFO] Skipping Apache Beam :: Parent
2017-05-05T00:13:27.621 [INFO] This project has been banned from the build due to previous
failures.
2017-05-05T00:13:27.621 [INFO] ------------------------------------------------------------------------
[JENKINS] Archiving disabled
[JENKINS] Archiving disabled
[JENKINS] Archiving disabled
[JENKINS] Archiving disabled
[JENKINS] Archiving disabled
[JENKINS] Archiving disabled
[JENKINS] Archiving disabled
[JENKINS] Archiving disabled
[JENKINS] Archiving disabled
[JENKINS] Archiving disabled
[JENKINS] Archiving disabled
[JENKINS] Archiving disabled
[JENKINS] Archiving disabled
[JENKINS] Archiving disabled
[JENKINS] Archiving disabled
[JENKINS] Archiving disabled
[JENKINS] Archiving disabled
[JENKINS] Archiving disabled
[JENKINS] Archiving disabled
[JENKINS] Archiving disabled
[JENKINS] Archiving disabled
[JENKINS] Archiving disabled
[JENKINS] Archiving disabled
[JENKINS] Archiving disabled
[JENKINS] Archiving disabled
[JENKINS] Archiving disabled
[JENKINS] Archiving disabled
[JENKINS] Archiving disabled
[JENKINS] Archiving disabled
[JENKINS] Archiving disabled
[JENKINS] Archiving disabled
[JENKINS] Archiving disabled
[JENKINS] Archiving disabled
[JENKINS] Archiving disabled
[JENKINS] Archiving disabled
[JENKINS] Archiving disabled
[JENKINS] Archiving disabled
[JENKINS] Archiving disabled
[JENKINS] Archiving disabled
[JENKINS] Archiving disabled
[JENKINS] Archiving disabled
[JENKINS] Archiving disabled
[JENKINS] Archiving disabled
[JENKINS] Archiving disabled
[JENKINS] Archiving disabled
[JENKINS] Archiving disabled
2017-05-05T00:13:46.435 [INFO] ------------------------------------------------------------------------
2017-05-05T00:13:46.435 [INFO] Reactor Summary:
2017-05-05T00:13:46.435 [INFO] 
2017-05-05T00:13:46.435 [INFO] Apache Beam :: Parent .............................. SUCCESS
[ 54.208 s]
2017-05-05T00:13:46.435 [INFO] Apache Beam :: SDKs :: Java :: Build Tools ......... SUCCESS
[ 12.878 s]
2017-05-05T00:13:46.435 [INFO] Apache Beam :: SDKs ................................ SUCCESS
[  4.814 s]
2017-05-05T00:13:46.435 [INFO] Apache Beam :: SDKs :: Common ...................... SUCCESS
[  2.605 s]
2017-05-05T00:13:46.435 [INFO] Apache Beam :: SDKs :: Common :: Fn API ............ SUCCESS
[ 23.433 s]
2017-05-05T00:13:46.435 [INFO] Apache Beam :: SDKs :: Common :: Runner API ........ SUCCESS
[ 13.747 s]
2017-05-05T00:13:46.435 [INFO] Apache Beam :: SDKs :: Java ........................ SUCCESS
[  5.479 s]
2017-05-05T00:13:46.435 [INFO] Apache Beam :: SDKs :: Java :: Core ................ SUCCESS
[02:48 min]
2017-05-05T00:13:46.436 [INFO] Apache Beam :: SDKs :: Java :: IO .................. SUCCESS
[  2.623 s]
2017-05-05T00:13:46.436 [INFO] Apache Beam :: SDKs :: Java :: IO :: Common ........ SUCCESS
[  4.756 s]
2017-05-05T00:13:46.436 [INFO] Apache Beam :: Runners ............................. SUCCESS
[  1.875 s]
2017-05-05T00:13:46.436 [INFO] Apache Beam :: Runners :: Core Construction Java ... SUCCESS
[ 27.199 s]
2017-05-05T00:13:46.436 [INFO] Apache Beam :: Runners :: Core Java ................ SUCCESS
[ 54.856 s]
2017-05-05T00:13:46.436 [INFO] Apache Beam :: Runners :: Direct Java .............. SUCCESS
[02:42 min]
2017-05-05T00:13:46.436 [INFO] Apache Beam :: SDKs :: Java :: IO :: Elasticsearch . SUCCESS
[ 34.564 s]
2017-05-05T00:13:46.436 [INFO] Apache Beam :: SDKs :: Java :: Extensions .......... SUCCESS
[  5.975 s]
2017-05-05T00:13:46.436 [INFO] Apache Beam :: SDKs :: Java :: Extensions :: Google Cloud Platform
Core SUCCESS [ 33.281 s]
2017-05-05T00:13:46.436 [INFO] Apache Beam :: SDKs :: Java :: Extensions :: Protobuf SUCCESS
[ 21.345 s]
2017-05-05T00:13:46.436 [INFO] Apache Beam :: SDKs :: Java :: IO :: Google Cloud Platform
SUCCESS [01:30 min]
2017-05-05T00:13:46.436 [INFO] Apache Beam :: SDKs :: Java :: IO :: Hadoop Common . SUCCESS
[ 18.020 s]
2017-05-05T00:13:46.436 [INFO] Apache Beam :: SDKs :: Java :: IO :: Hadoop File System SUCCESS
[ 35.741 s]
2017-05-05T00:13:46.436 [INFO] Apache Beam :: SDKs :: Java :: IO :: Hadoop ........ SUCCESS
[  5.460 s]
2017-05-05T00:13:46.436 [INFO] Apache Beam :: SDKs :: Java :: IO :: Hadoop :: input-format
SUCCESS [ 16.516 s]
2017-05-05T00:13:46.436 [INFO] Apache Beam :: Runners :: Google Cloud Dataflow .... SUCCESS
[05:17 min]
2017-05-05T00:13:46.436 [INFO] Apache Beam :: SDKs :: Java :: IO :: Hadoop :: jdk1.8-tests
SUCCESS [01:17 min]
2017-05-05T00:13:46.436 [INFO] Apache Beam :: SDKs :: Java :: IO :: HBase ......... SUCCESS
[01:14 min]
2017-05-05T00:13:46.436 [INFO] Apache Beam :: SDKs :: Java :: IO :: JDBC .......... SUCCESS
[ 37.201 s]
2017-05-05T00:13:46.436 [INFO] Apache Beam :: SDKs :: Java :: IO :: JMS ........... SUCCESS
[ 32.275 s]
2017-05-05T00:13:46.436 [INFO] Apache Beam :: SDKs :: Java :: IO :: Kafka ......... SUCCESS
[ 34.770 s]
2017-05-05T00:13:46.436 [INFO] Apache Beam :: SDKs :: Java :: IO :: Kinesis ....... SUCCESS
[ 24.048 s]
2017-05-05T00:13:46.436 [INFO] Apache Beam :: SDKs :: Java :: IO :: MongoDB ....... SUCCESS
[ 39.486 s]
2017-05-05T00:13:46.436 [INFO] Apache Beam :: SDKs :: Java :: IO :: MQTT .......... SUCCESS
[ 26.655 s]
2017-05-05T00:13:46.436 [INFO] Apache Beam :: SDKs :: Java :: IO :: XML ........... SUCCESS
[ 31.881 s]
2017-05-05T00:13:46.436 [INFO] Apache Beam :: SDKs :: Java :: Maven Archetypes .... SUCCESS
[  3.047 s]
2017-05-05T00:13:46.436 [INFO] Apache Beam :: SDKs :: Java :: Maven Archetypes :: Starter
SUCCESS [ 18.949 s]
2017-05-05T00:13:46.437 [INFO] Apache Beam :: SDKs :: Java :: Maven Archetypes :: Examples
SUCCESS [ 38.707 s]
2017-05-05T00:13:46.437 [INFO] Apache Beam :: SDKs :: Java :: Maven Archetypes :: Examples
- Java 8 SUCCESS [ 42.171 s]
2017-05-05T00:13:46.437 [INFO] Apache Beam :: SDKs :: Java :: Extensions :: Jackson SUCCESS
[ 25.163 s]
2017-05-05T00:13:46.437 [INFO] Apache Beam :: SDKs :: Java :: Extensions :: Join library SUCCESS
[ 24.990 s]
2017-05-05T00:13:46.437 [INFO] Apache Beam :: SDKs :: Java :: Extensions :: Sorter  SUCCESS
[ 41.908 s]
2017-05-05T00:13:46.437 [INFO] Apache Beam :: SDKs :: Java :: Harness ............. FAILURE
[ 34.858 s]
2017-05-05T00:13:46.437 [INFO] Apache Beam :: SDKs :: Java :: Java 8 Tests ........ SKIPPED
2017-05-05T00:13:46.437 [INFO] Apache Beam :: SDKs :: Python ...................... SKIPPED
2017-05-05T00:13:46.437 [INFO] Apache Beam :: Runners :: Flink .................... SKIPPED
2017-05-05T00:13:46.437 [INFO] Apache Beam :: Runners :: Spark .................... SKIPPED
2017-05-05T00:13:46.437 [INFO] Apache Beam :: Runners :: Apex ..................... SKIPPED
2017-05-05T00:13:46.437 [INFO] Apache Beam :: Examples ............................ SKIPPED
2017-05-05T00:13:46.437 [INFO] Apache Beam :: Examples :: Java .................... SKIPPED
2017-05-05T00:13:46.437 [INFO] Apache Beam :: Examples :: Java 8 .................. SKIPPED
2017-05-05T00:13:46.437 [INFO] Apache Beam :: SDKs :: Java :: Aggregated Javadoc .. SKIPPED
2017-05-05T00:13:46.437 [INFO] ------------------------------------------------------------------------
2017-05-05T00:13:46.437 [INFO] BUILD FAILURE
2017-05-05T00:13:46.437 [INFO] ------------------------------------------------------------------------
2017-05-05T00:13:46.437 [INFO] Total time: 30:30 min
2017-05-05T00:13:46.437 [INFO] Finished at: 2017-05-05T00:13:46+00:00
2017-05-05T00:13:48.096 [INFO] Final Memory: 275M/2264M
2017-05-05T00:13:48.096 [INFO] ------------------------------------------------------------------------
Waiting for Jenkins to finish collecting data
2017-05-05T00:14:11.987 [ERROR] Failed to execute goal org.apache.maven.plugins:maven-surefire-plugin:2.20:test
(default-test) on project beam-sdks-java-harness: There are test failures.
2017-05-05T00:14:11.987 [ERROR] 
2017-05-05T00:14:11.987 [ERROR] Please refer to <https://builds.apache.org/job/beam_PostCommit_Java_MavenInstall/ws/sdks/java/harness/target/surefire-reports>
for the individual test results.
2017-05-05T00:14:11.987 [ERROR] Please refer to dump files (if any exist) [date]-jvmRun[N].dump,
[date].dumpstream and [date]-jvmRun[N].dumpstream.
2017-05-05T00:14:11.987 [ERROR] -> [Help 1]
org.apache.maven.lifecycle.LifecycleExecutionException: Failed to execute goal org.apache.maven.plugins:maven-surefire-plugin:2.20:test
(default-test) on project beam-sdks-java-harness: There are test failures.

Please refer to <https://builds.apache.org/job/beam_PostCommit_Java_MavenInstall/ws/sdks/java/harness/target/surefire-reports>
for the individual test results.
Please refer to dump files (if any exist) [date]-jvmRun[N].dump, [date].dumpstream and [date]-jvmRun[N].dumpstream.
	at org.apache.maven.lifecycle.internal.MojoExecutor.execute(MojoExecutor.java:212)
	at org.apache.maven.lifecycle.internal.MojoExecutor.execute(MojoExecutor.java:153)
	at org.apache.maven.lifecycle.internal.MojoExecutor.execute(MojoExecutor.java:145)
	at org.apache.maven.lifecycle.internal.LifecycleModuleBuilder.buildProject(LifecycleModuleBuilder.java:116)
	at org.apache.maven.lifecycle.internal.LifecycleModuleBuilder.buildProject(LifecycleModuleBuilder.java:80)
	at org.apache.maven.lifecycle.internal.builder.singlethreaded.SingleThreadedBuilder.build(SingleThreadedBuilder.java:51)
	at org.apache.maven.lifecycle.internal.LifecycleStarter.execute(LifecycleStarter.java:128)
	at org.apache.maven.DefaultMaven.doExecute(DefaultMaven.java:307)
	at org.apache.maven.DefaultMaven.doExecute(DefaultMaven.java:193)
	at org.apache.maven.DefaultMaven.execute(DefaultMaven.java:106)
	at org.jvnet.hudson.maven3.launcher.Maven33Launcher.main(Maven33Launcher.java:129)
	at sun.reflect.NativeMethodAccessorImpl.invoke0(Native Method)
	at sun.reflect.NativeMethodAccessorImpl.invoke(NativeMethodAccessorImpl.java:62)
	at sun.reflect.DelegatingMethodAccessorImpl.invoke(DelegatingMethodAccessorImpl.java:43)
	at java.lang.reflect.Method.invoke(Method.java:498)
	at org.codehaus.plexus.classworlds.launcher.Launcher.launchStandard(Launcher.java:330)
	at org.codehaus.plexus.classworlds.launcher.Launcher.launch(Launcher.java:238)
	at jenkins.maven3.agent.Maven33Main.launch(Maven33Main.java:176)
	at sun.reflect.NativeMethodAccessorImpl.invoke0(Native Method)
	at sun.reflect.NativeMethodAccessorImpl.invoke(NativeMethodAccessorImpl.java:62)
	at sun.reflect.DelegatingMethodAccessorImpl.invoke(DelegatingMethodAccessorImpl.java:43)
	at java.lang.reflect.Method.invoke(Method.java:498)
	at hudson.maven.Maven3Builder.call(Maven3Builder.java:139)
	at hudson.maven.Maven3Builder.call(Maven3Builder.java:70)
	at hudson.remoting.UserRequest.perform(UserRequest.java:153)
	at hudson.remoting.UserRequest.perform(UserRequest.java:50)
	at hudson.remoting.Request$2.run(Request.java:336)
	at hudson.remoting.InterceptingExecutorService$1.call(InterceptingExecutorService.java:68)
	at java.util.concurrent.FutureTask.run(FutureTask.java:266)
	at java.util.concurrent.ThreadPoolExecutor.runWorker(ThreadPoolExecutor.java:1142)
	at java.util.concurrent.ThreadPoolExecutor$Worker.run(ThreadPoolExecutor.java:617)
	at java.lang.Thread.run(Thread.java:745)
Caused by: org.apache.maven.plugin.MojoFailureException: There are test failures.

Please refer to <https://builds.apache.org/job/beam_PostCommit_Java_MavenInstall/ws/sdks/java/harness/target/surefire-reports>
for the individual test results.
Please refer to dump files (if any exist) [date]-jvmRun[N].dump, [date].dumpstream and [date]-jvmRun[N].dumpstream.
	at org.apache.maven.plugin.surefire.SurefireHelper.throwException(SurefireHelper.java:204)
	at org.apache.maven.plugin.surefire.SurefireHelper.reportExecution(SurefireHelper.java:98)
	at org.apache.maven.plugin.surefire.SurefirePlugin.handleSummary(SurefirePlugin.java:334)
	at org.apache.maven.plugin.surefire.AbstractSurefireMojo.executeAfterPreconditionsChecked(AbstractSurefireMojo.java:937)
	at org.apache.maven.plugin.surefire.AbstractSurefireMojo.execute(AbstractSurefireMojo.java:785)
	at org.apache.maven.plugin.DefaultBuildPluginManager.executeMojo(DefaultBuildPluginManager.java:134)
	at org.apache.maven.lifecycle.internal.MojoExecutor.execute(MojoExecutor.java:208)
	... 31 more
2017-05-05T00:14:11.989 [ERROR] 
2017-05-05T00:14:11.989 [ERROR] Re-run Maven using the -X switch to enable full debug logging.
2017-05-05T00:14:11.989 [ERROR] 
2017-05-05T00:14:11.989 [ERROR] For more information about the errors and possible solutions,
please read the following articles:
2017-05-05T00:14:11.989 [ERROR] [Help 1] http://cwiki.apache.org/confluence/display/MAVEN/MojoFailureException
2017-05-05T00:14:11.989 [ERROR] 
2017-05-05T00:14:11.989 [ERROR] After correcting the problems, you can resume the build with
the command
2017-05-05T00:14:11.989 [ERROR]   mvn <goals> -rf :beam-sdks-java-harness
channel stopped
Not sending mail to unregistered user kirpichov@google.com

Mime
View raw message