beam-commits mailing list archives

Site index · List index
Message view « Date » · « Thread »
Top « Date » · « Thread »
From Apache Jenkins Server <jenk...@builds.apache.org>
Subject Build failed in Jenkins: beam_PostCommit_Java_MavenInstall #3898
Date Tue, 23 May 2017 23:32:03 GMT
See <https://builds.apache.org/job/beam_PostCommit_Java_MavenInstall/3898/display/redirect?page=changes>

Changes:

[chamikara] [BEAM-2338] Fix the limit counter in gcsio reads

------------------------------------------
[...truncated 2.34 MB...]
2017-05-23T23:30:57.374 [INFO] Excluding net.bytebuddy:byte-buddy:jar:1.6.8 from the shaded
jar.
2017-05-23T23:30:57.374 [INFO] Excluding org.apache.beam:beam-runners-core-construction-java:jar:2.1.0-SNAPSHOT
from the shaded jar.
2017-05-23T23:30:57.374 [INFO] Excluding org.apache.beam:beam-sdks-common-runner-api:jar:2.1.0-SNAPSHOT
from the shaded jar.
2017-05-23T23:30:57.374 [INFO] Excluding org.apache.beam:beam-runners-core-java:jar:2.1.0-SNAPSHOT
from the shaded jar.
2017-05-23T23:30:57.374 [INFO] Excluding io.dropwizard.metrics:metrics-core:jar:3.1.2 from
the shaded jar.
2017-05-23T23:30:59.458 [INFO] Replacing original artifact with shaded artifact.
2017-05-23T23:30:59.458 [INFO] Replacing <https://builds.apache.org/job/beam_PostCommit_Java_MavenInstall/ws/runners/spark/target/beam-runners-spark-2.1.0-SNAPSHOT.jar>
with <https://builds.apache.org/job/beam_PostCommit_Java_MavenInstall/ws/runners/spark/target/beam-runners-spark-2.1.0-SNAPSHOT-shaded.jar>
2017-05-23T23:30:59.458 [INFO] Replacing original test artifact with shaded test artifact.
2017-05-23T23:30:59.458 [INFO] Replacing <https://builds.apache.org/job/beam_PostCommit_Java_MavenInstall/ws/runners/spark/target/beam-runners-spark-2.1.0-SNAPSHOT-tests.jar>
with <https://builds.apache.org/job/beam_PostCommit_Java_MavenInstall/ws/runners/spark/target/beam-runners-spark-2.1.0-SNAPSHOT-shaded-tests.jar>
2017-05-23T23:30:59.458 [INFO] Dependency-reduced POM written at: <https://builds.apache.org/job/beam_PostCommit_Java_MavenInstall/ws/runners/spark/dependency-reduced-pom.xml>
2017-05-23T23:30:59.557 [INFO] Downloading: https://repo.maven.apache.org/maven2/net/java/dev/jets3t/jets3t/0.6.1/jets3t-0.6.1.jar
2017-05-23T23:30:59.557 [INFO] Downloading: https://repo.maven.apache.org/maven2/io/netty/netty/3.7.0.Final/netty-3.7.0.Final.jar
[INFO] I/O exception (java.net.SocketException) caught when processing request to {s}->https://repo.maven.apache.org:443:
Connection reset
[INFO] Retrying request to {s}->https://repo.maven.apache.org:443
[INFO] I/O exception (java.net.SocketException) caught when processing request to {s}->https://repo.maven.apache.org:443:
Connection reset
[INFO] Retrying request to {s}->https://repo.maven.apache.org:443
[INFO] I/O exception (java.net.SocketException) caught when processing request to {s}->https://repo.maven.apache.org:443:
Connection reset
[INFO] Retrying request to {s}->https://repo.maven.apache.org:443
2017-05-23T23:30:59.673 [INFO] Downloaded: https://repo.maven.apache.org/maven2/io/netty/netty/3.7.0.Final/netty-3.7.0.Final.jar
(1181 KB at 10172.7 KB/sec)
2017-05-23T23:30:59.674 [INFO] Downloading: https://repository.apache.org/content/repositories/snapshots/net/java/dev/jets3t/jets3t/0.6.1/jets3t-0.6.1.jar
2017-05-23T23:30:59.872 [INFO] Downloading: http://repository.jboss.org/nexus/content/groups/public/net/java/dev/jets3t/jets3t/0.6.1/jets3t-0.6.1.jar
[JENKINS] Archiving disabled
2017-05-23T23:31:00.668 [INFO]                                                           
             
2017-05-23T23:31:00.668 [INFO] ------------------------------------------------------------------------
2017-05-23T23:31:00.668 [INFO] Skipping Apache Beam :: Parent
2017-05-23T23:31:00.668 [INFO] This project has been banned from the build due to previous
failures.
2017-05-23T23:31:00.668 [INFO] ------------------------------------------------------------------------
[JENKINS] Archiving disabled
[JENKINS] Archiving disabled
[JENKINS] Archiving disabled
[JENKINS] Archiving disabled
[JENKINS] Archiving disabled
[JENKINS] Archiving disabled
[JENKINS] Archiving disabled
[JENKINS] Archiving disabled
[JENKINS] Archiving disabled
[JENKINS] Archiving disabled
[JENKINS] Archiving disabled
[JENKINS] Archiving disabled
[JENKINS] Archiving disabled
[JENKINS] Archiving disabled
[JENKINS] Archiving disabled
[JENKINS] Archiving disabled
[JENKINS] Archiving disabled
[JENKINS] Archiving disabled
[JENKINS] Archiving disabled
[JENKINS] Archiving disabled
[JENKINS] Archiving disabled
[JENKINS] Archiving disabled
[JENKINS] Archiving disabled
[JENKINS] Archiving disabled
[JENKINS] Archiving disabled
[JENKINS] Archiving disabled
[JENKINS] Archiving disabled
[JENKINS] Archiving disabled
[JENKINS] Archiving disabled
[JENKINS] Archiving disabled
[JENKINS] Archiving disabled
[JENKINS] Archiving disabled
[JENKINS] Archiving disabled
[JENKINS] Archiving disabled
[JENKINS] Archiving disabled
[JENKINS] Archiving disabled
[JENKINS] Archiving disabled
[JENKINS] Archiving disabled
[JENKINS] Archiving disabled
[JENKINS] Archiving disabled
[JENKINS] Archiving disabled
[JENKINS] Archiving disabled
[JENKINS] Archiving disabled
[JENKINS] Archiving disabled
[JENKINS] Archiving disabled
[JENKINS] Archiving disabled2017-05-23T23:31:24.399 [INFO] ------------------------------------------------------------------------
2017-05-23T23:31:24.399 [INFO] Reactor Summary:
2017-05-23T23:31:24.399 [INFO] 
2017-05-23T23:31:24.401 [INFO] Apache Beam :: Parent .............................. SUCCESS
[ 25.530 s]
2017-05-23T23:31:24.401 [INFO] Apache Beam :: SDKs :: Java :: Build Tools ......... SUCCESS
[ 16.281 s]
2017-05-23T23:31:24.401 [INFO] Apache Beam :: SDKs ................................ SUCCESS
[  4.938 s]
2017-05-23T23:31:24.401 [INFO] Apache Beam :: SDKs :: Common ...................... SUCCESS
[  1.703 s]
2017-05-23T23:31:24.401 [INFO] Apache Beam :: SDKs :: Common :: Fn API ............ SUCCESS
[ 25.486 s]
2017-05-23T23:31:24.401 [INFO] Apache Beam :: SDKs :: Common :: Runner API ........ SUCCESS
[ 16.158 s]
2017-05-23T23:31:24.401 [INFO] Apache Beam :: SDKs :: Java ........................ SUCCESS
[  4.155 s]
2017-05-23T23:31:24.401 [INFO] Apache Beam :: SDKs :: Java :: Core ................ SUCCESS
[02:58 min]
2017-05-23T23:31:24.401 [INFO] Apache Beam :: SDKs :: Java :: IO .................. SUCCESS
[  1.922 s]
2017-05-23T23:31:24.401 [INFO] Apache Beam :: SDKs :: Java :: IO :: Common ........ SUCCESS
[  6.311 s]
2017-05-23T23:31:24.401 [INFO] Apache Beam :: Runners ............................. SUCCESS
[  2.125 s]
2017-05-23T23:31:24.401 [INFO] Apache Beam :: Runners :: Core Construction Java ... SUCCESS
[ 36.698 s]
2017-05-23T23:31:24.401 [INFO] Apache Beam :: Runners :: Core Java ................ SUCCESS
[ 58.769 s]
2017-05-23T23:31:24.401 [INFO] Apache Beam :: Runners :: Direct Java .............. SUCCESS
[03:49 min]
2017-05-23T23:31:24.401 [INFO] Apache Beam :: SDKs :: Java :: IO :: Elasticsearch . SUCCESS
[ 52.391 s]
2017-05-23T23:31:24.401 [INFO] Apache Beam :: SDKs :: Java :: Extensions .......... SUCCESS
[  2.415 s]
2017-05-23T23:31:24.401 [INFO] Apache Beam :: SDKs :: Java :: Extensions :: Google Cloud Platform
Core SUCCESS [ 51.701 s]
2017-05-23T23:31:24.401 [INFO] Apache Beam :: SDKs :: Java :: Extensions :: Protobuf SUCCESS
[ 28.815 s]
2017-05-23T23:31:24.401 [INFO] Apache Beam :: SDKs :: Java :: IO :: Google Cloud Platform
SUCCESS [01:27 min]
2017-05-23T23:31:24.401 [INFO] Apache Beam :: SDKs :: Java :: IO :: Hadoop Common . SUCCESS
[ 26.895 s]
2017-05-23T23:31:24.401 [INFO] Apache Beam :: SDKs :: Java :: IO :: Hadoop File System SUCCESS
[ 53.028 s]
2017-05-23T23:31:24.401 [INFO] Apache Beam :: SDKs :: Java :: IO :: Hadoop ........ SUCCESS
[  4.398 s]
2017-05-23T23:31:24.401 [INFO] Apache Beam :: SDKs :: Java :: IO :: Hadoop :: input-format
SUCCESS [ 26.194 s]
2017-05-23T23:31:24.401 [INFO] Apache Beam :: Runners :: Google Cloud Dataflow .... SUCCESS
[05:46 min]
2017-05-23T23:31:24.401 [INFO] Apache Beam :: SDKs :: Java :: IO :: Hadoop :: jdk1.8-tests
SUCCESS [01:33 min]
2017-05-23T23:31:24.401 [INFO] Apache Beam :: SDKs :: Java :: IO :: HBase ......... SUCCESS
[01:21 min]
2017-05-23T23:31:24.401 [INFO] Apache Beam :: SDKs :: Java :: IO :: JDBC .......... SUCCESS
[ 29.731 s]
2017-05-23T23:31:24.401 [INFO] Apache Beam :: SDKs :: Java :: IO :: JMS ........... SUCCESS
[ 24.025 s]
2017-05-23T23:31:24.401 [INFO] Apache Beam :: SDKs :: Java :: IO :: Kafka ......... SUCCESS
[ 29.820 s]
2017-05-23T23:31:24.401 [INFO] Apache Beam :: SDKs :: Java :: IO :: Kinesis ....... SUCCESS
[ 32.099 s]
2017-05-23T23:31:24.401 [INFO] Apache Beam :: SDKs :: Java :: IO :: MongoDB ....... SUCCESS
[ 42.243 s]
2017-05-23T23:31:24.401 [INFO] Apache Beam :: SDKs :: Java :: IO :: MQTT .......... SUCCESS
[ 22.580 s]
2017-05-23T23:31:24.401 [INFO] Apache Beam :: SDKs :: Java :: IO :: XML ........... SUCCESS
[ 37.754 s]
2017-05-23T23:31:24.401 [INFO] Apache Beam :: SDKs :: Java :: Maven Archetypes .... SUCCESS
[  1.626 s]
2017-05-23T23:31:24.401 [INFO] Apache Beam :: SDKs :: Java :: Maven Archetypes :: Starter
SUCCESS [ 16.561 s]
2017-05-23T23:31:24.401 [INFO] Apache Beam :: Examples ............................ SUCCESS
[  1.741 s]
2017-05-23T23:31:24.401 [INFO] Apache Beam :: Examples :: Java .................... SUCCESS
[08:02 min]
2017-05-23T23:31:24.401 [INFO] Apache Beam :: SDKs :: Java :: Maven Archetypes :: Examples
SUCCESS [ 39.933 s]
2017-05-23T23:31:24.401 [INFO] Apache Beam :: Examples :: Java 8 .................. SUCCESS
[ 25.886 s]
2017-05-23T23:31:24.402 [INFO] Apache Beam :: SDKs :: Java :: Maven Archetypes :: Examples
- Java 8 SUCCESS [ 43.670 s]
2017-05-23T23:31:24.402 [INFO] Apache Beam :: SDKs :: Java :: Extensions :: Jackson SUCCESS
[ 22.005 s]
2017-05-23T23:31:24.402 [INFO] Apache Beam :: SDKs :: Java :: Extensions :: Join library SUCCESS
[ 20.928 s]
2017-05-23T23:31:24.402 [INFO] Apache Beam :: SDKs :: Java :: Extensions :: Sorter  SUCCESS
[ 48.529 s]
2017-05-23T23:31:24.402 [INFO] Apache Beam :: SDKs :: Java :: Harness ............. SUCCESS
[ 38.826 s]
2017-05-23T23:31:24.402 [INFO] Apache Beam :: SDKs :: Java :: Java 8 Tests ........ SUCCESS
[ 11.132 s]
2017-05-23T23:31:24.402 [INFO] Apache Beam :: SDKs :: Python ...................... SUCCESS
[26:47 min]
2017-05-23T23:31:24.402 [INFO] Apache Beam :: Runners :: Flink .................... SUCCESS
[ 59.909 s]
2017-05-23T23:31:24.402 [INFO] Apache Beam :: Runners :: Spark .................... FAILURE
[04:28 min]
2017-05-23T23:31:24.402 [INFO] Apache Beam :: Runners :: Apex ..................... SKIPPED
2017-05-23T23:31:24.402 [INFO] Apache Beam :: SDKs :: Java :: Aggregated Javadoc .. SKIPPED
2017-05-23T23:31:24.402 [INFO] ------------------------------------------------------------------------
2017-05-23T23:31:24.402 [INFO] BUILD FAILURE
2017-05-23T23:31:24.402 [INFO] ------------------------------------------------------------------------
2017-05-23T23:31:24.402 [INFO] Total time: 01:14 h
2017-05-23T23:31:24.402 [INFO] Finished at: 2017-05-23T23:31:24+00:00

2017-05-23T23:31:25.145 [INFO] Final Memory: 273M/1378M
2017-05-23T23:31:25.145 [INFO] ------------------------------------------------------------------------
Waiting for Jenkins to finish collecting data
2017-05-23T23:31:52.351 [ERROR] Failed to execute goal org.apache.maven.plugins:maven-shade-plugin:3.0.0:shade
(bundle-and-repackage) on project beam-runners-spark: Error creating shaded jar: Could not
resolve following dependencies: [net.java.dev.jets3t:jets3t:jar:0.6.1 (provided)]: Could not
resolve dependencies for project org.apache.beam:beam-runners-spark:jar:2.1.0-SNAPSHOT: Could
not transfer artifact net.java.dev.jets3t:jets3t:jar:0.6.1 from/to central (https://repo.maven.apache.org/maven2):
Connection reset -> [Help 1]
org.apache.maven.lifecycle.LifecycleExecutionException: Failed to execute goal org.apache.maven.plugins:maven-shade-plugin:3.0.0:shade
(bundle-and-repackage) on project beam-runners-spark: Error creating shaded jar: Could not
resolve following dependencies: [net.java.dev.jets3t:jets3t:jar:0.6.1 (provided)]
	at org.apache.maven.lifecycle.internal.MojoExecutor.execute(MojoExecutor.java:216)
	at org.apache.maven.lifecycle.internal.MojoExecutor.execute(MojoExecutor.java:153)
	at org.apache.maven.lifecycle.internal.MojoExecutor.execute(MojoExecutor.java:145)
	at org.apache.maven.lifecycle.internal.LifecycleModuleBuilder.buildProject(LifecycleModuleBuilder.java:116)
	at org.apache.maven.lifecycle.internal.LifecycleModuleBuilder.buildProject(LifecycleModuleBuilder.java:80)
	at org.apache.maven.lifecycle.internal.builder.singlethreaded.SingleThreadedBuilder.build(SingleThreadedBuilder.java:51)
	at org.apache.maven.lifecycle.internal.LifecycleStarter.execute(LifecycleStarter.java:128)
	at org.apache.maven.DefaultMaven.doExecute(DefaultMaven.java:307)
	at org.apache.maven.DefaultMaven.doExecute(DefaultMaven.java:193)
	at org.apache.maven.DefaultMaven.execute(DefaultMaven.java:106)
	at org.jvnet.hudson.maven3.launcher.Maven33Launcher.main(Maven33Launcher.java:129)
	at sun.reflect.NativeMethodAccessorImpl.invoke0(Native Method)
	at sun.reflect.NativeMethodAccessorImpl.invoke(NativeMethodAccessorImpl.java:62)
	at sun.reflect.DelegatingMethodAccessorImpl.invoke(DelegatingMethodAccessorImpl.java:43)
	at java.lang.reflect.Method.invoke(Method.java:498)
	at org.codehaus.plexus.classworlds.launcher.Launcher.launchStandard(Launcher.java:330)
	at org.codehaus.plexus.classworlds.launcher.Launcher.launch(Launcher.java:238)
	at jenkins.maven3.agent.Maven33Main.launch(Maven33Main.java:176)
	at sun.reflect.NativeMethodAccessorImpl.invoke0(Native Method)
	at sun.reflect.NativeMethodAccessorImpl.invoke(NativeMethodAccessorImpl.java:62)
	at sun.reflect.DelegatingMethodAccessorImpl.invoke(DelegatingMethodAccessorImpl.java:43)
	at java.lang.reflect.Method.invoke(Method.java:498)
	at hudson.maven.Maven3Builder.call(Maven3Builder.java:139)
	at hudson.maven.Maven3Builder.call(Maven3Builder.java:70)
	at hudson.remoting.UserRequest.perform(UserRequest.java:153)
	at hudson.remoting.UserRequest.perform(UserRequest.java:50)
	at hudson.remoting.Request$2.run(Request.java:336)
	at hudson.remoting.InterceptingExecutorService$1.call(InterceptingExecutorService.java:68)
	at java.util.concurrent.FutureTask.run(FutureTask.java:266)
	at java.util.concurrent.ThreadPoolExecutor.runWorker(ThreadPoolExecutor.java:1142)
	at java.util.concurrent.ThreadPoolExecutor$Worker.run(ThreadPoolExecutor.java:617)
	at java.lang.Thread.run(Thread.java:745)
Caused by: org.apache.maven.plugin.MojoExecutionException: Error creating shaded jar: Could
not resolve following dependencies: [net.java.dev.jets3t:jets3t:jar:0.6.1 (provided)]
	at org.apache.maven.plugins.shade.mojo.ShadeMojo.execute(ShadeMojo.java:546)
	at org.apache.maven.plugin.DefaultBuildPluginManager.executeMojo(DefaultBuildPluginManager.java:134)
	at org.apache.maven.lifecycle.internal.MojoExecutor.execute(MojoExecutor.java:208)
	... 31 more
Caused by: org.apache.maven.shared.dependency.graph.DependencyGraphBuilderException: Could
not resolve following dependencies: [net.java.dev.jets3t:jets3t:jar:0.6.1 (provided)]
	at org.apache.maven.shared.dependency.graph.internal.Maven31DependencyGraphBuilder.resolveDependencies(Maven31DependencyGraphBuilder.java:133)
	at org.apache.maven.shared.dependency.graph.internal.Maven31DependencyGraphBuilder.buildDependencyGraph(Maven31DependencyGraphBuilder.java:113)
	at org.apache.maven.shared.dependency.graph.internal.DefaultDependencyGraphBuilder.buildDependencyGraph(DefaultDependencyGraphBuilder.java:91)
	at org.apache.maven.shared.dependency.graph.internal.DefaultDependencyGraphBuilder.buildDependencyGraph(DefaultDependencyGraphBuilder.java:66)
	at org.apache.maven.plugins.shade.mojo.ShadeMojo.updateExcludesInDeps(ShadeMojo.java:1133)
	at org.apache.maven.plugins.shade.mojo.ShadeMojo.rewriteDependencyReducedPomIfWeHaveReduction(ShadeMojo.java:1060)
	at org.apache.maven.plugins.shade.mojo.ShadeMojo.createDependencyReducedPom(ShadeMojo.java:970)
	at org.apache.maven.plugins.shade.mojo.ShadeMojo.execute(ShadeMojo.java:538)
	... 33 more
Caused by: org.apache.maven.project.DependencyResolutionException: Could not resolve dependencies
for project org.apache.beam:beam-runners-spark:jar:2.1.0-SNAPSHOT: Could not transfer artifact
net.java.dev.jets3t:jets3t:jar:0.6.1 from/to central (https://repo.maven.apache.org/maven2):
Connection reset
	at org.apache.maven.project.DefaultProjectDependenciesResolver.resolve(DefaultProjectDependenciesResolver.java:211)
	at org.apache.maven.shared.dependency.graph.internal.Maven31DependencyGraphBuilder.resolveDependencies(Maven31DependencyGraphBuilder.java:127)
	... 40 more
Caused by: org.eclipse.aether.resolution.DependencyResolutionException: Could not transfer
artifact net.java.dev.jets3t:jets3t:jar:0.6.1 from/to central (https://repo.maven.apache.org/maven2):
Connection reset
	at org.eclipse.aether.internal.impl.DefaultRepositorySystem.resolveDependencies(DefaultRepositorySystem.java:384)
	at org.apache.maven.project.DefaultProjectDependenciesResolver.resolve(DefaultProjectDependenciesResolver.java:205)
	... 41 more
Caused by: org.eclipse.aether.resolution.ArtifactResolutionException: Could not transfer artifact
net.java.dev.jets3t:jets3t:jar:0.6.1 from/to central (https://repo.maven.apache.org/maven2):
Connection reset
	at org.eclipse.aether.internal.impl.DefaultArtifactResolver.resolve(DefaultArtifactResolver.java:444)
	at org.eclipse.aether.internal.impl.DefaultArtifactResolver.resolveArtifacts(DefaultArtifactResolver.java:246)
	at org.eclipse.aether.internal.impl.DefaultRepositorySystem.resolveDependencies(DefaultRepositorySystem.java:367)
	... 42 more
Caused by: org.eclipse.aether.transfer.ArtifactTransferException: Could not transfer artifact
net.java.dev.jets3t:jets3t:jar:0.6.1 from/to central (https://repo.maven.apache.org/maven2):
Connection reset
	at org.eclipse.aether.connector.basic.ArtifactTransportListener.transferFailed(ArtifactTransportListener.java:43)
	at org.eclipse.aether.connector.basic.BasicRepositoryConnector$TaskRunner.run(BasicRepositoryConnector.java:355)
	at org.eclipse.aether.util.concurrency.RunnableErrorForwarder$1.run(RunnableErrorForwarder.java:67)
	... 3 more
Caused by: org.apache.maven.wagon.TransferFailedException: Connection reset
	at org.apache.maven.wagon.providers.http.AbstractHttpClientWagon.fillInputData(AbstractHttpClientWagon.java:1066)
	at org.apache.maven.wagon.providers.http.AbstractHttpClientWagon.fillInputData(AbstractHttpClientWagon.java:960)
	at org.apache.maven.wagon.StreamWagon.getInputStream(StreamWagon.java:116)
	at org.apache.maven.wagon.StreamWagon.getIfNewer(StreamWagon.java:88)
	at org.apache.maven.wagon.StreamWagon.get(StreamWagon.java:61)
	at org.eclipse.aether.transport.wagon.WagonTransporter$GetTaskRunner.run(WagonTransporter.java:560)
	at org.eclipse.aether.transport.wagon.WagonTransporter.execute(WagonTransporter.java:427)
	at org.eclipse.aether.transport.wagon.WagonTransporter.get(WagonTransporter.java:404)
	at org.eclipse.aether.connector.basic.BasicRepositoryConnector$GetTaskRunner.runTask(BasicRepositoryConnector.java:447)
	at org.eclipse.aether.connector.basic.BasicRepositoryConnector$TaskRunner.run(BasicRepositoryConnector.java:350)
	... 4 more
Caused by: java.net.SocketException: Connection reset
	at java.net.SocketInputStream.read(SocketInputStream.java:210)
	at java.net.SocketInputStream.read(SocketInputStream.java:141)
	at sun.security.ssl.InputRecord.readFully(InputRecord.java:465)
	at sun.security.ssl.InputRecord.read(InputRecord.java:503)
	at sun.security.ssl.SSLSocketImpl.readRecord(SSLSocketImpl.java:973)
	at sun.security.ssl.SSLSocketImpl.readDataRecord(SSLSocketImpl.java:930)
	at sun.security.ssl.AppInputStream.read(AppInputStream.java:105)
	at org.apache.maven.wagon.providers.http.httpclient.impl.io.SessionInputBufferImpl.streamRead(SessionInputBufferImpl.java:136)
	at org.apache.maven.wagon.providers.http.httpclient.impl.io.SessionInputBufferImpl.fillBuffer(SessionInputBufferImpl.java:152)
	at org.apache.maven.wagon.providers.http.httpclient.impl.io.SessionInputBufferImpl.readLine(SessionInputBufferImpl.java:270)
	at org.apache.maven.wagon.providers.http.httpclient.impl.conn.DefaultHttpResponseParser.parseHead(DefaultHttpResponseParser.java:140)
	at org.apache.maven.wagon.providers.http.httpclient.impl.conn.DefaultHttpResponseParser.parseHead(DefaultHttpResponseParser.java:57)
	at org.apache.maven.wagon.providers.http.httpclient.impl.io.AbstractMessageParser.parse(AbstractMessageParser.java:260)
	at org.apache.maven.wagon.providers.http.httpclient.impl.DefaultBHttpClientConnection.receiveResponseHeader(DefaultBHttpClientConnection.java:161)
	at org.apache.maven.wagon.providers.http.httpclient.impl.conn.CPoolProxy.receiveResponseHeader(CPoolProxy.java:153)
	at org.apache.maven.wagon.providers.http.httpclient.protocol.HttpRequestExecutor.doReceiveResponse(HttpRequestExecutor.java:271)
	at org.apache.maven.wagon.providers.http.httpclient.protocol.HttpRequestExecutor.execute(HttpRequestExecutor.java:123)
	at org.apache.maven.wagon.providers.http.httpclient.impl.execchain.MainClientExec.execute(MainClientExec.java:254)
	at org.apache.maven.wagon.providers.http.httpclient.impl.execchain.ProtocolExec.execute(ProtocolExec.java:195)
	at org.apache.maven.wagon.providers.http.httpclient.impl.execchain.RetryExec.execute(RetryExec.java:86)
	at org.apache.maven.wagon.providers.http.httpclient.impl.execchain.RedirectExec.execute(RedirectExec.java:108)
	at org.apache.maven.wagon.providers.http.httpclient.impl.client.InternalHttpClient.doExecute(InternalHttpClient.java:184)
	at org.apache.maven.wagon.providers.http.httpclient.impl.client.CloseableHttpClient.execute(CloseableHttpClient.java:82)
	at org.apache.maven.wagon.providers.http.AbstractHttpClientWagon.execute(AbstractHttpClientWagon.java:832)
	at org.apache.maven.wagon.providers.http.AbstractHttpClientWagon.fillInputData(AbstractHttpClientWagon.java:983)
	... 13 more
2017-05-23T23:31:52.353 [ERROR] 
2017-05-23T23:31:52.353 [ERROR] Re-run Maven using the -X switch to enable full debug logging.
2017-05-23T23:31:52.353 [ERROR] 
2017-05-23T23:31:52.353 [ERROR] For more information about the errors and possible solutions,
please read the following articles:
2017-05-23T23:31:52.353 [ERROR] [Help 1] http://cwiki.apache.org/confluence/display/MAVEN/MojoExecutionException
2017-05-23T23:31:52.354 [ERROR] 
2017-05-23T23:31:52.354 [ERROR] After correcting the problems, you can resume the build with
the command
2017-05-23T23:31:52.354 [ERROR]   mvn <goals> -rf :beam-runners-spark
channel stopped

Mime
View raw message