beam-commits mailing list archives

Site index · List index
Message view « Date » · « Thread »
Top « Date » · « Thread »
From Apache Jenkins Server <jenk...@builds.apache.org>
Subject Build failed in Jenkins: beam_PostCommit_Java_JDK_Versions_Test » JDK 1.7 (latest),beam #2
Date Tue, 02 May 2017 23:37:15 GMT
See <https://builds.apache.org/job/beam_PostCommit_Java_JDK_Versions_Test/jdk=JDK%201.7%20(latest),label=beam/2/display/redirect>

------------------------------------------
[...truncated 724.19 KB...]
2017-05-02\T\23:36:49.164 [INFO] Downloading: https://repo.maven.apache.org/maven2/org/apache/hadoop/hadoop-common/2.7.3/hadoop-common-2.7.3-tests.jar
2017-05-02\T\23:36:49.192 [INFO] Downloaded: https://repo.maven.apache.org/maven2/org/apache/hadoop/hadoop-minicluster/2.7.3/hadoop-minicluster-2.7.3.jar
(25 KB at 833.1 KB/sec)
2017-05-02\T\23:36:49.192 [INFO] Downloading: https://repo.maven.apache.org/maven2/org/apache/hadoop/hadoop-yarn-server-tests/2.7.3/hadoop-yarn-server-tests-2.7.3-tests.jar
2017-05-02\T\23:36:49.222 [INFO] Downloaded: https://repo.maven.apache.org/maven2/org/apache/avro/avro-ipc/1.8.1/avro-ipc-1.8.1.jar
(129 KB at 2111.9 KB/sec)
2017-05-02\T\23:36:49.223 [INFO] Downloading: https://repo.maven.apache.org/maven2/org/apache/hadoop/hadoop-yarn-server-nodemanager/2.7.3/hadoop-yarn-server-nodemanager-2.7.3.jar
2017-05-02\T\23:36:49.236 [INFO] Downloaded: https://repo.maven.apache.org/maven2/org/apache/hadoop/hadoop-yarn-server-tests/2.7.3/hadoop-yarn-server-tests-2.7.3-tests.jar
(75 KB at 1019.8 KB/sec)
2017-05-02\T\23:36:49.236 [INFO] Downloading: https://repo.maven.apache.org/maven2/org/apache/hadoop/hadoop-yarn-server-resourcemanager/2.7.3/hadoop-yarn-server-resourcemanager-2.7.3.jar
2017-05-02\T\23:36:49.247 [INFO] Downloaded: https://repo.maven.apache.org/maven2/org/apache/avro/avro-mapred/1.8.1/avro-mapred-1.8.1-hadoop2.jar
(182 KB at 2115.1 KB/sec)
2017-05-02\T\23:36:49.247 [INFO] Downloading: https://repo.maven.apache.org/maven2/org/apache/hadoop/hadoop-yarn-server-applicationhistoryservice/2.7.3/hadoop-yarn-server-applicationhistoryservice-2.7.3.jar
2017-05-02\T\23:36:49.259 [INFO] Downloaded: https://repo.maven.apache.org/maven2/commons-codec/commons-codec/1.9/commons-codec-1.9.jar
(258 KB at 2630.4 KB/sec)
2017-05-02\T\23:36:49.259 [INFO] Downloading: https://repo.maven.apache.org/maven2/org/apache/hadoop/hadoop-yarn-server-web-proxy/2.7.3/hadoop-yarn-server-web-proxy-2.7.3.jar
2017-05-02\T\23:36:49.288 [INFO] Downloaded: https://repo.maven.apache.org/maven2/org/apache/hadoop/hadoop-yarn-server-web-proxy/2.7.3/hadoop-yarn-server-web-proxy-2.7.3.jar
(58 KB at 456.3 KB/sec)
2017-05-02\T\23:36:49.288 [INFO] Downloading: https://repo.maven.apache.org/maven2/org/apache/zookeeper/zookeeper/3.4.6/zookeeper-3.4.6-tests.jar
2017-05-02\T\23:36:49.307 [INFO] Downloaded: https://repo.maven.apache.org/maven2/org/apache/hadoop/hadoop-yarn-server-applicationhistoryservice/2.7.3/hadoop-yarn-server-applicationhistoryservice-2.7.3.jar
(216 KB at 1494.8 KB/sec)
2017-05-02\T\23:36:49.307 [INFO] Downloading: https://repo.maven.apache.org/maven2/org/apache/hadoop/hadoop-mapreduce-client-jobclient/2.7.3/hadoop-mapreduce-client-jobclient-2.7.3-tests.jar
2017-05-02\T\23:36:49.391 [INFO] Downloaded: https://repo.maven.apache.org/maven2/org/apache/hadoop/hadoop-yarn-server-nodemanager/2.7.3/hadoop-yarn-server-nodemanager-2.7.3.jar
(703 KB at 3079.3 KB/sec)
2017-05-02\T\23:36:49.391 [INFO] Downloading: https://repo.maven.apache.org/maven2/org/apache/hadoop/hadoop-mapreduce-client-hs/2.7.3/hadoop-mapreduce-client-hs-2.7.3.jar
2017-05-02\T\23:36:49.399 [INFO] Downloaded: https://repo.maven.apache.org/maven2/org/apache/zookeeper/zookeeper/3.4.6/zookeeper-3.4.6-tests.jar
(527 KB at 2231.5 KB/sec)
2017-05-02\T\23:36:49.399 [INFO] Downloading: https://repo.maven.apache.org/maven2/org/apache/hadoop/hadoop-hdfs/2.7.3/hadoop-hdfs-2.7.3-tests.jar
2017-05-02\T\23:36:49.431 [INFO] Downloaded: https://repo.maven.apache.org/maven2/org/apache/hadoop/hadoop-yarn-server-resourcemanager/2.7.3/hadoop-yarn-server-resourcemanager-2.7.3.jar
(1257 KB at 4690.0 KB/sec)
2017-05-02\T\23:36:49.431 [INFO] Downloading: https://repo.maven.apache.org/maven2/commons-daemon/commons-daemon/1.0.13/commons-daemon-1.0.13.jar
2017-05-02\T\23:36:49.431 [INFO] Downloaded: https://repo.maven.apache.org/maven2/org/apache/hadoop/hadoop-mapreduce-client-hs/2.7.3/hadoop-mapreduce-client-hs-2.7.3.jar
(188 KB at 698.5 KB/sec)
2017-05-02\T\23:36:49.451 [INFO] Downloaded: https://repo.maven.apache.org/maven2/org/apache/hadoop/hadoop-common/2.7.3/hadoop-common-2.7.3-tests.jar
(1878 KB at 6497.6 KB/sec)
2017-05-02\T\23:36:49.458 [INFO] Downloaded: https://repo.maven.apache.org/maven2/commons-daemon/commons-daemon/1.0.13/commons-daemon-1.0.13.jar
(24 KB at 80.2 KB/sec)
2017-05-02\T\23:36:49.528 [INFO] Downloaded: https://repo.maven.apache.org/maven2/org/apache/hadoop/hadoop-mapreduce-client-jobclient/2.7.3/hadoop-mapreduce-client-jobclient-2.7.3-tests.jar
(1521 KB at 4166.0 KB/sec)
2017-05-02\T\23:36:49.675 [INFO] Downloaded: https://repo.maven.apache.org/maven2/org/apache/hadoop/hadoop-hdfs/2.7.3/hadoop-hdfs-2.7.3-tests.jar
(3277 KB at 6398.8 KB/sec)
2017-05-02\T\23:36:49.683 [INFO] 
2017-05-02\T\23:36:49.684 [INFO] --- maven-clean-plugin:3.0.0:clean (default-clean) @ beam-sdks-java-io-hadoop-file-system
---
2017-05-02\T\23:36:49.685 [INFO] Deleting <https://builds.apache.org/job/beam_PostCommit_Java_JDK_Versions_Test/jdk=JDK%201.7%20(latest),label=beam/ws/sdks/java/io/hadoop-file-system>
(includes = [**/*.pyc, **/*.egg-info/], excludes = [])
2017-05-02\T\23:36:49.687 [INFO] 
2017-05-02\T\23:36:49.687 [INFO] --- maven-enforcer-plugin:1.4.1:enforce (enforce) @ beam-sdks-java-io-hadoop-file-system
---
2017-05-02\T\23:36:51.409 [INFO] 
2017-05-02\T\23:36:51.409 [INFO] --- maven-remote-resources-plugin:1.5:process (process-resource-bundles)
@ beam-sdks-java-io-hadoop-file-system ---
2017-05-02\T\23:36:51.691 [INFO] 
2017-05-02\T\23:36:51.691 [INFO] --- maven-resources-plugin:2.7:resources (default-resources)
@ beam-sdks-java-io-hadoop-file-system ---
2017-05-02\T\23:36:51.692 [INFO] Using 'UTF-8' encoding to copy filtered resources.
2017-05-02\T\23:36:51.692 [INFO] skip non existing resourceDirectory <https://builds.apache.org/job/beam_PostCommit_Java_JDK_Versions_Test/jdk=JDK%201.7%20(latest),label=beam/ws/sdks/java/io/hadoop-file-system/src/main/resources>
2017-05-02\T\23:36:51.692 [INFO] Copying 3 resources
2017-05-02\T\23:36:51.693 [INFO] 
2017-05-02\T\23:36:51.693 [INFO] --- maven-compiler-plugin:3.6.1:compile (default-compile)
@ beam-sdks-java-io-hadoop-file-system ---
2017-05-02\T\23:36:51.697 [INFO] Changes detected - recompiling the module!
2017-05-02\T\23:36:51.697 [INFO] Compiling 11 source files to <https://builds.apache.org/job/beam_PostCommit_Java_JDK_Versions_Test/jdk=JDK%201.7%20(latest),label=beam/ws/sdks/java/io/hadoop-file-system/target/classes>
2017-05-02\T\23:36:52.796 [INFO] <https://builds.apache.org/job/beam_PostCommit_Java_JDK_Versions_Test/jdk=JDK%201.7%20(latest),label=beam/ws/sdks/java/io/hadoop-file-system/src/main/java/org/apache/beam/sdk/io/hdfs/HDFSFileSink.java>:
Some input files use or override a deprecated API.
2017-05-02\T\23:36:52.796 [INFO] <https://builds.apache.org/job/beam_PostCommit_Java_JDK_Versions_Test/jdk=JDK%201.7%20(latest),label=beam/ws/sdks/java/io/hadoop-file-system/src/main/java/org/apache/beam/sdk/io/hdfs/HDFSFileSink.java>:
Recompile with -Xlint:deprecation for details.
2017-05-02\T\23:36:52.796 [INFO] <https://builds.apache.org/job/beam_PostCommit_Java_JDK_Versions_Test/jdk=JDK%201.7%20(latest),label=beam/ws/sdks/java/io/hadoop-file-system/src/main/java/org/apache/beam/sdk/io/hdfs/HDFSFileSink.java>:
Some input files use unchecked or unsafe operations.
2017-05-02\T\23:36:52.796 [INFO] <https://builds.apache.org/job/beam_PostCommit_Java_JDK_Versions_Test/jdk=JDK%201.7%20(latest),label=beam/ws/sdks/java/io/hadoop-file-system/src/main/java/org/apache/beam/sdk/io/hdfs/HDFSFileSink.java>:
Recompile with -Xlint:unchecked for details.
2017-05-02\T\23:36:52.796 [INFO] 
2017-05-02\T\23:36:52.796 [INFO] --- maven-compiler-plugin:3.6.1:compile (compile-package-info)
@ beam-sdks-java-io-hadoop-file-system ---
2017-05-02\T\23:36:52.801 [INFO] Changes detected - recompiling the module!
2017-05-02\T\23:36:52.802 [INFO] Compiling 1 source file to <https://builds.apache.org/job/beam_PostCommit_Java_JDK_Versions_Test/jdk=JDK%201.7%20(latest),label=beam/ws/sdks/java/io/hadoop-file-system/target/classes>
2017-05-02\T\23:36:52.947 [INFO] 
2017-05-02\T\23:36:52.947 [INFO] --- maven-resources-plugin:2.7:testResources (default-testResources)
@ beam-sdks-java-io-hadoop-file-system ---
2017-05-02\T\23:36:52.948 [INFO] Using 'UTF-8' encoding to copy filtered resources.
2017-05-02\T\23:36:52.948 [INFO] skip non existing resourceDirectory <https://builds.apache.org/job/beam_PostCommit_Java_JDK_Versions_Test/jdk=JDK%201.7%20(latest),label=beam/ws/sdks/java/io/hadoop-file-system/src/test/resources>
2017-05-02\T\23:36:52.949 [INFO] Copying 3 resources
2017-05-02\T\23:36:52.950 [INFO] 
2017-05-02\T\23:36:52.950 [INFO] --- maven-compiler-plugin:3.6.1:testCompile (default-testCompile)
@ beam-sdks-java-io-hadoop-file-system ---
2017-05-02\T\23:36:52.962 [INFO] Changes detected - recompiling the module!
2017-05-02\T\23:36:52.963 [INFO] Compiling 7 source files to <https://builds.apache.org/job/beam_PostCommit_Java_JDK_Versions_Test/jdk=JDK%201.7%20(latest),label=beam/ws/sdks/java/io/hadoop-file-system/target/test-classes>
2017-05-02\T\23:36:53.269 [INFO] <https://builds.apache.org/job/beam_PostCommit_Java_JDK_Versions_Test/jdk=JDK%201.7%20(latest),label=beam/ws/sdks/java/io/hadoop-file-system/src/test/java/org/apache/beam/sdk/io/hdfs/HDFSFileSinkTest.java>:
<https://builds.apache.org/job/beam_PostCommit_Java_JDK_Versions_Test/jdk=JDK%201.7%20(latest),label=beam/ws/sdks/java/io/hadoop-file-system/src/test/java/org/apache/beam/sdk/io/hdfs/HDFSFileSinkTest.java>
uses or overrides a deprecated API.
2017-05-02\T\23:36:53.269 [INFO] <https://builds.apache.org/job/beam_PostCommit_Java_JDK_Versions_Test/jdk=JDK%201.7%20(latest),label=beam/ws/sdks/java/io/hadoop-file-system/src/test/java/org/apache/beam/sdk/io/hdfs/HDFSFileSinkTest.java>:
Recompile with -Xlint:deprecation for details.
2017-05-02\T\23:36:53.270 [INFO] <https://builds.apache.org/job/beam_PostCommit_Java_JDK_Versions_Test/jdk=JDK%201.7%20(latest),label=beam/ws/sdks/java/io/hadoop-file-system/src/test/java/org/apache/beam/sdk/io/hdfs/HadoopFileSystemOptionsTest.java>:
Some input files use unchecked or unsafe operations.
2017-05-02\T\23:36:53.270 [INFO] <https://builds.apache.org/job/beam_PostCommit_Java_JDK_Versions_Test/jdk=JDK%201.7%20(latest),label=beam/ws/sdks/java/io/hadoop-file-system/src/test/java/org/apache/beam/sdk/io/hdfs/HadoopFileSystemOptionsTest.java>:
Recompile with -Xlint:unchecked for details.
2017-05-02\T\23:36:53.270 [INFO] 
2017-05-02\T\23:36:53.271 [INFO] --- maven-checkstyle-plugin:2.17:check (default) @ beam-sdks-java-io-hadoop-file-system
---
2017-05-02\T\23:36:54.817 [INFO] Starting audit...
Audit done.
2017-05-02\T\23:36:54.818 [INFO] 
2017-05-02\T\23:36:54.818 [INFO] --- maven-surefire-plugin:2.20:test (default-test) @ beam-sdks-java-io-hadoop-file-system
---
2017-05-02\T\23:36:54.824 [INFO] Surefire report directory: <https://builds.apache.org/job/beam_PostCommit_Java_JDK_Versions_Test/jdk=JDK%201.7%20(latest),label=beam/ws/sdks/java/io/hadoop-file-system/target/surefire-reports>
2017-05-02\T\23:36:54.825 [INFO] Using configured provider org.apache.maven.surefire.junitcore.JUnitCoreProvider
2017-05-02\T\23:36:54.825 [INFO] parallel='none', perCoreThreadCount=true, threadCount=0,
useUnlimitedThreads=false, threadCountSuites=0, threadCountClasses=0, threadCountMethods=0,
parallelOptimized=true
2017-05-02\T\23:36:54.826 [INFO] 
2017-05-02\T\23:36:54.827 [INFO] -------------------------------------------------------
2017-05-02\T\23:36:54.827 [INFO]  T E S T S
2017-05-02\T\23:36:54.827 [INFO] -------------------------------------------------------
2017-05-02\T\23:36:56.411 [INFO] Running org.apache.beam.sdk.io.hdfs.HadoopFileSystemTest
2017-05-02\T\23:37:10.426 [WARNING] Tests run: 7, Failures: 0, Errors: 0, Skipped: 1, Time
elapsed: 14.013 s - in org.apache.beam.sdk.io.hdfs.HadoopFileSystemTest
2017-05-02\T\23:37:10.426 [INFO] Running org.apache.beam.sdk.io.hdfs.HadoopFileSystemRegistrarTest
2017-05-02\T\23:37:11.365 [INFO] Tests run: 1, Failures: 0, Errors: 0, Skipped: 0, Time elapsed:
0.938 s - in org.apache.beam.sdk.io.hdfs.HadoopFileSystemRegistrarTest
2017-05-02\T\23:37:11.365 [INFO] Running org.apache.beam.sdk.io.hdfs.HDFSFileSourceTest
2017-05-02\T\23:37:13.346 [INFO] Tests run: 6, Failures: 0, Errors: 0, Skipped: 0, Time elapsed:
1.979 s - in org.apache.beam.sdk.io.hdfs.HDFSFileSourceTest
2017-05-02\T\23:37:13.346 [INFO] Running org.apache.beam.sdk.io.hdfs.HadoopFileSystemOptionsRegistrarTest
2017-05-02\T\23:37:13.350 [INFO] Tests run: 1, Failures: 0, Errors: 0, Skipped: 0, Time elapsed:
0.002 s - in org.apache.beam.sdk.io.hdfs.HadoopFileSystemOptionsRegistrarTest
2017-05-02\T\23:37:13.350 [INFO] Running org.apache.beam.sdk.io.hdfs.HadoopFileSystemOptionsTest
2017-05-02\T\23:37:13.427 [INFO] Tests run: 1, Failures: 0, Errors: 0, Skipped: 0, Time elapsed:
0.075 s - in org.apache.beam.sdk.io.hdfs.HadoopFileSystemOptionsTest
2017-05-02\T\23:37:13.427 [INFO] Running org.apache.beam.sdk.io.hdfs.HadoopFileSystemModuleTest
2017-05-02\T\23:37:13.452 [ERROR] Tests run: 2, Failures: 1, Errors: 0, Skipped: 0, Time elapsed:
0.022 s <<< FAILURE! - in org.apache.beam.sdk.io.hdfs.HadoopFileSystemModuleTest
2017-05-02\T\23:37:13.452 [ERROR] testConfigurationSerializationDeserialization(org.apache.beam.sdk.io.hdfs.HadoopFileSystemModuleTest)
 Time elapsed: 0.02 s  <<< FAILURE!
java.lang.AssertionError: 

Expected: iterable containing [<testPropertyA=A>, <testPropertyB=B>, <testPropertyC=baseC>]
     but: item 0: was <testPropertyC=baseC>
	at org.hamcrest.MatcherAssert.assertThat(MatcherAssert.java:20)
	at org.junit.Assert.assertThat(Assert.java:956)
	at org.junit.Assert.assertThat(Assert.java:923)
	at org.apache.beam.sdk.io.hdfs.HadoopFileSystemModuleTest.testConfigurationSerializationDeserialization(HadoopFileSystemModuleTest.java:60)
	at sun.reflect.NativeMethodAccessorImpl.invoke0(Native Method)
	at sun.reflect.NativeMethodAccessorImpl.invoke(NativeMethodAccessorImpl.java:57)
	at sun.reflect.DelegatingMethodAccessorImpl.invoke(DelegatingMethodAccessorImpl.java:43)
	at java.lang.reflect.Method.invoke(Method.java:606)
	at org.junit.runners.model.FrameworkMethod$1.runReflectiveCall(FrameworkMethod.java:50)
	at org.junit.internal.runners.model.ReflectiveCallable.run(ReflectiveCallable.java:12)
	at org.junit.runners.model.FrameworkMethod.invokeExplosively(FrameworkMethod.java:47)
	at org.junit.internal.runners.statements.InvokeMethod.evaluate(InvokeMethod.java:17)
	at org.junit.runners.ParentRunner.runLeaf(ParentRunner.java:325)
	at org.junit.runners.BlockJUnit4ClassRunner.runChild(BlockJUnit4ClassRunner.java:78)
	at org.junit.runners.BlockJUnit4ClassRunner.runChild(BlockJUnit4ClassRunner.java:57)
	at org.junit.runners.ParentRunner$3.run(ParentRunner.java:290)
	at org.junit.runners.ParentRunner$1.schedule(ParentRunner.java:71)
	at org.junit.runners.ParentRunner.runChildren(ParentRunner.java:288)
	at org.junit.runners.ParentRunner.access$000(ParentRunner.java:58)
	at org.junit.runners.ParentRunner$2.evaluate(ParentRunner.java:268)
	at org.junit.runners.ParentRunner.run(ParentRunner.java:363)
	at org.junit.runners.Suite.runChild(Suite.java:128)
	at org.junit.runners.Suite.runChild(Suite.java:27)
	at org.junit.runners.ParentRunner$3.run(ParentRunner.java:290)
	at org.junit.runners.ParentRunner$1.schedule(ParentRunner.java:71)
	at org.junit.runners.ParentRunner.runChildren(ParentRunner.java:288)
	at org.junit.runners.ParentRunner.access$000(ParentRunner.java:58)
	at org.junit.runners.ParentRunner$2.evaluate(ParentRunner.java:268)
	at org.junit.runners.ParentRunner.run(ParentRunner.java:363)
	at org.apache.maven.surefire.junitcore.JUnitCore.run(JUnitCore.java:55)
	at org.apache.maven.surefire.junitcore.JUnitCoreWrapper.createRequestAndRun(JUnitCoreWrapper.java:137)
	at org.apache.maven.surefire.junitcore.JUnitCoreWrapper.executeEager(JUnitCoreWrapper.java:107)
	at org.apache.maven.surefire.junitcore.JUnitCoreWrapper.execute(JUnitCoreWrapper.java:83)
	at org.apache.maven.surefire.junitcore.JUnitCoreWrapper.execute(JUnitCoreWrapper.java:75)
	at org.apache.maven.surefire.junitcore.JUnitCoreProvider.invoke(JUnitCoreProvider.java:157)
	at org.apache.maven.surefire.booter.ForkedBooter.invokeProviderInSameClassLoader(ForkedBooter.java:386)
	at org.apache.maven.surefire.booter.ForkedBooter.runSuitesInProcess(ForkedBooter.java:323)
	at org.apache.maven.surefire.booter.ForkedBooter.main(ForkedBooter.java:143)

2017-05-02\T\23:37:13.452 [INFO] Running org.apache.beam.sdk.io.hdfs.HDFSFileSinkTest
2017-05-02\T\23:37:13.730 [INFO] Tests run: 3, Failures: 0, Errors: 0, Skipped: 0, Time elapsed:
0.276 s - in org.apache.beam.sdk.io.hdfs.HDFSFileSinkTest
2017-05-02\T\23:37:14.214 [INFO] 
2017-05-02\T\23:37:14.215 [INFO] Results:
2017-05-02\T\23:37:14.215 [INFO] 
2017-05-02\T\23:37:14.215 [ERROR] Failures: 
2017-05-02\T\23:37:14.215 [ERROR]   HadoopFileSystemModuleTest.testConfigurationSerializationDeserialization:60

Expected: iterable containing [<testPropertyA=A>, <testPropertyB=B>, <testPropertyC=baseC>]
     but: item 0: was <testPropertyC=baseC>
2017-05-02\T\23:37:14.215 [INFO] 
2017-05-02\T\23:37:14.215 [ERROR] Tests run: 21, Failures: 1, Errors: 0, Skipped: 1
2017-05-02\T\23:37:14.215 [INFO] 
2017-05-02\T\23:37:14.216 [INFO] ------------------------------------------------------------------------
2017-05-02\T\23:37:14.216 [INFO] Reactor Summary:
2017-05-02\T\23:37:14.216 [INFO] 
2017-05-02\T\23:37:14.216 [INFO] Apache Beam :: Parent .............................. SUCCESS
[ 20.746 s]
2017-05-02\T\23:37:14.216 [INFO] Apache Beam :: SDKs :: Java :: Build Tools ......... SUCCESS
[  9.188 s]
2017-05-02\T\23:37:14.216 [INFO] Apache Beam :: SDKs ................................ SUCCESS
[  0.828 s]
2017-05-02\T\23:37:14.216 [INFO] Apache Beam :: SDKs :: Common ...................... SUCCESS
[  0.654 s]
2017-05-02\T\23:37:14.216 [INFO] Apache Beam :: SDKs :: Common :: Fn API ............ SUCCESS
[ 14.836 s]
2017-05-02\T\23:37:14.216 [INFO] Apache Beam :: SDKs :: Common :: Runner API ........ SUCCESS
[  2.268 s]
2017-05-02\T\23:37:14.216 [INFO] Apache Beam :: SDKs :: Java ........................ SUCCESS
[  0.956 s]
2017-05-02\T\23:37:14.216 [INFO] Apache Beam :: SDKs :: Java :: Core ................ SUCCESS
[01:23 min]
2017-05-02\T\23:37:14.216 [INFO] Apache Beam :: SDKs :: Java :: IO .................. SUCCESS
[  0.517 s]
2017-05-02\T\23:37:14.216 [INFO] Apache Beam :: SDKs :: Java :: IO :: Common ........ SUCCESS
[  2.015 s]
2017-05-02\T\23:37:14.216 [INFO] Apache Beam :: Runners ............................. SUCCESS
[  0.446 s]
2017-05-02\T\23:37:14.216 [INFO] Apache Beam :: Runners :: Core Construction Java ... SUCCESS
[  7.177 s]
2017-05-02\T\23:37:14.216 [INFO] Apache Beam :: Runners :: Core Java ................ SUCCESS
[ 27.083 s]
2017-05-02\T\23:37:14.216 [INFO] Apache Beam :: Runners :: Direct Java .............. SUCCESS
[02:45 min]
2017-05-02\T\23:37:14.217 [INFO] Apache Beam :: SDKs :: Java :: IO :: Elasticsearch . SUCCESS
[ 27.916 s]
2017-05-02\T\23:37:14.217 [INFO] Apache Beam :: SDKs :: Java :: Extensions .......... SUCCESS
[  0.394 s]
2017-05-02\T\23:37:14.217 [INFO] Apache Beam :: SDKs :: Java :: Extensions :: Google Cloud
Platform Core SUCCESS [ 18.927 s]
2017-05-02\T\23:37:14.217 [INFO] Apache Beam :: SDKs :: Java :: Extensions :: Protobuf SUCCESS
[ 14.249 s]
2017-05-02\T\23:37:14.217 [INFO] Apache Beam :: SDKs :: Java :: IO :: Google Cloud Platform
SUCCESS [01:21 min]
2017-05-02\T\23:37:14.217 [INFO] Apache Beam :: SDKs :: Java :: IO :: Hadoop Common . SUCCESS
[ 13.064 s]
2017-05-02\T\23:37:14.217 [INFO] Apache Beam :: SDKs :: Java :: IO :: Hadoop File System FAILURE
[ 25.588 s]
2017-05-02\T\23:37:14.217 [INFO] Apache Beam :: SDKs :: Java :: IO :: Hadoop ........ SKIPPED
2017-05-02\T\23:37:14.217 [INFO] Apache Beam :: SDKs :: Java :: IO :: Hadoop :: input-format
SKIPPED
2017-05-02\T\23:37:14.217 [INFO] Apache Beam :: SDKs :: Java :: IO :: HBase ......... SKIPPED
2017-05-02\T\23:37:14.217 [INFO] Apache Beam :: Runners :: Google Cloud Dataflow .... SKIPPED
2017-05-02\T\23:37:14.217 [INFO] Apache Beam :: SDKs :: Java :: IO :: JDBC .......... SKIPPED
2017-05-02\T\23:37:14.217 [INFO] Apache Beam :: SDKs :: Java :: IO :: JMS ........... SKIPPED
2017-05-02\T\23:37:14.217 [INFO] Apache Beam :: SDKs :: Java :: IO :: Kafka ......... SKIPPED
2017-05-02\T\23:37:14.217 [INFO] Apache Beam :: SDKs :: Java :: IO :: Kinesis ....... SKIPPED
2017-05-02\T\23:37:14.217 [INFO] Apache Beam :: SDKs :: Java :: IO :: MongoDB ....... SKIPPED
2017-05-02\T\23:37:14.217 [INFO] Apache Beam :: SDKs :: Java :: IO :: MQTT .......... SKIPPED
2017-05-02\T\23:37:14.217 [INFO] Apache Beam :: SDKs :: Java :: IO :: XML ........... SKIPPED
2017-05-02\T\23:37:14.217 [INFO] Apache Beam :: SDKs :: Java :: Maven Archetypes .... SKIPPED
2017-05-02\T\23:37:14.217 [INFO] Apache Beam :: SDKs :: Java :: Maven Archetypes :: Starter
SKIPPED
2017-05-02\T\23:37:14.217 [INFO] Apache Beam :: SDKs :: Java :: Maven Archetypes :: Examples
SKIPPED
2017-05-02\T\23:37:14.217 [INFO] Apache Beam :: SDKs :: Java :: Extensions :: Jackson SKIPPED
2017-05-02\T\23:37:14.217 [INFO] Apache Beam :: SDKs :: Java :: Extensions :: Join library
SKIPPED
2017-05-02\T\23:37:14.217 [INFO] Apache Beam :: SDKs :: Java :: Extensions :: Sorter  SKIPPED
2017-05-02\T\23:37:14.217 [INFO] Apache Beam :: Runners :: Flink .................... SKIPPED
2017-05-02\T\23:37:14.217 [INFO] Apache Beam :: Runners :: Spark .................... SKIPPED
2017-05-02\T\23:37:14.217 [INFO] Apache Beam :: Runners :: Apex ..................... SKIPPED
2017-05-02\T\23:37:14.217 [INFO] Apache Beam :: Examples ............................ SKIPPED
2017-05-02\T\23:37:14.217 [INFO] Apache Beam :: Examples :: Java .................... SKIPPED
2017-05-02\T\23:37:14.217 [INFO] Apache Beam :: SDKs :: Java :: Aggregated Javadoc .. SKIPPED
2017-05-02\T\23:37:14.217 [INFO] ------------------------------------------------------------------------
2017-05-02\T\23:37:14.217 [INFO] BUILD FAILURE
2017-05-02\T\23:37:14.217 [INFO] ------------------------------------------------------------------------
2017-05-02\T\23:37:14.217 [INFO] Total time: 08:42 min
2017-05-02\T\23:37:14.217 [INFO] Finished at: 2017-05-02T23:37:14+00:00
2017-05-02\T\23:37:14.885 [INFO] Final Memory: 147M/1486M
2017-05-02\T\23:37:14.885 [INFO] ------------------------------------------------------------------------
2017-05-02\T\23:37:14.886 [ERROR] Failed to execute goal org.apache.maven.plugins:maven-surefire-plugin:2.20:test
(default-test) on project beam-sdks-java-io-hadoop-file-system: There are test failures.
2017-05-02\T\23:37:14.886 [ERROR] 
2017-05-02\T\23:37:14.886 [ERROR] Please refer to <https://builds.apache.org/job/beam_PostCommit_Java_JDK_Versions_Test/jdk=JDK%201.7%20(latest),label=beam/ws/sdks/java/io/hadoop-file-system/target/surefire-reports>
for the individual test results.
2017-05-02\T\23:37:14.886 [ERROR] Please refer to dump files (if any exist) [date]-jvmRun[N].dump,
[date].dumpstream and [date]-jvmRun[N].dumpstream.
2017-05-02\T\23:37:14.886 [ERROR] -> [Help 1]
org.apache.maven.lifecycle.LifecycleExecutionException: Failed to execute goal org.apache.maven.plugins:maven-surefire-plugin:2.20:test
(default-test) on project beam-sdks-java-io-hadoop-file-system: There are test failures.

Please refer to <https://builds.apache.org/job/beam_PostCommit_Java_JDK_Versions_Test/jdk=JDK%201.7%20(latest),label=beam/ws/sdks/java/io/hadoop-file-system/target/surefire-reports>
for the individual test results.
Please refer to dump files (if any exist) [date]-jvmRun[N].dump, [date].dumpstream and [date]-jvmRun[N].dumpstream.
	at org.apache.maven.lifecycle.internal.MojoExecutor.execute(MojoExecutor.java:212)
	at org.apache.maven.lifecycle.internal.MojoExecutor.execute(MojoExecutor.java:153)
	at org.apache.maven.lifecycle.internal.MojoExecutor.execute(MojoExecutor.java:145)
	at org.apache.maven.lifecycle.internal.LifecycleModuleBuilder.buildProject(LifecycleModuleBuilder.java:116)
	at org.apache.maven.lifecycle.internal.LifecycleModuleBuilder.buildProject(LifecycleModuleBuilder.java:80)
	at org.apache.maven.lifecycle.internal.builder.singlethreaded.SingleThreadedBuilder.build(SingleThreadedBuilder.java:51)
	at org.apache.maven.lifecycle.internal.LifecycleStarter.execute(LifecycleStarter.java:128)
	at org.apache.maven.DefaultMaven.doExecute(DefaultMaven.java:307)
	at org.apache.maven.DefaultMaven.doExecute(DefaultMaven.java:193)
	at org.apache.maven.DefaultMaven.execute(DefaultMaven.java:106)
	at org.apache.maven.cli.MavenCli.execute(MavenCli.java:862)
	at org.apache.maven.cli.MavenCli.doMain(MavenCli.java:286)
	at org.apache.maven.cli.MavenCli.main(MavenCli.java:197)
	at sun.reflect.NativeMethodAccessorImpl.invoke0(Native Method)
	at sun.reflect.NativeMethodAccessorImpl.invoke(NativeMethodAccessorImpl.java:57)
	at sun.reflect.DelegatingMethodAccessorImpl.invoke(DelegatingMethodAccessorImpl.java:43)
	at java.lang.reflect.Method.invoke(Method.java:606)
	at org.codehaus.plexus.classworlds.launcher.Launcher.launchEnhanced(Launcher.java:289)
	at org.codehaus.plexus.classworlds.launcher.Launcher.launch(Launcher.java:229)
	at org.codehaus.plexus.classworlds.launcher.Launcher.mainWithExitCode(Launcher.java:415)
	at org.codehaus.plexus.classworlds.launcher.Launcher.main(Launcher.java:356)
Caused by: org.apache.maven.plugin.MojoFailureException: There are test failures.

Please refer to <https://builds.apache.org/job/beam_PostCommit_Java_JDK_Versions_Test/jdk=JDK%201.7%20(latest),label=beam/ws/sdks/java/io/hadoop-file-system/target/surefire-reports>
for the individual test results.
Please refer to dump files (if any exist) [date]-jvmRun[N].dump, [date].dumpstream and [date]-jvmRun[N].dumpstream.
	at org.apache.maven.plugin.surefire.SurefireHelper.throwException(SurefireHelper.java:204)
	at org.apache.maven.plugin.surefire.SurefireHelper.reportExecution(SurefireHelper.java:98)
	at org.apache.maven.plugin.surefire.SurefirePlugin.handleSummary(SurefirePlugin.java:334)
	at org.apache.maven.plugin.surefire.AbstractSurefireMojo.executeAfterPreconditionsChecked(AbstractSurefireMojo.java:937)
	at org.apache.maven.plugin.surefire.AbstractSurefireMojo.execute(AbstractSurefireMojo.java:785)
	at org.apache.maven.plugin.DefaultBuildPluginManager.executeMojo(DefaultBuildPluginManager.java:134)
	at org.apache.maven.lifecycle.internal.MojoExecutor.execute(MojoExecutor.java:208)
	... 20 more
2017-05-02\T\23:37:14.887 [ERROR] 
2017-05-02\T\23:37:14.887 [ERROR] Re-run Maven using the -X switch to enable full debug logging.
2017-05-02\T\23:37:14.887 [ERROR] 
2017-05-02\T\23:37:14.887 [ERROR] For more information about the errors and possible solutions,
please read the following articles:
2017-05-02\T\23:37:14.887 [ERROR] [Help 1] http://cwiki.apache.org/confluence/display/MAVEN/MojoFailureException
2017-05-02\T\23:37:14.887 [ERROR] 
2017-05-02\T\23:37:14.887 [ERROR] After correcting the problems, you can resume the build
with the command
2017-05-02\T\23:37:14.887 [ERROR]   mvn <goals> -rf :beam-sdks-java-io-hadoop-file-system
Build step 'Invoke top-level Maven targets' marked build as failure

Mime
View raw message