beam-commits mailing list archives

Site index · List index
Message view « Date » · « Thread »
Top « Date » · « Thread »
From Apache Jenkins Server <jenk...@builds.apache.org>
Subject Build failed in Jenkins: beam_PostCommit_Java_MavenInstall #3974
Date Wed, 31 May 2017 19:10:30 GMT
See <https://builds.apache.org/job/beam_PostCommit_Java_MavenInstall/3974/display/redirect>

------------------------------------------
[...truncated 3.07 MB...]
2017-05-31T19:08:46.997 [INFO] Downloaded: https://repo.maven.apache.org/maven2/org/apache/sling/org.apache.sling.commons.json/2.0.6/org.apache.sling.commons.json-2.0.6.jar
(47 KB at 54.6 KB/sec)
2017-05-31T19:08:46.997 [INFO] Downloading: https://repo.maven.apache.org/maven2/org/apache/flink/flink-runtime_2.10/1.2.1/flink-runtime_2.10-1.2.1-tests.jar
2017-05-31T19:08:47.052 [INFO] Downloaded: https://repo.maven.apache.org/maven2/org/apache/flink/flink-core/1.2.1/flink-core-1.2.1-tests.jar
(716 KB at 784.9 KB/sec)
2017-05-31T19:08:47.052 [INFO] Downloading: https://repo.maven.apache.org/maven2/org/apache/flink/flink-streaming-java_2.10/1.2.1/flink-streaming-java_2.10-1.2.1-tests.jar
2017-05-31T19:08:47.160 [INFO] Downloaded: https://repo.maven.apache.org/maven2/org/scala-lang/scala-library/2.10.4/scala-library-2.10.4.jar
(6960 KB at 6822.9 KB/sec)
2017-05-31T19:08:47.160 [INFO] Downloading: https://repo.maven.apache.org/maven2/org/apache/flink/flink-test-utils_2.10/1.2.1/flink-test-utils_2.10-1.2.1.jar
2017-05-31T19:08:47.180 [INFO] Downloaded: https://repo.maven.apache.org/maven2/org/apache/flink/flink-streaming-java_2.10/1.2.1/flink-streaming-java_2.10-1.2.1-tests.jar
(953 KB at 916.2 KB/sec)
2017-05-31T19:08:47.180 [INFO] Downloading: https://repo.maven.apache.org/maven2/org/apache/flink/flink-test-utils-junit/1.2.1/flink-test-utils-junit-1.2.1.jar
2017-05-31T19:08:47.198 [INFO] Downloaded: https://repo.maven.apache.org/maven2/org/apache/flink/flink-streaming-java_2.10/1.2.1/flink-streaming-java_2.10-1.2.1.jar
(3035 KB at 2867.9 KB/sec)
2017-05-31T19:08:47.198 [INFO] Downloading: https://repo.maven.apache.org/maven2/org/apache/curator/curator-test/2.8.0/curator-test-2.8.0.jar
2017-05-31T19:08:47.210 [INFO] Downloaded: https://repo.maven.apache.org/maven2/org/apache/flink/flink-test-utils-junit/1.2.1/flink-test-utils-junit-1.2.1.jar
(24 KB at 21.5 KB/sec)
2017-05-31T19:08:47.227 [INFO] Downloaded: https://repo.maven.apache.org/maven2/org/apache/curator/curator-test/2.8.0/curator-test-2.8.0.jar
(39 KB at 35.9 KB/sec)
2017-05-31T19:08:47.253 [INFO] Downloaded: https://repo.maven.apache.org/maven2/org/apache/flink/flink-runtime_2.10/1.2.1/flink-runtime_2.10-1.2.1-tests.jar
(2432 KB at 2186.8 KB/sec)
2017-05-31T19:08:47.367 [INFO] Downloaded: https://repo.maven.apache.org/maven2/org/apache/flink/flink-test-utils_2.10/1.2.1/flink-test-utils_2.10-1.2.1.jar
(2366 KB at 1929.6 KB/sec)
2017-05-31T19:08:47.693 [INFO] Downloaded: https://repo.maven.apache.org/maven2/org/apache/flink/flink-shaded-hadoop2/1.2.1/flink-shaded-hadoop2-1.2.1.jar
(17860 KB at 11499.9 KB/sec)
2017-05-31T19:08:47.710 [INFO] 
2017-05-31T19:08:47.710 [INFO] --- maven-clean-plugin:3.0.0:clean (default-clean) @ beam-runners-flink_2.10
---
2017-05-31T19:08:47.713 [INFO] Deleting <https://builds.apache.org/job/beam_PostCommit_Java_MavenInstall/ws/runners/flink>
(includes = [**/*.pyc, **/*.egg-info/, **/sdks/python/LICENSE, **/sdks/python/NOTICE, **/sdks/python/README.md],
excludes = [])
2017-05-31T19:08:47.767 [INFO] 
2017-05-31T19:08:47.767 [INFO] --- maven-enforcer-plugin:1.4.1:enforce (enforce) @ beam-runners-flink_2.10
---
2017-05-31T19:08:50.124 [INFO] 
2017-05-31T19:08:50.124 [INFO] --- maven-enforcer-plugin:1.4.1:enforce (enforce-banned-dependencies)
@ beam-runners-flink_2.10 ---
2017-05-31T19:08:50.220 [INFO] 
2017-05-31T19:08:50.220 [INFO] --- maven-remote-resources-plugin:1.5:process (process-resource-bundles)
@ beam-runners-flink_2.10 ---
2017-05-31T19:08:50.762 [INFO] 
2017-05-31T19:08:50.762 [INFO] --- maven-resources-plugin:3.0.2:resources (default-resources)
@ beam-runners-flink_2.10 ---
2017-05-31T19:08:50.764 [INFO] Using 'UTF-8' encoding to copy filtered resources.
2017-05-31T19:08:50.764 [INFO] Copying 1 resource
2017-05-31T19:08:50.764 [INFO] Copying 3 resources
2017-05-31T19:08:50.855 [INFO] 
2017-05-31T19:08:50.855 [INFO] --- maven-compiler-plugin:3.6.1:compile (default-compile) @
beam-runners-flink_2.10 ---
2017-05-31T19:08:50.867 [INFO] Changes detected - recompiling the module!
2017-05-31T19:08:50.868 [INFO] Compiling 75 source files to <https://builds.apache.org/job/beam_PostCommit_Java_MavenInstall/ws/runners/flink/target/classes>
2017-05-31T19:08:51.620 [WARNING] bootstrap class path not set in conjunction with -source
1.7
2017-05-31T19:08:51.620 [INFO] <https://builds.apache.org/job/beam_PostCommit_Java_MavenInstall/ws/runners/flink/src/main/java/org/apache/beam/runners/flink/FlinkStreamingTransformTranslators.java>:
Some input files use or override a deprecated API.
2017-05-31T19:08:51.620 [INFO] <https://builds.apache.org/job/beam_PostCommit_Java_MavenInstall/ws/runners/flink/src/main/java/org/apache/beam/runners/flink/FlinkStreamingTransformTranslators.java>:
Recompile with -Xlint:deprecation for details.
2017-05-31T19:08:51.620 [INFO] <https://builds.apache.org/job/beam_PostCommit_Java_MavenInstall/ws/runners/flink/src/main/java/org/apache/beam/runners/flink/translation/wrappers/streaming/state/FlinkKeyGroupStateInternals.java>:
Some input files use unchecked or unsafe operations.
2017-05-31T19:08:51.620 [INFO] <https://builds.apache.org/job/beam_PostCommit_Java_MavenInstall/ws/runners/flink/src/main/java/org/apache/beam/runners/flink/translation/wrappers/streaming/state/FlinkKeyGroupStateInternals.java>:
Recompile with -Xlint:unchecked for details.
2017-05-31T19:08:52.442 [INFO] 
2017-05-31T19:08:52.442 [INFO] --- maven-resources-plugin:3.0.2:testResources (default-testResources)
@ beam-runners-flink_2.10 ---
2017-05-31T19:08:52.443 [INFO] Using 'UTF-8' encoding to copy filtered resources.
2017-05-31T19:08:52.443 [INFO] Copying 1 resource
2017-05-31T19:08:52.444 [INFO] Copying 3 resources
2017-05-31T19:08:52.536 [INFO] 
2017-05-31T19:08:52.536 [INFO] --- maven-compiler-plugin:3.6.1:testCompile (default-testCompile)
@ beam-runners-flink_2.10 ---
2017-05-31T19:08:52.549 [INFO] Changes detected - recompiling the module!
2017-05-31T19:08:52.549 [INFO] Compiling 17 source files to <https://builds.apache.org/job/beam_PostCommit_Java_MavenInstall/ws/runners/flink/target/test-classes>
2017-05-31T19:08:53.035 [INFO] <https://builds.apache.org/job/beam_PostCommit_Java_MavenInstall/ws/runners/flink/src/test/java/org/apache/beam/runners/flink/streaming/FlinkKeyGroupStateInternalsTest.java>:
Some input files use unchecked or unsafe operations.
2017-05-31T19:08:53.035 [INFO] <https://builds.apache.org/job/beam_PostCommit_Java_MavenInstall/ws/runners/flink/src/test/java/org/apache/beam/runners/flink/streaming/FlinkKeyGroupStateInternalsTest.java>:
Recompile with -Xlint:unchecked for details.
2017-05-31T19:08:53.151 [INFO] 
2017-05-31T19:08:53.151 [INFO] --- maven-checkstyle-plugin:2.17:check (default) @ beam-runners-flink_2.10
---
2017-05-31T19:08:54.469 [INFO] Starting audit...
Audit done.
2017-05-31T19:08:54.521 [INFO] 
2017-05-31T19:08:54.521 [INFO] >>> findbugs-maven-plugin:3.0.4:check (default) >
:findbugs @ beam-runners-flink_2.10 >>>
2017-05-31T19:08:54.540 [INFO] 
2017-05-31T19:08:54.540 [INFO] --- findbugs-maven-plugin:3.0.4:findbugs (findbugs) @ beam-runners-flink_2.10
---
2017-05-31T19:08:54.545 [INFO] Fork Value is true
     [java] Warnings generated: 2
2017-05-31T19:09:08.763 [INFO] Done FindBugs Analysis....
2017-05-31T19:09:08.930 [INFO] 
2017-05-31T19:09:08.930 [INFO] <<< findbugs-maven-plugin:3.0.4:check (default) <
:findbugs @ beam-runners-flink_2.10 <<<
2017-05-31T19:09:08.930 [INFO] 
2017-05-31T19:09:08.931 [INFO] --- findbugs-maven-plugin:3.0.4:check (default) @ beam-runners-flink_2.10
---
2017-05-31T19:09:08.940 [INFO] BugInstance size is 2
2017-05-31T19:09:08.940 [INFO] Error size is 0
2017-05-31T19:09:08.943 [INFO] Total bugs: 2
2017-05-31T19:09:08.949 [INFO] Possible null pointer dereference of FlinkDoFnFunction.outputMap
in org.apache.beam.runners.flink.translation.functions.FlinkDoFnFunction.mapPartition(Iterable,
Collector) [org.apache.beam.runners.flink.translation.functions.FlinkDoFnFunction, org.apache.beam.runners.flink.translation.functions.FlinkDoFnFunction,
org.apache.beam.runners.flink.translation.functions.FlinkDoFnFunction] Dereferenced at FlinkDoFnFunction.java:[line
101]Null value at FlinkDoFnFunction.java:[line 93]Known null at FlinkDoFnFunction.java:[line
94] NP_NULL_ON_SOME_PATH
2017-05-31T19:09:08.950 [INFO] Possible null pointer dereference of FlinkStatefulDoFnFunction.outputMap
in org.apache.beam.runners.flink.translation.functions.FlinkStatefulDoFnFunction.reduce(Iterable,
Collector) [org.apache.beam.runners.flink.translation.functions.FlinkStatefulDoFnFunction,
org.apache.beam.runners.flink.translation.functions.FlinkStatefulDoFnFunction, org.apache.beam.runners.flink.translation.functions.FlinkStatefulDoFnFunction]
Dereferenced at FlinkStatefulDoFnFunction.java:[line 118]Null value at FlinkStatefulDoFnFunction.java:[line
94]Known null at FlinkStatefulDoFnFunction.java:[line 95] NP_NULL_ON_SOME_PATH
2017-05-31T19:09:08.950 [INFO] 


To see bug detail using the Findbugs GUI, use the following command "mvn findbugs:gui"



[JENKINS] Archiving disabled
2017-05-31T19:09:10.113 [INFO]                                                           
             
2017-05-31T19:09:10.113 [INFO] ------------------------------------------------------------------------
2017-05-31T19:09:10.113 [INFO] Skipping Apache Beam :: Parent
2017-05-31T19:09:10.113 [INFO] This project has been banned from the build due to previous
failures.
2017-05-31T19:09:10.113 [INFO] ------------------------------------------------------------------------
[JENKINS] Archiving disabled
[JENKINS] Archiving disabled
[JENKINS] Archiving disabled
[JENKINS] Archiving disabled
[JENKINS] Archiving disabled
[JENKINS] Archiving disabled
[JENKINS] Archiving disabled
[JENKINS] Archiving disabled
[JENKINS] Archiving disabled
[JENKINS] Archiving disabled
[JENKINS] Archiving disabled
[JENKINS] Archiving disabled
[JENKINS] Archiving disabled
[JENKINS] Archiving disabled
[JENKINS] Archiving disabled
[JENKINS] Archiving disabled
[JENKINS] Archiving disabled
[JENKINS] Archiving disabled
[JENKINS] Archiving disabled
[JENKINS] Archiving disabled
[JENKINS] Archiving disabled
[JENKINS] Archiving disabled
[JENKINS] Archiving disabled
[JENKINS] Archiving disabled
[JENKINS] Archiving disabled
[JENKINS] Archiving disabled
[JENKINS] Archiving disabled
[JENKINS] Archiving disabled
[JENKINS] Archiving disabled
[JENKINS] Archiving disabled
[JENKINS] Archiving disabled
[JENKINS] Archiving disabled
[JENKINS] Archiving disabled
[JENKINS] Archiving disabled
[JENKINS] Archiving disabled
[JENKINS] Archiving disabled
[JENKINS] Archiving disabled
[JENKINS] Archiving disabled
[JENKINS] Archiving disabled
[JENKINS] Archiving disabled
[JENKINS] Archiving disabled
[JENKINS] Archiving disabled
[JENKINS] Archiving disabled
[JENKINS] Archiving disabled
[JENKINS] Archiving disabled
[JENKINS] Archiving disabled
2017-05-31T19:09:32.936 [INFO] ------------------------------------------------------------------------
2017-05-31T19:09:32.936 [INFO] Reactor Summary:
2017-05-31T19:09:32.936 [INFO] 
2017-05-31T19:09:32.936 [INFO] Apache Beam :: Parent .............................. SUCCESS
[ 42.054 s]
2017-05-31T19:09:32.936 [INFO] Apache Beam :: SDKs :: Java :: Build Tools ......... SUCCESS
[ 12.869 s]
2017-05-31T19:09:32.936 [INFO] Apache Beam :: SDKs ................................ SUCCESS
[  4.950 s]
2017-05-31T19:09:32.936 [INFO] Apache Beam :: SDKs :: Common ...................... SUCCESS
[  2.000 s]
2017-05-31T19:09:32.936 [INFO] Apache Beam :: SDKs :: Common :: Fn API ............ SUCCESS
[ 23.297 s]
2017-05-31T19:09:32.936 [INFO] Apache Beam :: SDKs :: Common :: Runner API ........ SUCCESS
[ 16.634 s]
2017-05-31T19:09:32.936 [INFO] Apache Beam :: SDKs :: Java ........................ SUCCESS
[  1.928 s]
2017-05-31T19:09:32.936 [INFO] Apache Beam :: SDKs :: Java :: Core ................ SUCCESS
[02:53 min]
2017-05-31T19:09:32.936 [INFO] Apache Beam :: SDKs :: Java :: IO .................. SUCCESS
[  1.969 s]
2017-05-31T19:09:32.936 [INFO] Apache Beam :: SDKs :: Java :: IO :: Common ........ SUCCESS
[  4.670 s]
2017-05-31T19:09:32.936 [INFO] Apache Beam :: Runners ............................. SUCCESS
[  1.656 s]
2017-05-31T19:09:32.936 [INFO] Apache Beam :: Runners :: Core Construction Java ... SUCCESS
[ 31.810 s]
2017-05-31T19:09:32.936 [INFO] Apache Beam :: Runners :: Core Java ................ SUCCESS
[ 59.316 s]
2017-05-31T19:09:32.936 [INFO] Apache Beam :: Runners :: Direct Java .............. SUCCESS
[03:44 min]
2017-05-31T19:09:32.936 [INFO] Apache Beam :: SDKs :: Java :: IO :: Elasticsearch . SUCCESS
[ 47.238 s]
2017-05-31T19:09:32.936 [INFO] Apache Beam :: SDKs :: Java :: Extensions .......... SUCCESS
[  2.008 s]
2017-05-31T19:09:32.936 [INFO] Apache Beam :: SDKs :: Java :: Extensions :: Google Cloud Platform
Core SUCCESS [ 38.949 s]
2017-05-31T19:09:32.936 [INFO] Apache Beam :: SDKs :: Java :: Extensions :: Protobuf SUCCESS
[ 20.820 s]
2017-05-31T19:09:32.936 [INFO] Apache Beam :: SDKs :: Java :: IO :: Google Cloud Platform
SUCCESS [01:37 min]
2017-05-31T19:09:32.936 [INFO] Apache Beam :: SDKs :: Java :: IO :: Hadoop Common . SUCCESS
[ 22.539 s]
2017-05-31T19:09:32.936 [INFO] Apache Beam :: SDKs :: Java :: IO :: Hadoop File System SUCCESS
[ 42.433 s]
2017-05-31T19:09:32.936 [INFO] Apache Beam :: SDKs :: Java :: IO :: Hadoop ........ SUCCESS
[  4.251 s]
2017-05-31T19:09:32.936 [INFO] Apache Beam :: SDKs :: Java :: IO :: Hadoop :: input-format
SUCCESS [ 24.193 s]
2017-05-31T19:09:32.936 [INFO] Apache Beam :: Runners :: Google Cloud Dataflow .... SUCCESS
[06:01 min]
2017-05-31T19:09:32.936 [INFO] Apache Beam :: SDKs :: Java :: IO :: Hadoop :: jdk1.8-tests
SUCCESS [01:14 min]
2017-05-31T19:09:32.936 [INFO] Apache Beam :: SDKs :: Java :: IO :: HBase ......... SUCCESS
[01:02 min]
2017-05-31T19:09:32.936 [INFO] Apache Beam :: SDKs :: Java :: IO :: JDBC .......... SUCCESS
[ 23.568 s]
2017-05-31T19:09:32.936 [INFO] Apache Beam :: SDKs :: Java :: IO :: JMS ........... SUCCESS
[ 19.203 s]
2017-05-31T19:09:32.936 [INFO] Apache Beam :: SDKs :: Java :: IO :: Kafka ......... SUCCESS
[ 25.458 s]
2017-05-31T19:09:32.936 [INFO] Apache Beam :: SDKs :: Java :: IO :: Kinesis ....... SUCCESS
[ 23.992 s]
2017-05-31T19:09:32.936 [INFO] Apache Beam :: SDKs :: Java :: IO :: MongoDB ....... SUCCESS
[ 32.896 s]
2017-05-31T19:09:32.936 [INFO] Apache Beam :: SDKs :: Java :: IO :: MQTT .......... SUCCESS
[ 19.367 s]
2017-05-31T19:09:32.936 [INFO] Apache Beam :: SDKs :: Java :: IO :: XML ........... SUCCESS
[ 24.993 s]
2017-05-31T19:09:32.936 [INFO] Apache Beam :: SDKs :: Java :: Maven Archetypes .... SUCCESS
[  1.658 s]
2017-05-31T19:09:32.937 [INFO] Apache Beam :: SDKs :: Java :: Maven Archetypes :: Starter
SUCCESS [ 12.995 s]
2017-05-31T19:09:32.937 [INFO] Apache Beam :: Examples ............................ SUCCESS
[  1.985 s]
2017-05-31T19:09:32.937 [INFO] Apache Beam :: Examples :: Java .................... SUCCESS
[06:57 min]
2017-05-31T19:09:32.937 [INFO] Apache Beam :: SDKs :: Java :: Maven Archetypes :: Examples
SUCCESS [ 26.694 s]
2017-05-31T19:09:32.937 [INFO] Apache Beam :: Examples :: Java 8 .................. SUCCESS
[ 17.094 s]
2017-05-31T19:09:32.937 [INFO] Apache Beam :: SDKs :: Java :: Maven Archetypes :: Examples
- Java 8 SUCCESS [ 30.745 s]
2017-05-31T19:09:32.937 [INFO] Apache Beam :: SDKs :: Java :: Extensions :: Jackson SUCCESS
[ 18.392 s]
2017-05-31T19:09:32.937 [INFO] Apache Beam :: SDKs :: Java :: Extensions :: Join library SUCCESS
[ 14.884 s]
2017-05-31T19:09:32.937 [INFO] Apache Beam :: SDKs :: Java :: Extensions :: Sorter  SUCCESS
[ 28.542 s]
2017-05-31T19:09:32.937 [INFO] Apache Beam :: SDKs :: Java :: Harness ............. SUCCESS
[ 32.034 s]
2017-05-31T19:09:32.937 [INFO] Apache Beam :: SDKs :: Java :: Java 8 Tests ........ SUCCESS
[  9.806 s]
2017-05-31T19:09:32.937 [INFO] Apache Beam :: SDKs :: Python ...................... SUCCESS
[29:19 min]
2017-05-31T19:09:32.937 [INFO] Apache Beam :: Runners :: Flink .................... FAILURE
[ 26.747 s]
2017-05-31T19:09:32.937 [INFO] Apache Beam :: Runners :: Spark .................... SKIPPED
2017-05-31T19:09:32.937 [INFO] Apache Beam :: Runners :: Apex ..................... SKIPPED
2017-05-31T19:09:32.937 [INFO] Apache Beam :: SDKs :: Java :: Aggregated Javadoc .. SKIPPED
2017-05-31T19:09:32.937 [INFO] ------------------------------------------------------------------------
2017-05-31T19:09:32.937 [INFO] BUILD FAILURE
2017-05-31T19:09:32.937 [INFO] ------------------------------------------------------------------------
2017-05-31T19:09:32.937 [INFO] Total time: 01:07 h
2017-05-31T19:09:32.937 [INFO] Finished at: 2017-05-31T19:09:32+00:00
2017-05-31T19:09:33.612 [INFO] Final Memory: 260M/2075M
2017-05-31T19:09:33.612 [INFO] ------------------------------------------------------------------------
Waiting for Jenkins to finish collecting data
2017-05-31T19:10:19.548 [ERROR] Failed to execute goal org.codehaus.mojo:findbugs-maven-plugin:3.0.4:check
(default) on project beam-runners-flink_2.10: failed with 2 bugs and 0 errors -> [Help
1]
org.apache.maven.lifecycle.LifecycleExecutionException: Failed to execute goal org.codehaus.mojo:findbugs-maven-plugin:3.0.4:check
(default) on project beam-runners-flink_2.10: failed with 2 bugs and 0 errors 
	at org.apache.maven.lifecycle.internal.MojoExecutor.execute(MojoExecutor.java:216)
	at org.apache.maven.lifecycle.internal.MojoExecutor.execute(MojoExecutor.java:153)
	at org.apache.maven.lifecycle.internal.MojoExecutor.execute(MojoExecutor.java:145)
	at org.apache.maven.lifecycle.internal.LifecycleModuleBuilder.buildProject(LifecycleModuleBuilder.java:116)
	at org.apache.maven.lifecycle.internal.LifecycleModuleBuilder.buildProject(LifecycleModuleBuilder.java:80)
	at org.apache.maven.lifecycle.internal.builder.singlethreaded.SingleThreadedBuilder.build(SingleThreadedBuilder.java:51)
	at org.apache.maven.lifecycle.internal.LifecycleStarter.execute(LifecycleStarter.java:128)
	at org.apache.maven.DefaultMaven.doExecute(DefaultMaven.java:307)
	at org.apache.maven.DefaultMaven.doExecute(DefaultMaven.java:193)
	at org.apache.maven.DefaultMaven.execute(DefaultMaven.java:106)
	at org.jvnet.hudson.maven3.launcher.Maven33Launcher.main(Maven33Launcher.java:129)
	at sun.reflect.NativeMethodAccessorImpl.invoke0(Native Method)
	at sun.reflect.NativeMethodAccessorImpl.invoke(NativeMethodAccessorImpl.java:62)
	at sun.reflect.DelegatingMethodAccessorImpl.invoke(DelegatingMethodAccessorImpl.java:43)
	at java.lang.reflect.Method.invoke(Method.java:498)
	at org.codehaus.plexus.classworlds.launcher.Launcher.launchStandard(Launcher.java:330)
	at org.codehaus.plexus.classworlds.launcher.Launcher.launch(Launcher.java:238)
	at jenkins.maven3.agent.Maven33Main.launch(Maven33Main.java:176)
	at sun.reflect.NativeMethodAccessorImpl.invoke0(Native Method)
	at sun.reflect.NativeMethodAccessorImpl.invoke(NativeMethodAccessorImpl.java:62)
	at sun.reflect.DelegatingMethodAccessorImpl.invoke(DelegatingMethodAccessorImpl.java:43)
	at java.lang.reflect.Method.invoke(Method.java:498)
	at hudson.maven.Maven3Builder.call(Maven3Builder.java:139)
	at hudson.maven.Maven3Builder.call(Maven3Builder.java:70)
	at hudson.remoting.UserRequest.perform(UserRequest.java:153)
	at hudson.remoting.UserRequest.perform(UserRequest.java:50)
	at hudson.remoting.Request$2.run(Request.java:336)
	at hudson.remoting.InterceptingExecutorService$1.call(InterceptingExecutorService.java:68)
	at java.util.concurrent.FutureTask.run(FutureTask.java:266)
	at java.util.concurrent.ThreadPoolExecutor.runWorker(ThreadPoolExecutor.java:1142)
	at java.util.concurrent.ThreadPoolExecutor$Worker.run(ThreadPoolExecutor.java:617)
	at java.lang.Thread.run(Thread.java:745)
Caused by: org.apache.maven.plugin.MojoExecutionException: failed with 2 bugs and 0 errors

	at sun.reflect.NativeConstructorAccessorImpl.newInstance0(Native Method)
	at sun.reflect.NativeConstructorAccessorImpl.newInstance(NativeConstructorAccessorImpl.java:62)
	at sun.reflect.DelegatingConstructorAccessorImpl.newInstance(DelegatingConstructorAccessorImpl.java:45)
	at java.lang.reflect.Constructor.newInstance(Constructor.java:423)
	at org.codehaus.groovy.reflection.CachedConstructor.invoke(CachedConstructor.java:83)
	at org.codehaus.groovy.reflection.CachedConstructor.doConstructorInvoke(CachedConstructor.java:77)
	at org.codehaus.groovy.runtime.callsite.ConstructorSite$ConstructorSiteNoUnwrap.callConstructor(ConstructorSite.java:84)
	at org.codehaus.groovy.runtime.callsite.CallSiteArray.defaultCallConstructor(CallSiteArray.java:60)
	at org.codehaus.groovy.runtime.callsite.AbstractCallSite.callConstructor(AbstractCallSite.java:235)
	at org.codehaus.groovy.runtime.callsite.AbstractCallSite.callConstructor(AbstractCallSite.java:247)
	at org.codehaus.mojo.findbugs.FindbugsViolationCheckMojo.execute(FindbugsViolationCheckMojo.groovy:529)
	at org.apache.maven.plugin.DefaultBuildPluginManager.executeMojo(DefaultBuildPluginManager.java:134)
	at org.apache.maven.lifecycle.internal.MojoExecutor.execute(MojoExecutor.java:208)
	... 31 more
2017-05-31T19:10:19.549 [ERROR] 
2017-05-31T19:10:19.549 [ERROR] Re-run Maven using the -X switch to enable full debug logging.
2017-05-31T19:10:19.549 [ERROR] 
2017-05-31T19:10:19.549 [ERROR] For more information about the errors and possible solutions,
please read the following articles:
2017-05-31T19:10:19.549 [ERROR] [Help 1] http://cwiki.apache.org/confluence/display/MAVEN/MojoExecutionException
2017-05-31T19:10:19.550 [ERROR] 
2017-05-31T19:10:19.550 [ERROR] After correcting the problems, you can resume the build with
the command
2017-05-31T19:10:19.550 [ERROR]   mvn <goals> -rf :beam-runners-flink_2.10
channel stopped
Not sending mail to unregistered user kirpichov@google.com
Not sending mail to unregistered user aljoscha.krettek@gmail.com

Mime
View raw message