beam-commits mailing list archives

Site index · List index
Message view « Date » · « Thread »
Top « Date » · « Thread »
From Apache Jenkins Server <jenk...@builds.apache.org>
Subject Build failed in Jenkins: beam_PostCommit_Java_MavenInstall #3943
Date Sat, 27 May 2017 00:07:09 GMT
See <https://builds.apache.org/job/beam_PostCommit_Java_MavenInstall/3943/display/redirect>

------------------------------------------
[...truncated 473.46 KB...]
2017-05-27T00:06:31.853 [INFO] --- maven-compiler-plugin:3.6.1:compile (default-compile) @
beam-sdks-java-io-common ---
2017-05-27T00:06:31.855 [INFO] No sources to compile
2017-05-27T00:06:32.033 [INFO] 
2017-05-27T00:06:32.033 [INFO] --- maven-resources-plugin:3.0.2:testResources (default-testResources)
@ beam-sdks-java-io-common ---
2017-05-27T00:06:32.034 [INFO] Using 'UTF-8' encoding to copy filtered resources.
2017-05-27T00:06:32.034 [INFO] skip non existing resourceDirectory <https://builds.apache.org/job/beam_PostCommit_Java_MavenInstall/ws/sdks/java/io/common/src/test/resources>
2017-05-27T00:06:32.035 [INFO] Copying 3 resources
2017-05-27T00:06:32.085 [INFO] 
2017-05-27T00:06:32.085 [INFO] --- maven-compiler-plugin:3.6.1:testCompile (default-testCompile)
@ beam-sdks-java-io-common ---
2017-05-27T00:06:32.091 [INFO] Changes detected - recompiling the module!
2017-05-27T00:06:32.092 [INFO] Compiling 2 source files to <https://builds.apache.org/job/beam_PostCommit_Java_MavenInstall/ws/sdks/java/io/common/target/test-classes>
2017-05-27T00:06:32.194 [INFO] 
2017-05-27T00:06:32.194 [INFO] --- maven-checkstyle-plugin:2.17:check (default) @ beam-sdks-java-io-common
---
2017-05-27T00:06:32.635 [INFO] Starting audit...
Audit done.
2017-05-27T00:06:32.686 [INFO] 
2017-05-27T00:06:32.686 [INFO] >>> findbugs-maven-plugin:3.0.4:check (default) >
:findbugs @ beam-sdks-java-io-common >>>
2017-05-27T00:06:32.692 [INFO] 
2017-05-27T00:06:32.692 [INFO] --- findbugs-maven-plugin:3.0.4:findbugs (findbugs) @ beam-sdks-java-io-common
---
2017-05-27T00:06:32.887 [INFO] 
2017-05-27T00:06:32.887 [INFO] <<< findbugs-maven-plugin:3.0.4:check (default) <
:findbugs @ beam-sdks-java-io-common <<<
2017-05-27T00:06:32.888 [INFO] 
2017-05-27T00:06:32.888 [INFO] --- findbugs-maven-plugin:3.0.4:check (default) @ beam-sdks-java-io-common
---
2017-05-27T00:06:32.941 [INFO] 
2017-05-27T00:06:32.941 [INFO] --- maven-surefire-plugin:2.20:test (default-test) @ beam-sdks-java-io-common
---
[JENKINS] Recording test results
2017-05-27T00:06:33.225 [INFO] 
2017-05-27T00:06:33.225 [INFO] --- build-helper-maven-plugin:3.0.0:regex-properties (render-artifact-id)
@ beam-sdks-java-io-common ---
2017-05-27T00:06:33.611 [INFO] 
2017-05-27T00:06:33.612 [INFO] --- maven-jar-plugin:3.0.2:jar (default-jar) @ beam-sdks-java-io-common
---
2017-05-27T00:06:33.615 [INFO] Building jar: <https://builds.apache.org/job/beam_PostCommit_Java_MavenInstall/ws/sdks/java/io/common/target/beam-sdks-java-io-common-2.1.0-SNAPSHOT.jar>
2017-05-27T00:06:33.713 [INFO] 
2017-05-27T00:06:33.713 [INFO] --- maven-site-plugin:3.5.1:attach-descriptor (attach-descriptor)
@ beam-sdks-java-io-common ---
2017-05-27T00:06:33.814 [INFO] 
2017-05-27T00:06:33.814 [INFO] --- maven-jar-plugin:3.0.2:test-jar (default-test-jar) @ beam-sdks-java-io-common
---
2017-05-27T00:06:33.818 [INFO] Building jar: <https://builds.apache.org/job/beam_PostCommit_Java_MavenInstall/ws/sdks/java/io/common/target/beam-sdks-java-io-common-2.1.0-SNAPSHOT-tests.jar>
2017-05-27T00:06:33.947 [INFO] 
2017-05-27T00:06:33.947 [INFO] --- maven-shade-plugin:3.0.0:shade (bundle-and-repackage) @
beam-sdks-java-io-common ---
2017-05-27T00:06:33.950 [INFO] Excluding org.apache.beam:beam-sdks-java-core:jar:2.1.0-SNAPSHOT
from the shaded jar.
2017-05-27T00:06:33.950 [INFO] Excluding com.google.protobuf:protobuf-java:jar:3.2.0 from
the shaded jar.
2017-05-27T00:06:33.950 [INFO] Excluding com.google.code.findbugs:jsr305:jar:3.0.1 from the
shaded jar.
2017-05-27T00:06:33.950 [INFO] Excluding com.fasterxml.jackson.core:jackson-core:jar:2.8.8
from the shaded jar.
2017-05-27T00:06:33.950 [INFO] Excluding com.fasterxml.jackson.core:jackson-annotations:jar:2.8.8
from the shaded jar.
2017-05-27T00:06:33.950 [INFO] Excluding com.fasterxml.jackson.core:jackson-databind:jar:2.8.8
from the shaded jar.
2017-05-27T00:06:33.950 [INFO] Excluding org.slf4j:slf4j-api:jar:1.7.14 from the shaded jar.
2017-05-27T00:06:33.950 [INFO] Excluding net.bytebuddy:byte-buddy:jar:1.6.8 from the shaded
jar.
2017-05-27T00:06:33.950 [INFO] Excluding org.apache.avro:avro:jar:1.8.1 from the shaded jar.
2017-05-27T00:06:33.950 [INFO] Excluding org.codehaus.jackson:jackson-core-asl:jar:1.9.13
from the shaded jar.
2017-05-27T00:06:33.950 [INFO] Excluding org.codehaus.jackson:jackson-mapper-asl:jar:1.9.13
from the shaded jar.
2017-05-27T00:06:33.950 [INFO] Excluding com.thoughtworks.paranamer:paranamer:jar:2.7 from
the shaded jar.
2017-05-27T00:06:33.950 [INFO] Excluding org.tukaani:xz:jar:1.5 from the shaded jar.
2017-05-27T00:06:33.950 [INFO] Excluding org.xerial.snappy:snappy-java:jar:1.1.4-M3 from the
shaded jar.
2017-05-27T00:06:33.950 [INFO] Excluding org.apache.commons:commons-compress:jar:1.9 from
the shaded jar.
2017-05-27T00:06:33.950 [INFO] Excluding org.apache.commons:commons-lang3:jar:3.5 from the
shaded jar.
2017-05-27T00:06:33.950 [INFO] Excluding joda-time:joda-time:jar:2.4 from the shaded jar.
2017-05-27T00:06:33.950 [INFO] Including com.google.guava:guava:jar:20.0 in the shaded jar.
2017-05-27T00:06:36.193 [INFO] Replacing original artifact with shaded artifact.
2017-05-27T00:06:36.193 [INFO] Replacing <https://builds.apache.org/job/beam_PostCommit_Java_MavenInstall/ws/sdks/java/io/common/target/beam-sdks-java-io-common-2.1.0-SNAPSHOT.jar>
with <https://builds.apache.org/job/beam_PostCommit_Java_MavenInstall/ws/sdks/java/io/common/target/beam-sdks-java-io-common-2.1.0-SNAPSHOT-shaded.jar>
2017-05-27T00:06:36.193 [INFO] Replacing original test artifact with shaded test artifact.
2017-05-27T00:06:36.193 [INFO] Replacing <https://builds.apache.org/job/beam_PostCommit_Java_MavenInstall/ws/sdks/java/io/common/target/beam-sdks-java-io-common-2.1.0-SNAPSHOT-tests.jar>
with <https://builds.apache.org/job/beam_PostCommit_Java_MavenInstall/ws/sdks/java/io/common/target/beam-sdks-java-io-common-2.1.0-SNAPSHOT-shaded-tests.jar>
2017-05-27T00:06:36.193 [INFO] Dependency-reduced POM written at: <https://builds.apache.org/job/beam_PostCommit_Java_MavenInstall/ws/sdks/java/io/common/dependency-reduced-pom.xml>
2017-05-27T00:06:36.332 [INFO] 
2017-05-27T00:06:36.332 [INFO] --- maven-javadoc-plugin:2.10.4:jar (attach-javadocs) @ beam-sdks-java-io-common
---
[WARNING] Cannot calculate digest of mojo class, because mojo wasn't loaded from a jar, but
from: <https://builds.apache.org/job/beam_PostCommit_Java_MavenInstall/ws/.repository/org/apache/maven/plugins/maven-javadoc-plugin/2.10.4/maven-javadoc-plugin-2.10.4.jar>
2017-05-27T00:06:36.390 [INFO] 
2017-05-27T00:06:36.390 [INFO] --- maven-source-plugin:3.0.1:jar-no-fork (attach-sources)
@ beam-sdks-java-io-common ---
2017-05-27T00:06:36.395 [INFO] Building jar: <https://builds.apache.org/job/beam_PostCommit_Java_MavenInstall/ws/sdks/java/io/common/target/beam-sdks-java-io-common-2.1.0-SNAPSHOT-sources.jar>
[WARNING] Cannot calculate digest of mojo class, because mojo wasn't loaded from a jar, but
from: <https://builds.apache.org/job/beam_PostCommit_Java_MavenInstall/ws/.repository/org/apache/maven/plugins/maven-source-plugin/3.0.1/maven-source-plugin-3.0.1.jar>
2017-05-27T00:06:36.454 [INFO] 
2017-05-27T00:06:36.454 [INFO] --- maven-source-plugin:3.0.1:test-jar-no-fork (attach-test-sources)
@ beam-sdks-java-io-common ---
2017-05-27T00:06:36.459 [INFO] Building jar: <https://builds.apache.org/job/beam_PostCommit_Java_MavenInstall/ws/sdks/java/io/common/target/beam-sdks-java-io-common-2.1.0-SNAPSHOT-test-sources.jar>
[WARNING] Cannot calculate digest of mojo class, because mojo wasn't loaded from a jar, but
from: <https://builds.apache.org/job/beam_PostCommit_Java_MavenInstall/ws/.repository/org/apache/maven/plugins/maven-source-plugin/3.0.1/maven-source-plugin-3.0.1.jar>
2017-05-27T00:06:36.532 [INFO] 
2017-05-27T00:06:36.532 [INFO] --- maven-dependency-plugin:3.0.1:analyze-only (default) @
beam-sdks-java-io-common ---
[WARNING] Cannot calculate digest of mojo class, because mojo wasn't loaded from a jar, but
from: <https://builds.apache.org/job/beam_PostCommit_Java_MavenInstall/ws/.repository/org/apache/maven/plugins/maven-dependency-plugin/3.0.1/maven-dependency-plugin-3.0.1.jar>
[JENKINS] Archiving disabled
2017-05-27T00:06:37.831 [INFO]                                                           
             
2017-05-27T00:06:37.831 [INFO] ------------------------------------------------------------------------
2017-05-27T00:06:37.831 [INFO] Skipping Apache Beam :: Parent
2017-05-27T00:06:37.831 [INFO] This project has been banned from the build due to previous
failures.
2017-05-27T00:06:37.831 [INFO] ------------------------------------------------------------------------
[JENKINS] Archiving disabled
[JENKINS] Archiving disabled
[JENKINS] Archiving disabled
[JENKINS] Archiving disabled
[JENKINS] Archiving disabled
[JENKINS] Archiving disabled
[JENKINS] Archiving disabled
[JENKINS] Archiving disabled
[JENKINS] Archiving disabled
[JENKINS] Archiving disabled
[JENKINS] Archiving disabled
[JENKINS] Archiving disabled
[JENKINS] Archiving disabled
[JENKINS] Archiving disabled
[JENKINS] Archiving disabled
[JENKINS] Archiving disabled
[JENKINS] Archiving disabled
[JENKINS] Archiving disabled
[JENKINS] Archiving disabled
[JENKINS] Archiving disabled
[JENKINS] Archiving disabled
[JENKINS] Archiving disabled
[JENKINS] Archiving disabled
[JENKINS] Archiving disabled
[JENKINS] Archiving disabled
[JENKINS] Archiving disabled
[JENKINS] Archiving disabled
[JENKINS] Archiving disabled
[JENKINS] Archiving disabled
[JENKINS] Archiving disabled
[JENKINS] Archiving disabled
[JENKINS] Archiving disabled
[JENKINS] Archiving disabled
[JENKINS] Archiving disabled
[JENKINS] Archiving disabled
[JENKINS] Archiving disabled
[JENKINS] Archiving disabled
[JENKINS] Archiving disabled
[JENKINS] Archiving disabled
[JENKINS] Archiving disabled
[JENKINS] Archiving disabled
[JENKINS] Archiving disabled
[JENKINS] Archiving disabled
[JENKINS] Archiving disabled
[JENKINS] Archiving disabled
[JENKINS] Archiving disabled
2017-05-27T00:06:50.260 [INFO] ------------------------------------------------------------------------
2017-05-27T00:06:50.260 [INFO] Reactor Summary:
2017-05-27T00:06:50.260 [INFO] 
2017-05-27T00:06:50.260 [INFO] Apache Beam :: Parent .............................. SUCCESS
[ 51.046 s]
2017-05-27T00:06:50.260 [INFO] Apache Beam :: SDKs :: Java :: Build Tools ......... SUCCESS
[  8.890 s]
2017-05-27T00:06:50.260 [INFO] Apache Beam :: SDKs ................................ SUCCESS
[  4.685 s]
2017-05-27T00:06:50.260 [INFO] Apache Beam :: SDKs :: Common ...................... SUCCESS
[  2.375 s]
2017-05-27T00:06:50.260 [INFO] Apache Beam :: SDKs :: Common :: Fn API ............ SUCCESS
[ 19.469 s]
2017-05-27T00:06:50.260 [INFO] Apache Beam :: SDKs :: Common :: Runner API ........ SUCCESS
[ 15.793 s]
2017-05-27T00:06:50.260 [INFO] Apache Beam :: SDKs :: Java ........................ SUCCESS
[  1.813 s]
2017-05-27T00:06:50.260 [INFO] Apache Beam :: SDKs :: Java :: Core ................ SUCCESS
[03:07 min]
2017-05-27T00:06:50.260 [INFO] Apache Beam :: SDKs :: Java :: IO .................. SUCCESS
[  2.339 s]
2017-05-27T00:06:50.260 [INFO] Apache Beam :: SDKs :: Java :: IO :: Common ........ FAILURE
[  5.719 s]
2017-05-27T00:06:50.260 [INFO] Apache Beam :: Runners ............................. SKIPPED
2017-05-27T00:06:50.260 [INFO] Apache Beam :: Runners :: Core Construction Java ... SKIPPED
2017-05-27T00:06:50.260 [INFO] Apache Beam :: Runners :: Core Java ................ SKIPPED
2017-05-27T00:06:50.260 [INFO] Apache Beam :: Runners :: Direct Java .............. SKIPPED
2017-05-27T00:06:50.260 [INFO] Apache Beam :: SDKs :: Java :: IO :: Elasticsearch . SKIPPED
2017-05-27T00:06:50.260 [INFO] Apache Beam :: SDKs :: Java :: Extensions .......... SKIPPED
2017-05-27T00:06:50.260 [INFO] Apache Beam :: SDKs :: Java :: Extensions :: Google Cloud Platform
Core SKIPPED
2017-05-27T00:06:50.260 [INFO] Apache Beam :: SDKs :: Java :: Extensions :: Protobuf SKIPPED
2017-05-27T00:06:50.260 [INFO] Apache Beam :: SDKs :: Java :: IO :: Google Cloud Platform
SKIPPED
2017-05-27T00:06:50.260 [INFO] Apache Beam :: SDKs :: Java :: IO :: Hadoop Common . SKIPPED
2017-05-27T00:06:50.260 [INFO] Apache Beam :: SDKs :: Java :: IO :: Hadoop File System SKIPPED
2017-05-27T00:06:50.260 [INFO] Apache Beam :: SDKs :: Java :: IO :: Hadoop ........ SKIPPED
2017-05-27T00:06:50.260 [INFO] Apache Beam :: SDKs :: Java :: IO :: Hadoop :: input-format
SKIPPED
2017-05-27T00:06:50.260 [INFO] Apache Beam :: Runners :: Google Cloud Dataflow .... SKIPPED
2017-05-27T00:06:50.260 [INFO] Apache Beam :: SDKs :: Java :: IO :: Hadoop :: jdk1.8-tests
SKIPPED
2017-05-27T00:06:50.260 [INFO] Apache Beam :: SDKs :: Java :: IO :: HBase ......... SKIPPED
2017-05-27T00:06:50.260 [INFO] Apache Beam :: SDKs :: Java :: IO :: JDBC .......... SKIPPED
2017-05-27T00:06:50.260 [INFO] Apache Beam :: SDKs :: Java :: IO :: JMS ........... SKIPPED
2017-05-27T00:06:50.260 [INFO] Apache Beam :: SDKs :: Java :: IO :: Kafka ......... SKIPPED
2017-05-27T00:06:50.260 [INFO] Apache Beam :: SDKs :: Java :: IO :: Kinesis ....... SKIPPED
2017-05-27T00:06:50.260 [INFO] Apache Beam :: SDKs :: Java :: IO :: MongoDB ....... SKIPPED
2017-05-27T00:06:50.260 [INFO] Apache Beam :: SDKs :: Java :: IO :: MQTT .......... SKIPPED
2017-05-27T00:06:50.260 [INFO] Apache Beam :: SDKs :: Java :: IO :: XML ........... SKIPPED
2017-05-27T00:06:50.260 [INFO] Apache Beam :: SDKs :: Java :: Maven Archetypes .... SKIPPED
2017-05-27T00:06:50.260 [INFO] Apache Beam :: SDKs :: Java :: Maven Archetypes :: Starter
SKIPPED
2017-05-27T00:06:50.260 [INFO] Apache Beam :: Examples ............................ SKIPPED
2017-05-27T00:06:50.260 [INFO] Apache Beam :: Examples :: Java .................... SKIPPED
2017-05-27T00:06:50.260 [INFO] Apache Beam :: SDKs :: Java :: Maven Archetypes :: Examples
SKIPPED
2017-05-27T00:06:50.260 [INFO] Apache Beam :: Examples :: Java 8 .................. SKIPPED
2017-05-27T00:06:50.260 [INFO] Apache Beam :: SDKs :: Java :: Maven Archetypes :: Examples
- Java 8 SKIPPED
2017-05-27T00:06:50.260 [INFO] Apache Beam :: SDKs :: Java :: Extensions :: Jackson SKIPPED
2017-05-27T00:06:50.260 [INFO] Apache Beam :: SDKs :: Java :: Extensions :: Join library SKIPPED
2017-05-27T00:06:50.260 [INFO] Apache Beam :: SDKs :: Java :: Extensions :: Sorter  SKIPPED
2017-05-27T00:06:50.260 [INFO] Apache Beam :: SDKs :: Java :: Harness ............. SKIPPED
2017-05-27T00:06:50.260 [INFO] Apache Beam :: SDKs :: Java :: Java 8 Tests ........ SKIPPED
2017-05-27T00:06:50.260 [INFO] Apache Beam :: SDKs :: Python ...................... SKIPPED
2017-05-27T00:06:50.260 [INFO] Apache Beam :: Runners :: Flink .................... SKIPPED
2017-05-27T00:06:50.260 [INFO] Apache Beam :: Runners :: Spark .................... SKIPPED
2017-05-27T00:06:50.260 [INFO] Apache Beam :: Runners :: Apex ..................... SKIPPED
2017-05-27T00:06:50.260 [INFO] Apache Beam :: SDKs :: Java :: Aggregated Javadoc .. SKIPPED
2017-05-27T00:06:50.260 [INFO] ------------------------------------------------------------------------
2017-05-27T00:06:50.261 [INFO] BUILD FAILURE
2017-05-27T00:06:50.261 [INFO] ------------------------------------------------------------------------
2017-05-27T00:06:50.261 [INFO] Total time: 05:30 min
2017-05-27T00:06:50.261 [INFO] Finished at: 2017-05-27T00:06:50+00:00
2017-05-27T00:06:50.810 [INFO] Final Memory: 126M/1422M
2017-05-27T00:06:50.810 [INFO] ------------------------------------------------------------------------
2017-05-27T00:06:50.816 [ERROR] Failed to execute goal org.apache.maven.plugins:maven-dependency-plugin:3.0.1:analyze-only
(default) on project beam-sdks-java-io-common: Cannot analyze dependencies: <https://builds.apache.org/job/beam_PostCommit_Java_MavenInstall/ws/.repository/com/google/protobuf/protobuf-java/3.2.0/protobuf-java-3.2.0.jar>
(No such file or directory) -> [Help 1]
org.apache.maven.lifecycle.LifecycleExecutionException: Failed to execute goal org.apache.maven.plugins:maven-dependency-plugin:3.0.1:analyze-only
(default) on project beam-sdks-java-io-common: Cannot analyze dependencies
	at org.apache.maven.lifecycle.internal.MojoExecutor.execute(MojoExecutor.java:216)
	at org.apache.maven.lifecycle.internal.MojoExecutor.execute(MojoExecutor.java:153)
	at org.apache.maven.lifecycle.internal.MojoExecutor.execute(MojoExecutor.java:145)
	at org.apache.maven.lifecycle.internal.LifecycleModuleBuilder.buildProject(LifecycleModuleBuilder.java:116)
	at org.apache.maven.lifecycle.internal.LifecycleModuleBuilder.buildProject(LifecycleModuleBuilder.java:80)
	at org.apache.maven.lifecycle.internal.builder.singlethreaded.SingleThreadedBuilder.build(SingleThreadedBuilder.java:51)
	at org.apache.maven.lifecycle.internal.LifecycleStarter.execute(LifecycleStarter.java:128)
	at org.apache.maven.DefaultMaven.doExecute(DefaultMaven.java:307)
	at org.apache.maven.DefaultMaven.doExecute(DefaultMaven.java:193)
	at org.apache.maven.DefaultMaven.execute(DefaultMaven.java:106)
	at org.jvnet.hudson.maven3.launcher.Maven33Launcher.main(Maven33Launcher.java:129)
	at sun.reflect.NativeMethodAccessorImpl.invoke0(Native Method)
	at sun.reflect.NativeMethodAccessorImpl.invoke(NativeMethodAccessorImpl.java:62)
	at sun.reflect.DelegatingMethodAccessorImpl.invoke(DelegatingMethodAccessorImpl.java:43)
	at java.lang.reflect.Method.invoke(Method.java:498)
	at org.codehaus.plexus.classworlds.launcher.Launcher.launchStandard(Launcher.java:330)
	at org.codehaus.plexus.classworlds.launcher.Launcher.launch(Launcher.java:238)
	at jenkins.maven3.agent.Maven33Main.launch(Maven33Main.java:176)
	at sun.reflect.NativeMethodAccessorImpl.invoke0(Native Method)
	at sun.reflect.NativeMethodAccessorImpl.invoke(NativeMethodAccessorImpl.java:62)
	at sun.reflect.DelegatingMethodAccessorImpl.invoke(DelegatingMethodAccessorImpl.java:43)
	at java.lang.reflect.Method.invoke(Method.java:498)
	at hudson.maven.Maven3Builder.call(Maven3Builder.java:139)
	at hudson.maven.Maven3Builder.call(Maven3Builder.java:70)
	at hudson.remoting.UserRequest.perform(UserRequest.java:153)
	at hudson.remoting.UserRequest.perform(UserRequest.java:50)
	at hudson.remoting.Request$2.run(Request.java:336)
	at hudson.remoting.InterceptingExecutorService$1.call(InterceptingExecutorService.java:68)
	at java.util.concurrent.FutureTask.run(FutureTask.java:266)
	at java.util.concurrent.ThreadPoolExecutor.runWorker(ThreadPoolExecutor.java:1142)
	at java.util.concurrent.ThreadPoolExecutor$Worker.run(ThreadPoolExecutor.java:617)
	at java.lang.Thread.run(Thread.java:745)
Caused by: org.apache.maven.plugin.MojoExecutionException: Cannot analyze dependencies
	at org.apache.maven.plugins.dependency.analyze.AbstractAnalyzeMojo.checkDependencies(AbstractAnalyzeMojo.java:315)
	at org.apache.maven.plugins.dependency.analyze.AbstractAnalyzeMojo.execute(AbstractAnalyzeMojo.java:257)
	at org.apache.maven.plugin.DefaultBuildPluginManager.executeMojo(DefaultBuildPluginManager.java:134)
	at org.apache.maven.lifecycle.internal.MojoExecutor.execute(MojoExecutor.java:208)
	... 31 more
Caused by: org.apache.maven.shared.dependency.analyzer.ProjectDependencyAnalyzerException:
Cannot analyze dependencies
	at org.apache.maven.shared.dependency.analyzer.DefaultProjectDependencyAnalyzer.analyze(DefaultProjectDependencyAnalyzer.java:94)
	at org.apache.maven.plugins.dependency.analyze.AbstractAnalyzeMojo.checkDependencies(AbstractAnalyzeMojo.java:306)
	... 34 more
Caused by: java.io.FileNotFoundException: <https://builds.apache.org/job/beam_PostCommit_Java_MavenInstall/ws/.repository/com/google/protobuf/protobuf-java/3.2.0/protobuf-java-3.2.0.jar>
(No such file or directory)
	at java.util.zip.ZipFile.open(Native Method)
	at java.util.zip.ZipFile.<init>(ZipFile.java:219)
	at java.util.zip.ZipFile.<init>(ZipFile.java:149)
	at java.util.jar.JarFile.<init>(JarFile.java:166)
	at java.util.jar.JarFile.<init>(JarFile.java:130)
	at org.apache.maven.shared.dependency.analyzer.DefaultProjectDependencyAnalyzer.buildArtifactClassMap(DefaultProjectDependencyAnalyzer.java:147)
	at org.apache.maven.shared.dependency.analyzer.DefaultProjectDependencyAnalyzer.analyze(DefaultProjectDependencyAnalyzer.java:72)
	... 35 more
2017-05-27T00:06:50.817 [ERROR] 
2017-05-27T00:06:50.817 [ERROR] Re-run Maven using the -X switch to enable full debug logging.
2017-05-27T00:06:50.817 [ERROR] 
2017-05-27T00:06:50.817 [ERROR] For more information about the errors and possible solutions,
please read the following articles:
2017-05-27T00:06:50.817 [ERROR] [Help 1] http://cwiki.apache.org/confluence/display/MAVEN/MojoExecutionException
2017-05-27T00:06:50.817 [ERROR] 
2017-05-27T00:06:50.817 [ERROR] After correcting the problems, you can resume the build with
the command
2017-05-27T00:06:50.817 [ERROR]   mvn <goals> -rf :beam-sdks-java-io-common
channel stopped

Mime
View raw message