beam-commits mailing list archives

Site index · List index
Message view « Date » · « Thread »
Top « Date » · « Thread »
From Apache Jenkins Server <jenk...@builds.apache.org>
Subject Build failed in Jenkins: beam_PostCommit_Java_MavenInstall #3658
Date Fri, 05 May 2017 00:33:47 GMT
See <https://builds.apache.org/job/beam_PostCommit_Java_MavenInstall/3658/display/redirect>

------------------------------------------
[...truncated 1.55 MB...]
java.lang.AssertionError: 

Expected: iterable containing [<ValueInGlobalWindow{value=FinishBundle, pane=PaneInfo.NO_FIRING}>]
     but: item 0: was <TimestampedValueInGlobalWindow{value=FinishBundle, timestamp=294247-01-09T04:00:54.775Z,
pane=PaneInfo.NO_FIRING}>
	at org.hamcrest.MatcherAssert.assertThat(MatcherAssert.java:20)
	at org.junit.Assert.assertThat(Assert.java:956)
	at org.junit.Assert.assertThat(Assert.java:923)
	at org.apache.beam.fn.harness.control.ProcessBundleHandlerTest.testCreatingAndProcessingDoFn(ProcessBundleHandlerTest.java:436)
	at sun.reflect.NativeMethodAccessorImpl.invoke0(Native Method)
	at sun.reflect.NativeMethodAccessorImpl.invoke(NativeMethodAccessorImpl.java:62)
	at sun.reflect.DelegatingMethodAccessorImpl.invoke(DelegatingMethodAccessorImpl.java:43)
	at java.lang.reflect.Method.invoke(Method.java:498)
	at org.junit.runners.model.FrameworkMethod$1.runReflectiveCall(FrameworkMethod.java:50)
	at org.junit.internal.runners.model.ReflectiveCallable.run(ReflectiveCallable.java:12)
	at org.junit.runners.model.FrameworkMethod.invokeExplosively(FrameworkMethod.java:47)
	at org.junit.internal.runners.statements.InvokeMethod.evaluate(InvokeMethod.java:17)
	at org.junit.internal.runners.statements.RunBefores.evaluate(RunBefores.java:26)
	at org.junit.rules.ExpectedException$ExpectedExceptionStatement.evaluate(ExpectedException.java:239)
	at org.junit.rules.RunRules.evaluate(RunRules.java:20)
	at org.junit.runners.ParentRunner.runLeaf(ParentRunner.java:325)
	at org.junit.runners.BlockJUnit4ClassRunner.runChild(BlockJUnit4ClassRunner.java:78)
	at org.junit.runners.BlockJUnit4ClassRunner.runChild(BlockJUnit4ClassRunner.java:57)
	at org.junit.runners.ParentRunner$3.run(ParentRunner.java:290)
	at org.junit.runners.ParentRunner$1.schedule(ParentRunner.java:71)
	at org.junit.runners.ParentRunner.runChildren(ParentRunner.java:288)
	at org.junit.runners.ParentRunner.access$000(ParentRunner.java:58)
	at org.junit.runners.ParentRunner$2.evaluate(ParentRunner.java:268)
	at org.junit.runners.ParentRunner.run(ParentRunner.java:363)
	at org.junit.runners.Suite.runChild(Suite.java:128)
	at org.junit.runners.Suite.runChild(Suite.java:27)
	at org.junit.runners.ParentRunner$3.run(ParentRunner.java:290)
	at org.junit.runners.ParentRunner$1.schedule(ParentRunner.java:71)
	at org.junit.runners.ParentRunner.runChildren(ParentRunner.java:288)
	at org.junit.runners.ParentRunner.access$000(ParentRunner.java:58)
	at org.junit.runners.ParentRunner$2.evaluate(ParentRunner.java:268)
	at org.junit.runners.ParentRunner.run(ParentRunner.java:363)
	at org.apache.maven.surefire.junitcore.JUnitCore.run(JUnitCore.java:55)
	at org.apache.maven.surefire.junitcore.JUnitCoreWrapper.createRequestAndRun(JUnitCoreWrapper.java:137)
	at org.apache.maven.surefire.junitcore.JUnitCoreWrapper.executeEager(JUnitCoreWrapper.java:107)
	at org.apache.maven.surefire.junitcore.JUnitCoreWrapper.execute(JUnitCoreWrapper.java:83)
	at org.apache.maven.surefire.junitcore.JUnitCoreWrapper.execute(JUnitCoreWrapper.java:75)
	at org.apache.maven.surefire.junitcore.JUnitCoreProvider.invoke(JUnitCoreProvider.java:157)
	at org.apache.maven.surefire.booter.ForkedBooter.invokeProviderInSameClassLoader(ForkedBooter.java:386)
	at org.apache.maven.surefire.booter.ForkedBooter.runSuitesInProcess(ForkedBooter.java:323)
	at org.apache.maven.surefire.booter.ForkedBooter.main(ForkedBooter.java:143)

2017-05-05T00:32:36.097 [INFO] Running org.apache.beam.fn.harness.control.BeamFnControlClientTest
2017-05-05T00:32:36.128 [INFO] Tests run: 1, Failures: 0, Errors: 0, Skipped: 0, Time elapsed:
0.029 s - in org.apache.beam.fn.harness.control.BeamFnControlClientTest
2017-05-05T00:32:36.128 [INFO] Running org.apache.beam.fn.harness.control.RegisterHandlerTest
2017-05-05T00:32:36.231 [INFO] Tests run: 1, Failures: 0, Errors: 0, Skipped: 0, Time elapsed:
0.101 s - in org.apache.beam.fn.harness.control.RegisterHandlerTest
2017-05-05T00:32:36.231 [INFO] Running org.apache.beam.fn.harness.FnHarnessTest
2017-05-05T00:32:36.893 [INFO] Tests run: 1, Failures: 0, Errors: 0, Skipped: 0, Time elapsed:
0.66 s - in org.apache.beam.fn.harness.FnHarnessTest
2017-05-05T00:32:36.893 [INFO] Running org.apache.beam.fn.harness.stream.AdvancingPhaserTest
2017-05-05T00:32:36.900 [INFO] Tests run: 1, Failures: 0, Errors: 0, Skipped: 0, Time elapsed:
0.006 s - in org.apache.beam.fn.harness.stream.AdvancingPhaserTest
2017-05-05T00:32:36.900 [INFO] Running org.apache.beam.fn.harness.stream.ForwardingClientResponseObserverTest
2017-05-05T00:32:36.912 [INFO] Tests run: 1, Failures: 0, Errors: 0, Skipped: 0, Time elapsed:
0.011 s - in org.apache.beam.fn.harness.stream.ForwardingClientResponseObserverTest
2017-05-05T00:32:36.912 [INFO] Running org.apache.beam.fn.harness.stream.DirectStreamObserverTest
2017-05-05T00:32:39.613 [INFO] Tests run: 2, Failures: 0, Errors: 0, Skipped: 0, Time elapsed:
2.7 s - in org.apache.beam.fn.harness.stream.DirectStreamObserverTest
2017-05-05T00:32:39.613 [INFO] Running org.apache.beam.fn.harness.stream.StreamObserverFactoryTest
2017-05-05T00:32:39.629 [INFO] Tests run: 3, Failures: 0, Errors: 0, Skipped: 0, Time elapsed:
0.014 s - in org.apache.beam.fn.harness.stream.StreamObserverFactoryTest
2017-05-05T00:32:39.629 [INFO] Running org.apache.beam.fn.harness.test.TestExecutorsTest
2017-05-05T00:32:49.682 [INFO] Tests run: 4, Failures: 0, Errors: 0, Skipped: 0, Time elapsed:
10.052 s - in org.apache.beam.fn.harness.test.TestExecutorsTest
2017-05-05T00:32:49.682 [INFO] Running org.apache.beam.fn.harness.test.TestStreamsTest
2017-05-05T00:32:49.687 [INFO] Tests run: 5, Failures: 0, Errors: 0, Skipped: 0, Time elapsed:
0.004 s - in org.apache.beam.fn.harness.test.TestStreamsTest
2017-05-05T00:32:50.098 [INFO] 
2017-05-05T00:32:50.098 [INFO] Results:
2017-05-05T00:32:50.098 [INFO] 
2017-05-05T00:32:50.098 [ERROR] Failures: 
2017-05-05T00:32:50.098 [ERROR]   ProcessBundleHandlerTest.testCreatingAndProcessingDoFn:436

Expected: iterable containing [<ValueInGlobalWindow{value=FinishBundle, pane=PaneInfo.NO_FIRING}>]
     but: item 0: was <TimestampedValueInGlobalWindow{value=FinishBundle, timestamp=294247-01-09T04:00:54.775Z,
pane=PaneInfo.NO_FIRING}>
2017-05-05T00:32:50.098 [INFO] 
2017-05-05T00:32:50.098 [ERROR] Tests run: 46, Failures: 1, Errors: 0, Skipped: 0
2017-05-05T00:32:50.098 [INFO] 
2017-05-05T00:32:50.100 [INFO]                                                           
             
2017-05-05T00:32:50.100 [INFO] ------------------------------------------------------------------------
2017-05-05T00:32:50.100 [INFO] Skipping Apache Beam :: Parent
2017-05-05T00:32:50.100 [INFO] This project has been banned from the build due to previous
failures.
2017-05-05T00:32:50.100 [INFO] ------------------------------------------------------------------------
[JENKINS] Archiving disabled
[JENKINS] Archiving disabled
[JENKINS] Archiving disabled
[JENKINS] Archiving disabled
[JENKINS] Archiving disabled
[JENKINS] Archiving disabled
[JENKINS] Archiving disabled
[JENKINS] Archiving disabled
[JENKINS] Archiving disabled
[JENKINS] Archiving disabled
[JENKINS] Archiving disabled
[JENKINS] Archiving disabled
[JENKINS] Archiving disabled
[JENKINS] Archiving disabled
[JENKINS] Archiving disabled
[JENKINS] Archiving disabled
[JENKINS] Archiving disabled
[JENKINS] Archiving disabled
[JENKINS] Archiving disabled
[JENKINS] Archiving disabled
[JENKINS] Archiving disabled
[JENKINS] Archiving disabled
[JENKINS] Archiving disabled
[JENKINS] Archiving disabled
[JENKINS] Archiving disabled
[JENKINS] Archiving disabled
[JENKINS] Archiving disabled
[JENKINS] Archiving disabled
[JENKINS] Archiving disabled
[JENKINS] Archiving disabled
[JENKINS] Archiving disabled
[JENKINS] Archiving disabled
[JENKINS] Archiving disabled
[JENKINS] Archiving disabled
[JENKINS] Archiving disabled
[JENKINS] Archiving disabled
[JENKINS] Archiving disabled
[JENKINS] Archiving disabled
[JENKINS] Archiving disabled
[JENKINS] Archiving disabled
[JENKINS] Archiving disabled
[JENKINS] Archiving disabled
[JENKINS] Archiving disabled
[JENKINS] Archiving disabled
[JENKINS] Archiving disabled
[JENKINS] Archiving disabled
2017-05-05T00:33:09.752 [INFO] ------------------------------------------------------------------------
2017-05-05T00:33:09.752 [INFO] Reactor Summary:
2017-05-05T00:33:09.752 [INFO] 
2017-05-05T00:33:09.753 [INFO] Apache Beam :: Parent .............................. SUCCESS
[ 33.248 s]
2017-05-05T00:33:09.753 [INFO] Apache Beam :: SDKs :: Java :: Build Tools ......... SUCCESS
[ 11.280 s]
2017-05-05T00:33:09.753 [INFO] Apache Beam :: SDKs ................................ SUCCESS
[  5.905 s]
2017-05-05T00:33:09.753 [INFO] Apache Beam :: SDKs :: Common ...................... SUCCESS
[  1.514 s]
2017-05-05T00:33:09.753 [INFO] Apache Beam :: SDKs :: Common :: Fn API ............ SUCCESS
[ 19.765 s]
2017-05-05T00:33:09.753 [INFO] Apache Beam :: SDKs :: Common :: Runner API ........ SUCCESS
[ 13.176 s]
2017-05-05T00:33:09.753 [INFO] Apache Beam :: SDKs :: Java ........................ SUCCESS
[  1.939 s]
2017-05-05T00:33:09.753 [INFO] Apache Beam :: SDKs :: Java :: Core ................ SUCCESS
[02:36 min]
2017-05-05T00:33:09.753 [INFO] Apache Beam :: SDKs :: Java :: IO .................. SUCCESS
[  2.587 s]
2017-05-05T00:33:09.753 [INFO] Apache Beam :: SDKs :: Java :: IO :: Common ........ SUCCESS
[  3.650 s]
2017-05-05T00:33:09.753 [INFO] Apache Beam :: Runners ............................. SUCCESS
[  2.175 s]
2017-05-05T00:33:09.753 [INFO] Apache Beam :: Runners :: Core Construction Java ... SUCCESS
[ 27.325 s]
2017-05-05T00:33:09.753 [INFO] Apache Beam :: Runners :: Core Java ................ SUCCESS
[ 55.165 s]
2017-05-05T00:33:09.753 [INFO] Apache Beam :: Runners :: Direct Java .............. SUCCESS
[03:10 min]
2017-05-05T00:33:09.753 [INFO] Apache Beam :: SDKs :: Java :: IO :: Elasticsearch . SUCCESS
[ 45.613 s]
2017-05-05T00:33:09.753 [INFO] Apache Beam :: SDKs :: Java :: Extensions .......... SUCCESS
[  2.249 s]
2017-05-05T00:33:09.753 [INFO] Apache Beam :: SDKs :: Java :: Extensions :: Google Cloud Platform
Core SUCCESS [ 35.675 s]
2017-05-05T00:33:09.753 [INFO] Apache Beam :: SDKs :: Java :: Extensions :: Protobuf SUCCESS
[ 22.306 s]
2017-05-05T00:33:09.753 [INFO] Apache Beam :: SDKs :: Java :: IO :: Google Cloud Platform
SUCCESS [01:48 min]
2017-05-05T00:33:09.753 [INFO] Apache Beam :: SDKs :: Java :: IO :: Hadoop Common . SUCCESS
[ 25.523 s]
2017-05-05T00:33:09.753 [INFO] Apache Beam :: SDKs :: Java :: IO :: Hadoop File System SUCCESS
[ 57.500 s]
2017-05-05T00:33:09.753 [INFO] Apache Beam :: SDKs :: Java :: IO :: Hadoop ........ SUCCESS
[  3.374 s]
2017-05-05T00:33:09.753 [INFO] Apache Beam :: SDKs :: Java :: IO :: Hadoop :: input-format
SUCCESS [ 25.430 s]
2017-05-05T00:33:09.753 [INFO] Apache Beam :: Runners :: Google Cloud Dataflow .... SUCCESS
[05:42 min]
2017-05-05T00:33:09.753 [INFO] Apache Beam :: SDKs :: Java :: IO :: Hadoop :: jdk1.8-tests
SUCCESS [01:36 min]
2017-05-05T00:33:09.753 [INFO] Apache Beam :: SDKs :: Java :: IO :: HBase ......... SUCCESS
[01:14 min]
2017-05-05T00:33:09.753 [INFO] Apache Beam :: SDKs :: Java :: IO :: JDBC .......... SUCCESS
[ 29.427 s]
2017-05-05T00:33:09.753 [INFO] Apache Beam :: SDKs :: Java :: IO :: JMS ........... SUCCESS
[ 25.803 s]
2017-05-05T00:33:09.753 [INFO] Apache Beam :: SDKs :: Java :: IO :: Kafka ......... SUCCESS
[ 28.015 s]
2017-05-05T00:33:09.753 [INFO] Apache Beam :: SDKs :: Java :: IO :: Kinesis ....... SUCCESS
[ 28.853 s]
2017-05-05T00:33:09.753 [INFO] Apache Beam :: SDKs :: Java :: IO :: MongoDB ....... SUCCESS
[ 39.935 s]
2017-05-05T00:33:09.753 [INFO] Apache Beam :: SDKs :: Java :: IO :: MQTT .......... SUCCESS
[ 27.507 s]
2017-05-05T00:33:09.753 [INFO] Apache Beam :: SDKs :: Java :: IO :: XML ........... SUCCESS
[ 29.431 s]
2017-05-05T00:33:09.753 [INFO] Apache Beam :: SDKs :: Java :: Maven Archetypes .... SUCCESS
[  1.441 s]
2017-05-05T00:33:09.753 [INFO] Apache Beam :: SDKs :: Java :: Maven Archetypes :: Starter
SUCCESS [ 15.893 s]
2017-05-05T00:33:09.753 [INFO] Apache Beam :: SDKs :: Java :: Maven Archetypes :: Examples
SUCCESS [ 40.183 s]
2017-05-05T00:33:09.753 [INFO] Apache Beam :: SDKs :: Java :: Maven Archetypes :: Examples
- Java 8 SUCCESS [ 48.319 s]
2017-05-05T00:33:09.753 [INFO] Apache Beam :: SDKs :: Java :: Extensions :: Jackson SUCCESS
[ 19.233 s]
2017-05-05T00:33:09.753 [INFO] Apache Beam :: SDKs :: Java :: Extensions :: Join library SUCCESS
[ 23.195 s]
2017-05-05T00:33:09.753 [INFO] Apache Beam :: SDKs :: Java :: Extensions :: Sorter  SUCCESS
[ 47.644 s]
2017-05-05T00:33:09.753 [INFO] Apache Beam :: SDKs :: Java :: Harness ............. FAILURE
[ 35.495 s]
2017-05-05T00:33:09.754 [INFO] Apache Beam :: SDKs :: Java :: Java 8 Tests ........ SKIPPED
2017-05-05T00:33:09.754 [INFO] Apache Beam :: SDKs :: Python ...................... SKIPPED
2017-05-05T00:33:09.754 [INFO] Apache Beam :: Runners :: Flink .................... SKIPPED
2017-05-05T00:33:09.754 [INFO] Apache Beam :: Runners :: Spark .................... SKIPPED
2017-05-05T00:33:09.754 [INFO] Apache Beam :: Runners :: Apex ..................... SKIPPED
2017-05-05T00:33:09.754 [INFO] Apache Beam :: Examples ............................ SKIPPED
2017-05-05T00:33:09.754 [INFO] Apache Beam :: Examples :: Java .................... SKIPPED
2017-05-05T00:33:09.754 [INFO] Apache Beam :: Examples :: Java 8 .................. SKIPPED
2017-05-05T00:33:09.754 [INFO] Apache Beam :: SDKs :: Java :: Aggregated Javadoc .. SKIPPED
2017-05-05T00:33:09.754 [INFO] ------------------------------------------------------------------------
2017-05-05T00:33:09.754 [INFO] BUILD FAILURE
2017-05-05T00:33:09.754 [INFO] ------------------------------------------------------------------------
2017-05-05T00:33:09.754 [INFO] Total time: 31:06 min
2017-05-05T00:33:09.754 [INFO] Finished at: 2017-05-05T00:33:09+00:00
2017-05-05T00:33:10.758 [INFO] Final Memory: 274M/2157M
2017-05-05T00:33:10.758 [INFO] ------------------------------------------------------------------------
Waiting for Jenkins to finish collecting data
2017-05-05T00:33:42.662 [ERROR] Failed to execute goal org.apache.maven.plugins:maven-surefire-plugin:2.20:test
(default-test) on project beam-sdks-java-harness: There are test failures.
2017-05-05T00:33:42.662 [ERROR] 
2017-05-05T00:33:42.662 [ERROR] Please refer to <https://builds.apache.org/job/beam_PostCommit_Java_MavenInstall/ws/sdks/java/harness/target/surefire-reports>
for the individual test results.
2017-05-05T00:33:42.662 [ERROR] Please refer to dump files (if any exist) [date]-jvmRun[N].dump,
[date].dumpstream and [date]-jvmRun[N].dumpstream.
2017-05-05T00:33:42.662 [ERROR] -> [Help 1]
org.apache.maven.lifecycle.LifecycleExecutionException: Failed to execute goal org.apache.maven.plugins:maven-surefire-plugin:2.20:test
(default-test) on project beam-sdks-java-harness: There are test failures.

Please refer to <https://builds.apache.org/job/beam_PostCommit_Java_MavenInstall/ws/sdks/java/harness/target/surefire-reports>
for the individual test results.
Please refer to dump files (if any exist) [date]-jvmRun[N].dump, [date].dumpstream and [date]-jvmRun[N].dumpstream.
	at org.apache.maven.lifecycle.internal.MojoExecutor.execute(MojoExecutor.java:212)
	at org.apache.maven.lifecycle.internal.MojoExecutor.execute(MojoExecutor.java:153)
	at org.apache.maven.lifecycle.internal.MojoExecutor.execute(MojoExecutor.java:145)
	at org.apache.maven.lifecycle.internal.LifecycleModuleBuilder.buildProject(LifecycleModuleBuilder.java:116)
	at org.apache.maven.lifecycle.internal.LifecycleModuleBuilder.buildProject(LifecycleModuleBuilder.java:80)
	at org.apache.maven.lifecycle.internal.builder.singlethreaded.SingleThreadedBuilder.build(SingleThreadedBuilder.java:51)
	at org.apache.maven.lifecycle.internal.LifecycleStarter.execute(LifecycleStarter.java:128)
	at org.apache.maven.DefaultMaven.doExecute(DefaultMaven.java:307)
	at org.apache.maven.DefaultMaven.doExecute(DefaultMaven.java:193)
	at org.apache.maven.DefaultMaven.execute(DefaultMaven.java:106)
	at org.jvnet.hudson.maven3.launcher.Maven33Launcher.main(Maven33Launcher.java:129)
	at sun.reflect.NativeMethodAccessorImpl.invoke0(Native Method)
	at sun.reflect.NativeMethodAccessorImpl.invoke(NativeMethodAccessorImpl.java:62)
	at sun.reflect.DelegatingMethodAccessorImpl.invoke(DelegatingMethodAccessorImpl.java:43)
	at java.lang.reflect.Method.invoke(Method.java:498)
	at org.codehaus.plexus.classworlds.launcher.Launcher.launchStandard(Launcher.java:330)
	at org.codehaus.plexus.classworlds.launcher.Launcher.launch(Launcher.java:238)
	at jenkins.maven3.agent.Maven33Main.launch(Maven33Main.java:176)
	at sun.reflect.NativeMethodAccessorImpl.invoke0(Native Method)
	at sun.reflect.NativeMethodAccessorImpl.invoke(NativeMethodAccessorImpl.java:62)
	at sun.reflect.DelegatingMethodAccessorImpl.invoke(DelegatingMethodAccessorImpl.java:43)
	at java.lang.reflect.Method.invoke(Method.java:498)
	at hudson.maven.Maven3Builder.call(Maven3Builder.java:139)
	at hudson.maven.Maven3Builder.call(Maven3Builder.java:70)
	at hudson.remoting.UserRequest.perform(UserRequest.java:153)
	at hudson.remoting.UserRequest.perform(UserRequest.java:50)
	at hudson.remoting.Request$2.run(Request.java:336)
	at hudson.remoting.InterceptingExecutorService$1.call(InterceptingExecutorService.java:68)
	at java.util.concurrent.FutureTask.run(FutureTask.java:266)
	at java.util.concurrent.ThreadPoolExecutor.runWorker(ThreadPoolExecutor.java:1142)
	at java.util.concurrent.ThreadPoolExecutor$Worker.run(ThreadPoolExecutor.java:617)
	at java.lang.Thread.run(Thread.java:745)
Caused by: org.apache.maven.plugin.MojoFailureException: There are test failures.

Please refer to <https://builds.apache.org/job/beam_PostCommit_Java_MavenInstall/ws/sdks/java/harness/target/surefire-reports>
for the individual test results.
Please refer to dump files (if any exist) [date]-jvmRun[N].dump, [date].dumpstream and [date]-jvmRun[N].dumpstream.
	at org.apache.maven.plugin.surefire.SurefireHelper.throwException(SurefireHelper.java:204)
	at org.apache.maven.plugin.surefire.SurefireHelper.reportExecution(SurefireHelper.java:98)
	at org.apache.maven.plugin.surefire.SurefirePlugin.handleSummary(SurefirePlugin.java:334)
	at org.apache.maven.plugin.surefire.AbstractSurefireMojo.executeAfterPreconditionsChecked(AbstractSurefireMojo.java:937)
	at org.apache.maven.plugin.surefire.AbstractSurefireMojo.execute(AbstractSurefireMojo.java:785)
	at org.apache.maven.plugin.DefaultBuildPluginManager.executeMojo(DefaultBuildPluginManager.java:134)
	at org.apache.maven.lifecycle.internal.MojoExecutor.execute(MojoExecutor.java:208)
	... 31 more
2017-05-05T00:33:42.663 [ERROR] 
2017-05-05T00:33:42.663 [ERROR] Re-run Maven using the -X switch to enable full debug logging.
2017-05-05T00:33:42.663 [ERROR] 
2017-05-05T00:33:42.663 [ERROR] For more information about the errors and possible solutions,
please read the following articles:
2017-05-05T00:33:42.664 [ERROR] [Help 1] http://cwiki.apache.org/confluence/display/MAVEN/MojoFailureException
2017-05-05T00:33:42.664 [ERROR] 
2017-05-05T00:33:42.664 [ERROR] After correcting the problems, you can resume the build with
the command
2017-05-05T00:33:42.664 [ERROR]   mvn <goals> -rf :beam-sdks-java-harness
channel stopped
Not sending mail to unregistered user kirpichov@google.com

Mime
View raw message