beam-commits mailing list archives

Site index · List index
Message view « Date » · « Thread »
Top « Date » · « Thread »
From Apache Jenkins Server <jenk...@builds.apache.org>
Subject Build failed in Jenkins: beam_PostCommit_Java_MavenInstall #3735
Date Tue, 09 May 2017 21:45:44 GMT
See <https://builds.apache.org/job/beam_PostCommit_Java_MavenInstall/3735/display/redirect>

------------------------------------------
[...truncated 402.54 KB...]
2017-05-09T21:42:07.578 [INFO] Downloading: https://repo.maven.apache.org/maven2/org/jacoco/org.jacoco.core/0.7.8/org.jacoco.core-0.7.8.jar
2017-05-09T21:42:07.607 [INFO] Downloaded: https://repo.maven.apache.org/maven2/org/jacoco/org.jacoco.agent/0.7.8/org.jacoco.agent-0.7.8-runtime.jar
(252 KB at 2263.9 KB/sec)
2017-05-09T21:42:07.607 [INFO] Downloading: https://repo.maven.apache.org/maven2/org/ow2/asm/asm-debug-all/5.1/asm-debug-all-5.1.jar
2017-05-09T21:42:07.613 [INFO] Downloaded: https://repo.maven.apache.org/maven2/xerces/xercesImpl/2.8.1/xercesImpl-2.8.1.jar
(1185 KB at 9871.1 KB/sec)
2017-05-09T21:42:07.613 [INFO] Downloading: https://repo.maven.apache.org/maven2/org/jacoco/org.jacoco.report/0.7.8/org.jacoco.report-0.7.8.jar
2017-05-09T21:42:07.614 [INFO] Downloaded: https://repo.maven.apache.org/maven2/org/jacoco/org.jacoco.core/0.7.8/org.jacoco.core-0.7.8.jar
(122 KB at 1021.0 KB/sec)
2017-05-09T21:42:07.619 [INFO] Downloaded: https://repo.maven.apache.org/maven2/commons-collections/commons-collections/3.2/commons-collections-3.2.jar
(558 KB at 4499.0 KB/sec)
2017-05-09T21:42:07.648 [INFO] Downloaded: https://repo.maven.apache.org/maven2/org/jacoco/org.jacoco.report/0.7.8/org.jacoco.report-0.7.8.jar
(125 KB at 813.1 KB/sec)
2017-05-09T21:42:07.662 [INFO] Downloaded: https://repo.maven.apache.org/maven2/org/ow2/asm/asm-debug-all/5.1/asm-debug-all-5.1.jar
(379 KB at 2281.1 KB/sec)
2017-05-09T21:42:07.778 [INFO] Downloaded: https://repo.maven.apache.org/maven2/org/apache/maven/doxia/doxia-module-xhtml/1.1.2/doxia-module-xhtml-1.1.2.jar
(15 KB at 51.8 KB/sec)
2017-05-09T21:42:07.873 [INFO] argLine set to -javaagent:<https://builds.apache.org/job/beam_PostCommit_Java_MavenInstall/ws/.repository/org/jacoco/org.jacoco.agent/0.7.8/org.jacoco.agent-0.7.8-runtime.jar=destfile=/home/jenkins/jenkins-slave/workspace/beam_PostCommit_Java_MavenInstall/sdks/java/core/target/jacoco.exec,excludes=**/AutoValue_*.class,dumponexit=true,output=file>
2017-05-09T21:42:07.976 [INFO] 
2017-05-09T21:42:07.976 [INFO] --- avro-maven-plugin:1.8.1:schema (schemas) @ beam-sdks-java-core
---
2017-05-09T21:42:07.980 [INFO] Downloading: https://repo.maven.apache.org/maven2/org/apache/avro/avro-compiler/1.8.1/avro-compiler-1.8.1.pom
2017-05-09T21:42:08.010 [INFO] Downloaded: https://repo.maven.apache.org/maven2/org/apache/avro/avro-compiler/1.8.1/avro-compiler-1.8.1.pom
(5 KB at 160.6 KB/sec)
2017-05-09T21:42:08.013 [INFO] Downloading: https://repo.maven.apache.org/maven2/org/apache/commons/commons-compress/1.8.1/commons-compress-1.8.1.pom
2017-05-09T21:42:08.042 [INFO] Downloaded: https://repo.maven.apache.org/maven2/org/apache/commons/commons-compress/1.8.1/commons-compress-1.8.1.pom
(12 KB at 385.0 KB/sec)
2017-05-09T21:42:08.046 [INFO] Downloading: https://repo.maven.apache.org/maven2/org/slf4j/slf4j-api/1.7.7/slf4j-api-1.7.7.pom
2017-05-09T21:42:08.073 [INFO] Downloaded: https://repo.maven.apache.org/maven2/org/slf4j/slf4j-api/1.7.7/slf4j-api-1.7.7.pom
(3 KB at 97.3 KB/sec)
2017-05-09T21:42:08.075 [INFO] Downloading: https://repo.maven.apache.org/maven2/org/slf4j/slf4j-parent/1.7.7/slf4j-parent-1.7.7.pom
2017-05-09T21:42:08.104 [INFO] Downloaded: https://repo.maven.apache.org/maven2/org/slf4j/slf4j-parent/1.7.7/slf4j-parent-1.7.7.pom
(12 KB at 401.0 KB/sec)
2017-05-09T21:42:08.107 [INFO] Downloading: https://repo.maven.apache.org/maven2/joda-time/joda-time/2.7/joda-time-2.7.pom
2017-05-09T21:42:08.138 [INFO] Downloaded: https://repo.maven.apache.org/maven2/joda-time/joda-time/2.7/joda-time-2.7.pom
(28 KB at 872.6 KB/sec)
2017-05-09T21:42:08.141 [INFO] Downloading: https://repo.maven.apache.org/maven2/org/slf4j/slf4j-simple/1.7.7/slf4j-simple-1.7.7.pom
2017-05-09T21:42:08.171 [INFO] Downloaded: https://repo.maven.apache.org/maven2/org/slf4j/slf4j-simple/1.7.7/slf4j-simple-1.7.7.pom
(2 KB at 47.9 KB/sec)
2017-05-09T21:42:08.176 [INFO] Downloading: https://repo.maven.apache.org/maven2/org/apache/maven/maven-plugin-api/2.0.10/maven-plugin-api-2.0.10.jar
2017-05-09T21:42:08.176 [INFO] Downloading: https://repo.maven.apache.org/maven2/org/apache/maven/maven-model/2.0.10/maven-model-2.0.10.jar
2017-05-09T21:42:08.177 [INFO] Downloading: https://repo.maven.apache.org/maven2/org/apache/maven/maven-artifact-manager/2.0.10/maven-artifact-manager-2.0.10.jar
2017-05-09T21:42:08.177 [INFO] Downloading: https://repo.maven.apache.org/maven2/org/apache/maven/maven-repository-metadata/2.0.10/maven-repository-metadata-2.0.10.jar
2017-05-09T21:42:08.177 [INFO] Downloading: https://repo.maven.apache.org/maven2/org/codehaus/plexus/plexus-utils/1.5.5/plexus-utils-1.5.5.jar
2017-05-09T21:42:08.208 [INFO] Downloaded: https://repo.maven.apache.org/maven2/org/apache/maven/maven-repository-metadata/2.0.10/maven-repository-metadata-2.0.10.jar
(26 KB at 794.1 KB/sec)
2017-05-09T21:42:08.208 [INFO] Downloading: https://repo.maven.apache.org/maven2/org/apache/maven/maven-artifact/2.0.10/maven-artifact-2.0.10.jar
2017-05-09T21:42:08.209 [INFO] Downloaded: https://repo.maven.apache.org/maven2/org/apache/maven/maven-plugin-api/2.0.10/maven-plugin-api-2.0.10.jar
(13 KB at 370.3 KB/sec)
2017-05-09T21:42:08.209 [INFO] Downloading: https://repo.maven.apache.org/maven2/org/apache/avro/avro-compiler/1.8.1/avro-compiler-1.8.1.jar
2017-05-09T21:42:08.210 [INFO] Downloaded: https://repo.maven.apache.org/maven2/org/apache/maven/maven-artifact-manager/2.0.10/maven-artifact-manager-2.0.10.jar
(57 KB at 1669.7 KB/sec)
2017-05-09T21:42:08.210 [INFO] Downloading: https://repo.maven.apache.org/maven2/org/xerial/snappy/snappy-java/1.1.1.3/snappy-java-1.1.1.3.jar
2017-05-09T21:42:08.211 [INFO] Downloaded: https://repo.maven.apache.org/maven2/org/apache/maven/maven-model/2.0.10/maven-model-2.0.10.jar
(94 KB at 2683.9 KB/sec)
2017-05-09T21:42:08.211 [INFO] Downloading: https://repo.maven.apache.org/maven2/org/apache/commons/commons-compress/1.8.1/commons-compress-1.8.1.jar
2017-05-09T21:42:08.222 [INFO] Downloaded: https://repo.maven.apache.org/maven2/org/codehaus/plexus/plexus-utils/1.5.5/plexus-utils-1.5.5.jar
(246 KB at 5453.0 KB/sec)
2017-05-09T21:42:08.223 [INFO] Downloading: https://repo.maven.apache.org/maven2/joda-time/joda-time/2.7/joda-time-2.7.jar
2017-05-09T21:42:08.243 [INFO] Downloaded: https://repo.maven.apache.org/maven2/org/apache/avro/avro-compiler/1.8.1/avro-compiler-1.8.1.jar
(80 KB at 1207.2 KB/sec)
2017-05-09T21:42:08.243 [INFO] Downloading: https://repo.maven.apache.org/maven2/org/slf4j/slf4j-api/1.7.7/slf4j-api-1.7.7.jar
2017-05-09T21:42:08.243 [INFO] Downloaded: https://repo.maven.apache.org/maven2/org/apache/maven/maven-artifact/2.0.10/maven-artifact-2.0.10.jar
(88 KB at 1321.7 KB/sec)
2017-05-09T21:42:08.244 [INFO] Downloading: https://repo.maven.apache.org/maven2/org/slf4j/slf4j-simple/1.7.7/slf4j-simple-1.7.7.jar
2017-05-09T21:42:08.262 [INFO] Downloaded: https://repo.maven.apache.org/maven2/org/apache/commons/commons-compress/1.8.1/commons-compress-1.8.1.jar
(357 KB at 4199.8 KB/sec)
2017-05-09T21:42:08.273 [INFO] Downloaded: https://repo.maven.apache.org/maven2/org/slf4j/slf4j-simple/1.7.7/slf4j-simple-1.7.7.jar
(11 KB at 108.7 KB/sec)
2017-05-09T21:42:08.275 [INFO] Downloaded: https://repo.maven.apache.org/maven2/org/xerial/snappy/snappy-java/1.1.1.3/snappy-java-1.1.1.3.jar
(576 KB at 5869.8 KB/sec)
2017-05-09T21:42:08.275 [INFO] Downloaded: https://repo.maven.apache.org/maven2/org/slf4j/slf4j-api/1.7.7/slf4j-api-1.7.7.jar
(29 KB at 291.5 KB/sec)
2017-05-09T21:42:08.289 [INFO] Downloaded: https://repo.maven.apache.org/maven2/joda-time/joda-time/2.7/joda-time-2.7.jar
(576 KB at 5138.2 KB/sec)
2017-05-09T21:42:08.726 [INFO] 
2017-05-09T21:42:08.726 [INFO] --- maven-remote-resources-plugin:1.5:process (process-resource-bundles)
@ beam-sdks-java-core ---
2017-05-09T21:42:08.883 [INFO] 
2017-05-09T21:42:08.883 [INFO] --- maven-resources-plugin:3.0.2:resources (default-resources)
@ beam-sdks-java-core ---
2017-05-09T21:42:08.884 [INFO] Using 'UTF-8' encoding to copy filtered resources.
2017-05-09T21:42:08.885 [INFO] Copying 1 resource
2017-05-09T21:42:08.892 [INFO] Copying 3 resources
2017-05-09T21:42:08.943 [INFO] 
2017-05-09T21:42:08.943 [INFO] --- maven-compiler-plugin:3.6.1:compile (default-compile) @
beam-sdks-java-core ---
2017-05-09T21:42:08.988 [INFO] Changes detected - recompiling the module!
2017-05-09T21:42:08.989 [INFO] Compiling 380 source files to <https://builds.apache.org/job/beam_PostCommit_Java_MavenInstall/ws/sdks/java/core/target/classes>
2017-05-09T21:42:13.312 [WARNING] bootstrap class path not set in conjunction with -source
1.7
2017-05-09T21:42:13.312 [INFO] <https://builds.apache.org/job/beam_PostCommit_Java_MavenInstall/ws/sdks/java/core/src/main/java/org/apache/beam/sdk/transforms/Reshuffle.java>:
Some input files use or override a deprecated API.
2017-05-09T21:42:13.312 [INFO] <https://builds.apache.org/job/beam_PostCommit_Java_MavenInstall/ws/sdks/java/core/src/main/java/org/apache/beam/sdk/transforms/Reshuffle.java>:
Recompile with -Xlint:deprecation for details.
2017-05-09T21:42:13.312 [INFO] <https://builds.apache.org/job/beam_PostCommit_Java_MavenInstall/ws/sdks/java/core/src/main/java/org/apache/beam/sdk/coders/Coder.java>:
Some input files use unchecked or unsafe operations.
2017-05-09T21:42:13.312 [INFO] <https://builds.apache.org/job/beam_PostCommit_Java_MavenInstall/ws/sdks/java/core/src/main/java/org/apache/beam/sdk/coders/Coder.java>:
Recompile with -Xlint:unchecked for details.
2017-05-09T21:42:13.406 [INFO] 
2017-05-09T21:42:13.406 [INFO] --- build-helper-maven-plugin:3.0.0:add-test-source (add-test-source)
@ beam-sdks-java-core ---
2017-05-09T21:42:13.409 [INFO] Test Source directory: <https://builds.apache.org/job/beam_PostCommit_Java_MavenInstall/ws/sdks/java/core/target/generated-test-sources/java>
added.
2017-05-09T21:42:13.507 [INFO] 
2017-05-09T21:42:13.507 [INFO] --- maven-resources-plugin:3.0.2:testResources (default-testResources)
@ beam-sdks-java-core ---
2017-05-09T21:42:13.509 [INFO] Using 'UTF-8' encoding to copy filtered resources.
2017-05-09T21:42:13.509 [INFO] skip non existing resourceDirectory <https://builds.apache.org/job/beam_PostCommit_Java_MavenInstall/ws/sdks/java/core/src/test/resources>
2017-05-09T21:42:13.509 [INFO] Copying 3 resources
2017-05-09T21:42:13.799 [INFO] 
2017-05-09T21:42:13.799 [INFO] --- maven-compiler-plugin:3.6.1:testCompile (default-testCompile)
@ beam-sdks-java-core ---
2017-05-09T21:42:13.843 [INFO] Changes detected - recompiling the module!
2017-05-09T21:42:13.844 [INFO] Compiling 229 source files to <https://builds.apache.org/job/beam_PostCommit_Java_MavenInstall/ws/sdks/java/core/target/test-classes>
2017-05-09T21:42:17.001 [INFO] <https://builds.apache.org/job/beam_PostCommit_Java_MavenInstall/ws/sdks/java/core/src/test/java/org/apache/beam/sdk/coders/AvroCoderTest.java>:
Some input files use or override a deprecated API.
2017-05-09T21:42:17.001 [INFO] <https://builds.apache.org/job/beam_PostCommit_Java_MavenInstall/ws/sdks/java/core/src/test/java/org/apache/beam/sdk/coders/AvroCoderTest.java>:
Recompile with -Xlint:deprecation for details.
2017-05-09T21:42:17.001 [INFO] <https://builds.apache.org/job/beam_PostCommit_Java_MavenInstall/ws/sdks/java/core/src/test/java/org/apache/beam/sdk/coders/AvroCoderTest.java>:
Some input files use unchecked or unsafe operations.
2017-05-09T21:42:17.001 [INFO] <https://builds.apache.org/job/beam_PostCommit_Java_MavenInstall/ws/sdks/java/core/src/test/java/org/apache/beam/sdk/coders/AvroCoderTest.java>:
Recompile with -Xlint:unchecked for details.
2017-05-09T21:42:17.054 [INFO] 
2017-05-09T21:42:17.054 [INFO] --- maven-checkstyle-plugin:2.17:check (default) @ beam-sdks-java-core
---
2017-05-09T21:42:37.598 [INFO] Starting audit...
[ERROR] <https://builds.apache.org/job/beam_PostCommit_Java_MavenInstall/ws/sdks/java/core/src/main/java/org/apache/beam/sdk/util/ApiSurface.java>:359:
TODO comments must not include usernames. [RegexpSingleline]
Audit done.
2017-05-09T21:42:37.599 [INFO] There is 1 error reported by Checkstyle 6.19 with beam/checkstyle.xml
ruleset.
2017-05-09T21:42:37.610 [ERROR] src/main/java/org/apache/beam/sdk/util/ApiSurface.java:[359]
(regexp) RegexpSingleline: TODO comments must not include usernames.
[JENKINS] Archiving disabled
2017-05-09T21:42:40.904 [INFO]                                                           
             
2017-05-09T21:42:40.904 [INFO] ------------------------------------------------------------------------
2017-05-09T21:42:40.904 [INFO] Skipping Apache Beam :: Parent
2017-05-09T21:42:40.904 [INFO] This project has been banned from the build due to previous
failures.
2017-05-09T21:42:40.904 [INFO] ------------------------------------------------------------------------
[JENKINS] Archiving disabled
[JENKINS] Archiving disabled
[JENKINS] Archiving disabled
[JENKINS] Archiving disabled
[JENKINS] Archiving disabled
[JENKINS] Archiving disabled
[JENKINS] Archiving disabled
[JENKINS] Archiving disabled
[JENKINS] Archiving disabled
[JENKINS] Archiving disabled
[JENKINS] Archiving disabled
[JENKINS] Archiving disabled
[JENKINS] Archiving disabled
[JENKINS] Archiving disabled
[JENKINS] Archiving disabled
[JENKINS] Archiving disabled
[JENKINS] Archiving disabled
[JENKINS] Archiving disabled
[JENKINS] Archiving disabled
[JENKINS] Archiving disabled
[JENKINS] Archiving disabled
[JENKINS] Archiving disabled
[JENKINS] Archiving disabled
[JENKINS] Archiving disabled
[JENKINS] Archiving disabled
[JENKINS] Archiving disabled
[JENKINS] Archiving disabled
[JENKINS] Archiving disabled
[JENKINS] Archiving disabled
[JENKINS] Archiving disabled
[JENKINS] Archiving disabled
[JENKINS] Archiving disabled
[JENKINS] Archiving disabled
[JENKINS] Archiving disabled
[JENKINS] Archiving disabled
[JENKINS] Archiving disabled
[JENKINS] Archiving disabled
[JENKINS] Archiving disabled
[JENKINS] Archiving disabled
[JENKINS] Archiving disabled
[JENKINS] Archiving disabled
[JENKINS] Archiving disabled
[JENKINS] Archiving disabled
[JENKINS] Archiving disabled
[JENKINS] Archiving disabled
[JENKINS] Archiving disabled2017-05-09T21:42:59.688 [INFO] ------------------------------------------------------------------------
2017-05-09T21:42:59.688 [INFO] Reactor Summary:
2017-05-09T21:42:59.688 [INFO] 
2017-05-09T21:42:59.688 [INFO] Apache Beam :: Parent .............................. SUCCESS
[ 33.723 s]
2017-05-09T21:42:59.688 [INFO] Apache Beam :: SDKs :: Java :: Build Tools ......... SUCCESS
[ 13.732 s]
2017-05-09T21:42:59.688 [INFO] Apache Beam :: SDKs ................................ SUCCESS
[  6.404 s]
2017-05-09T21:42:59.688 [INFO] Apache Beam :: SDKs :: Common ...................... SUCCESS
[  2.266 s]
2017-05-09T21:42:59.688 [INFO] Apache Beam :: SDKs :: Common :: Fn API ............ SUCCESS
[ 14.743 s]
2017-05-09T21:42:59.688 [INFO] Apache Beam :: SDKs :: Common :: Runner API ........ SUCCESS
[ 11.466 s]
2017-05-09T21:42:59.688 [INFO] Apache Beam :: SDKs :: Java ........................ SUCCESS
[  3.894 s]
2017-05-09T21:42:59.688 [INFO] Apache Beam :: SDKs :: Java :: Core ................ FAILURE
[ 35.654 s]
2017-05-09T21:42:59.688 [INFO] Apache Beam :: SDKs :: Java :: IO .................. SKIPPED
2017-05-09T21:42:59.688 [INFO] Apache Beam :: SDKs :: Java :: IO :: Common ........ SKIPPED
2017-05-09T21:42:59.689 [INFO] Apache Beam :: Runners ............................. SKIPPED
2017-05-09T21:42:59.689 [INFO] Apache Beam :: Runners :: Core Construction Java ... SKIPPED
2017-05-09T21:42:59.689 [INFO] Apache Beam :: Runners :: Core Java ................ SKIPPED
2017-05-09T21:42:59.689 [INFO] Apache Beam :: Runners :: Direct Java .............. SKIPPED
2017-05-09T21:42:59.689 [INFO] Apache Beam :: SDKs :: Java :: IO :: Elasticsearch . SKIPPED
2017-05-09T21:42:59.689 [INFO] Apache Beam :: SDKs :: Java :: Extensions .......... SKIPPED
2017-05-09T21:42:59.689 [INFO] Apache Beam :: SDKs :: Java :: Extensions :: Google Cloud Platform
Core SKIPPED
2017-05-09T21:42:59.689 [INFO] Apache Beam :: SDKs :: Java :: Extensions :: Protobuf SKIPPED
2017-05-09T21:42:59.689 [INFO] Apache Beam :: SDKs :: Java :: IO :: Google Cloud Platform
SKIPPED
2017-05-09T21:42:59.689 [INFO] Apache Beam :: SDKs :: Java :: IO :: Hadoop Common . SKIPPED
2017-05-09T21:42:59.689 [INFO] Apache Beam :: SDKs :: Java :: IO :: Hadoop File System SKIPPED
2017-05-09T21:42:59.689 [INFO] Apache Beam :: SDKs :: Java :: IO :: Hadoop ........ SKIPPED
2017-05-09T21:42:59.689 [INFO] Apache Beam :: SDKs :: Java :: IO :: Hadoop :: input-format
SKIPPED
2017-05-09T21:42:59.689 [INFO] Apache Beam :: Runners :: Google Cloud Dataflow .... SKIPPED
2017-05-09T21:42:59.689 [INFO] Apache Beam :: SDKs :: Java :: IO :: Hadoop :: jdk1.8-tests
SKIPPED
2017-05-09T21:42:59.689 [INFO] Apache Beam :: SDKs :: Java :: IO :: HBase ......... SKIPPED
2017-05-09T21:42:59.689 [INFO] Apache Beam :: SDKs :: Java :: IO :: JDBC .......... SKIPPED
2017-05-09T21:42:59.689 [INFO] Apache Beam :: SDKs :: Java :: IO :: JMS ........... SKIPPED
2017-05-09T21:42:59.689 [INFO] Apache Beam :: SDKs :: Java :: IO :: Kafka ......... SKIPPED
2017-05-09T21:42:59.689 [INFO] Apache Beam :: SDKs :: Java :: IO :: Kinesis ....... SKIPPED
2017-05-09T21:42:59.689 [INFO] Apache Beam :: SDKs :: Java :: IO :: MongoDB ....... SKIPPED
2017-05-09T21:42:59.689 [INFO] Apache Beam :: SDKs :: Java :: IO :: MQTT .......... SKIPPED
2017-05-09T21:42:59.689 [INFO] Apache Beam :: SDKs :: Java :: IO :: XML ........... SKIPPED
2017-05-09T21:42:59.689 [INFO] Apache Beam :: SDKs :: Java :: Maven Archetypes .... SKIPPED
2017-05-09T21:42:59.689 [INFO] Apache Beam :: SDKs :: Java :: Maven Archetypes :: Starter
SKIPPED
2017-05-09T21:42:59.689 [INFO] Apache Beam :: Examples ............................ SKIPPED
2017-05-09T21:42:59.689 [INFO] Apache Beam :: Examples :: Java .................... SKIPPED
2017-05-09T21:42:59.689 [INFO] Apache Beam :: SDKs :: Java :: Maven Archetypes :: Examples
SKIPPED
2017-05-09T21:42:59.689 [INFO] Apache Beam :: Runners :: Flink .................... SKIPPED
2017-05-09T21:42:59.689 [INFO] Apache Beam :: Runners :: Spark .................... SKIPPED
2017-05-09T21:42:59.689 [INFO] Apache Beam :: Examples :: Java 8 .................. SKIPPED
2017-05-09T21:42:59.689 [INFO] Apache Beam :: SDKs :: Java :: Maven Archetypes :: Examples
- Java 8 SKIPPED
2017-05-09T21:42:59.689 [INFO] Apache Beam :: SDKs :: Java :: Extensions :: Jackson SKIPPED
2017-05-09T21:42:59.689 [INFO] Apache Beam :: SDKs :: Java :: Extensions :: Join library SKIPPED
2017-05-09T21:42:59.689 [INFO] Apache Beam :: SDKs :: Java :: Extensions :: Sorter  SKIPPED
2017-05-09T21:42:59.689 [INFO] Apache Beam :: SDKs :: Java :: Harness ............. SKIPPED
2017-05-09T21:42:59.689 [INFO] Apache Beam :: SDKs :: Java :: Java 8 Tests ........ SKIPPED
2017-05-09T21:42:59.689 [INFO] Apache Beam :: SDKs :: Python ...................... SKIPPED
2017-05-09T21:42:59.689 [INFO] Apache Beam :: Runners :: Apex ..................... SKIPPED
2017-05-09T21:42:59.689 [INFO] Apache Beam :: SDKs :: Java :: Aggregated Javadoc .. SKIPPED
2017-05-09T21:42:59.689 [INFO] ------------------------------------------------------------------------
2017-05-09T21:42:59.689 [INFO] BUILD FAILURE
2017-05-09T21:42:59.689 [INFO] ------------------------------------------------------------------------
2017-05-09T21:42:59.689 [INFO] Total time: 02:47 min
2017-05-09T21:42:59.689 [INFO] Finished at: 2017-05-09T21:42:59+00:00

2017-05-09T21:43:00.188 [INFO] Final Memory: 108M/1559M
2017-05-09T21:43:00.188 [INFO] ------------------------------------------------------------------------
Waiting for Jenkins to finish collecting data
2017-05-09T21:43:51.477 [ERROR] Failed to execute goal org.apache.maven.plugins:maven-checkstyle-plugin:2.17:check
(default) on project beam-sdks-java-core: You have 1 Checkstyle violation. -> [Help 1]
org.apache.maven.lifecycle.LifecycleExecutionException: Failed to execute goal org.apache.maven.plugins:maven-checkstyle-plugin:2.17:check
(default) on project beam-sdks-java-core: You have 1 Checkstyle violation.
	at org.apache.maven.lifecycle.internal.MojoExecutor.execute(MojoExecutor.java:212)
	at org.apache.maven.lifecycle.internal.MojoExecutor.execute(MojoExecutor.java:153)
	at org.apache.maven.lifecycle.internal.MojoExecutor.execute(MojoExecutor.java:145)
	at org.apache.maven.lifecycle.internal.LifecycleModuleBuilder.buildProject(LifecycleModuleBuilder.java:116)
	at org.apache.maven.lifecycle.internal.LifecycleModuleBuilder.buildProject(LifecycleModuleBuilder.java:80)
	at org.apache.maven.lifecycle.internal.builder.singlethreaded.SingleThreadedBuilder.build(SingleThreadedBuilder.java:51)
	at org.apache.maven.lifecycle.internal.LifecycleStarter.execute(LifecycleStarter.java:128)
	at org.apache.maven.DefaultMaven.doExecute(DefaultMaven.java:307)
	at org.apache.maven.DefaultMaven.doExecute(DefaultMaven.java:193)
	at org.apache.maven.DefaultMaven.execute(DefaultMaven.java:106)
	at org.jvnet.hudson.maven3.launcher.Maven33Launcher.main(Maven33Launcher.java:129)
	at sun.reflect.NativeMethodAccessorImpl.invoke0(Native Method)
	at sun.reflect.NativeMethodAccessorImpl.invoke(NativeMethodAccessorImpl.java:62)
	at sun.reflect.DelegatingMethodAccessorImpl.invoke(DelegatingMethodAccessorImpl.java:43)
	at java.lang.reflect.Method.invoke(Method.java:498)
	at org.codehaus.plexus.classworlds.launcher.Launcher.launchStandard(Launcher.java:330)
	at org.codehaus.plexus.classworlds.launcher.Launcher.launch(Launcher.java:238)
	at jenkins.maven3.agent.Maven33Main.launch(Maven33Main.java:176)
	at sun.reflect.NativeMethodAccessorImpl.invoke0(Native Method)
	at sun.reflect.NativeMethodAccessorImpl.invoke(NativeMethodAccessorImpl.java:62)
	at sun.reflect.DelegatingMethodAccessorImpl.invoke(DelegatingMethodAccessorImpl.java:43)
	at java.lang.reflect.Method.invoke(Method.java:498)
	at hudson.maven.Maven3Builder.call(Maven3Builder.java:139)
	at hudson.maven.Maven3Builder.call(Maven3Builder.java:70)
	at hudson.remoting.UserRequest.perform(UserRequest.java:153)
	at hudson.remoting.UserRequest.perform(UserRequest.java:50)
	at hudson.remoting.Request$2.run(Request.java:336)
	at hudson.remoting.InterceptingExecutorService$1.call(InterceptingExecutorService.java:68)
	at java.util.concurrent.FutureTask.run(FutureTask.java:266)
	at java.util.concurrent.ThreadPoolExecutor.runWorker(ThreadPoolExecutor.java:1142)
	at java.util.concurrent.ThreadPoolExecutor$Worker.run(ThreadPoolExecutor.java:617)
	at java.lang.Thread.run(Thread.java:745)
Caused by: org.apache.maven.plugin.MojoFailureException: You have 1 Checkstyle violation.
	at org.apache.maven.plugin.checkstyle.CheckstyleViolationCheckMojo.execute(CheckstyleViolationCheckMojo.java:588)
	at org.apache.maven.plugin.DefaultBuildPluginManager.executeMojo(DefaultBuildPluginManager.java:134)
	at org.apache.maven.lifecycle.internal.MojoExecutor.execute(MojoExecutor.java:208)
	... 31 more
2017-05-09T21:43:51.478 [ERROR] 
2017-05-09T21:43:51.478 [ERROR] Re-run Maven using the -X switch to enable full debug logging.
2017-05-09T21:43:51.478 [ERROR] 
2017-05-09T21:43:51.478 [ERROR] For more information about the errors and possible solutions,
please read the following articles:
2017-05-09T21:43:51.478 [ERROR] [Help 1] http://cwiki.apache.org/confluence/display/MAVEN/MojoFailureException
2017-05-09T21:43:51.478 [ERROR] 
2017-05-09T21:43:51.478 [ERROR] After correcting the problems, you can resume the build with
the command
2017-05-09T21:43:51.478 [ERROR]   mvn <goals> -rf :beam-sdks-java-core
channel stopped

Mime
View raw message