beam-commits mailing list archives

Site index · List index
Message view « Date » · « Thread »
Top « Date » · « Thread »
From Apache Jenkins Server <jenk...@builds.apache.org>
Subject Build failed in Jenkins: beam_PostCommit_Java_ValidatesRunner_Apex #1590
Date Mon, 29 May 2017 06:03:19 GMT
See <https://builds.apache.org/job/beam_PostCommit_Java_ValidatesRunner_Apex/1590/display/redirect>

------------------------------------------
[...truncated 313.72 KB...]
2017-05-29T06:03:00.969 [INFO] --- maven-surefire-plugin:2.20:test (default-test) @ beam-sdks-common-runner-api
---
[JENKINS] Recording test results2017-05-29T06:03:01.056 [INFO] 
2017-05-29T06:03:01.056 [INFO] --- build-helper-maven-plugin:3.0.0:regex-properties (render-artifact-id)
@ beam-sdks-common-runner-api ---

2017-05-29T06:03:01.190 [INFO] 
2017-05-29T06:03:01.190 [INFO] --- maven-jar-plugin:3.0.2:jar (default-jar) @ beam-sdks-common-runner-api
---
2017-05-29T06:03:01.225 [INFO] Building jar: <https://builds.apache.org/job/beam_PostCommit_Java_ValidatesRunner_Apex/ws/sdks/common/runner-api/target/beam-sdks-common-runner-api-2.1.0-SNAPSHOT.jar>
2017-05-29T06:03:01.330 [INFO] 
2017-05-29T06:03:01.330 [INFO] --- maven-site-plugin:3.5.1:attach-descriptor (attach-descriptor)
@ beam-sdks-common-runner-api ---
2017-05-29T06:03:01.455 [INFO] 
2017-05-29T06:03:01.455 [INFO] --- maven-jar-plugin:3.0.2:test-jar (default-test-jar) @ beam-sdks-common-runner-api
---
2017-05-29T06:03:01.459 [INFO] Building jar: <https://builds.apache.org/job/beam_PostCommit_Java_ValidatesRunner_Apex/ws/sdks/common/runner-api/target/beam-sdks-common-runner-api-2.1.0-SNAPSHOT-tests.jar>
2017-05-29T06:03:01.516 [INFO] 
2017-05-29T06:03:01.516 [INFO] --- maven-shade-plugin:3.0.0:shade (bundle-and-repackage) @
beam-sdks-common-runner-api ---
2017-05-29T06:03:01.519 [INFO] Excluding com.google.protobuf:protobuf-java:jar:3.2.0 from
the shaded jar.
2017-05-29T06:03:02.286 [INFO] Replacing original artifact with shaded artifact.
2017-05-29T06:03:02.287 [INFO] Replacing <https://builds.apache.org/job/beam_PostCommit_Java_ValidatesRunner_Apex/ws/sdks/common/runner-api/target/beam-sdks-common-runner-api-2.1.0-SNAPSHOT.jar>
with <https://builds.apache.org/job/beam_PostCommit_Java_ValidatesRunner_Apex/ws/sdks/common/runner-api/target/beam-sdks-common-runner-api-2.1.0-SNAPSHOT-shaded.jar>
2017-05-29T06:03:02.287 [INFO] Replacing original test artifact with shaded test artifact.
2017-05-29T06:03:02.287 [INFO] Replacing <https://builds.apache.org/job/beam_PostCommit_Java_ValidatesRunner_Apex/ws/sdks/common/runner-api/target/beam-sdks-common-runner-api-2.1.0-SNAPSHOT-tests.jar>
with <https://builds.apache.org/job/beam_PostCommit_Java_ValidatesRunner_Apex/ws/sdks/common/runner-api/target/beam-sdks-common-runner-api-2.1.0-SNAPSHOT-shaded-tests.jar>
2017-05-29T06:03:02.374 [INFO] 
2017-05-29T06:03:02.374 [INFO] --- maven-dependency-plugin:3.0.1:analyze-only (default) @
beam-sdks-common-runner-api ---
2017-05-29T06:03:02.439 [INFO] No dependency problems found
[JENKINS] Archiving disabled
2017-05-29T06:03:03.684 [INFO]                                                           
             
2017-05-29T06:03:03.684 [INFO] ------------------------------------------------------------------------
2017-05-29T06:03:03.684 [INFO] Building Apache Beam :: SDKs :: Java 2.1.0-SNAPSHOT
2017-05-29T06:03:03.684 [INFO] ------------------------------------------------------------------------
2017-05-29T06:03:03.688 [INFO] 
2017-05-29T06:03:03.688 [INFO] --- maven-clean-plugin:3.0.0:clean (default-clean) @ beam-sdks-java-parent
---
2017-05-29T06:03:03.691 [INFO] Deleting <https://builds.apache.org/job/beam_PostCommit_Java_ValidatesRunner_Apex/ws/sdks/java>
(includes = [**/*.pyc, **/*.egg-info/, **/sdks/python/LICENSE, **/sdks/python/NOTICE, **/sdks/python/README.md],
excludes = [])
2017-05-29T06:03:03.802 [INFO] 
2017-05-29T06:03:03.803 [INFO] --- maven-enforcer-plugin:1.4.1:enforce (enforce) @ beam-sdks-java-parent
---
2017-05-29T06:03:03.856 [INFO] 
2017-05-29T06:03:03.856 [INFO] --- maven-enforcer-plugin:1.4.1:enforce (enforce-banned-dependencies)
@ beam-sdks-java-parent ---
2017-05-29T06:03:03.912 [INFO] 
2017-05-29T06:03:03.912 [INFO] --- maven-remote-resources-plugin:1.5:process (process-resource-bundles)
@ beam-sdks-java-parent ---
2017-05-29T06:03:03.971 [INFO] 
2017-05-29T06:03:03.971 [INFO] --- maven-checkstyle-plugin:2.17:check (default) @ beam-sdks-java-parent
---
2017-05-29T06:03:04.421 [INFO] Starting audit...
Audit done.
2017-05-29T06:03:04.471 [INFO] 
2017-05-29T06:03:04.471 [INFO] --- build-helper-maven-plugin:3.0.0:regex-properties (render-artifact-id)
@ beam-sdks-java-parent ---
2017-05-29T06:03:04.522 [INFO] 
2017-05-29T06:03:04.522 [INFO] --- maven-site-plugin:3.5.1:attach-descriptor (attach-descriptor)
@ beam-sdks-java-parent ---
2017-05-29T06:03:04.623 [INFO] 
2017-05-29T06:03:04.623 [INFO] --- maven-jar-plugin:3.0.2:jar (default-jar) @ beam-sdks-java-parent
---
2017-05-29T06:03:04.624 [INFO] Skipping packaging of the jar
2017-05-29T06:03:04.726 [INFO] 
2017-05-29T06:03:04.726 [INFO] --- maven-jar-plugin:3.0.2:test-jar (default-test-jar) @ beam-sdks-java-parent
---
2017-05-29T06:03:04.727 [INFO] Skipping packaging of the test-jar
2017-05-29T06:03:04.778 [INFO] 
2017-05-29T06:03:04.778 [INFO] --- maven-shade-plugin:3.0.0:shade (bundle-and-repackage) @
beam-sdks-java-parent ---
2017-05-29T06:03:04.781 [INFO] Replacing original artifact with shaded artifact.
2017-05-29T06:03:04.832 [INFO] 
2017-05-29T06:03:04.832 [INFO] --- maven-dependency-plugin:3.0.1:analyze-only (default) @
beam-sdks-java-parent ---
2017-05-29T06:03:04.833 [INFO] Skipping pom project
[JENKINS] Archiving disabled
2017-05-29T06:03:05.520 [INFO]                                                           
             
2017-05-29T06:03:05.520 [INFO] ------------------------------------------------------------------------
2017-05-29T06:03:05.520 [INFO] Building Apache Beam :: SDKs :: Java :: Core 2.1.0-SNAPSHOT
2017-05-29T06:03:05.520 [INFO] ------------------------------------------------------------------------
2017-05-29T06:03:05.522 [INFO] Downloading: https://repo.maven.apache.org/maven2/org/jacoco/jacoco-maven-plugin/0.7.8/jacoco-maven-plugin-0.7.8.pom
2017-05-29T06:03:05.549 [INFO] Downloaded: https://repo.maven.apache.org/maven2/org/jacoco/jacoco-maven-plugin/0.7.8/jacoco-maven-plugin-0.7.8.pom
(5 KB at 161.1 KB/sec)
2017-05-29T06:03:05.551 [INFO] Downloading: https://repo.maven.apache.org/maven2/org/jacoco/org.jacoco.build/0.7.8/org.jacoco.build-0.7.8.pom
2017-05-29T06:03:05.580 [INFO] Downloaded: https://repo.maven.apache.org/maven2/org/jacoco/org.jacoco.build/0.7.8/org.jacoco.build-0.7.8.pom
(35 KB at 1198.9 KB/sec)
2017-05-29T06:03:05.584 [INFO] Downloading: https://repo.maven.apache.org/maven2/org/jacoco/jacoco-maven-plugin/0.7.8/jacoco-maven-plugin-0.7.8.jar
2017-05-29T06:03:05.616 [INFO] Downloaded: https://repo.maven.apache.org/maven2/org/jacoco/jacoco-maven-plugin/0.7.8/jacoco-maven-plugin-0.7.8.jar
(52 KB at 1621.0 KB/sec)
2017-05-29T06:03:05.621 [INFO] Downloading: https://repo.maven.apache.org/maven2/org/apache/avro/avro-maven-plugin/1.8.1/avro-maven-plugin-1.8.1.pom
2017-05-29T06:03:05.649 [INFO] Downloaded: https://repo.maven.apache.org/maven2/org/apache/avro/avro-maven-plugin/1.8.1/avro-maven-plugin-1.8.1.pom
(4 KB at 121.0 KB/sec)
2017-05-29T06:03:05.651 [INFO] Downloading: https://repo.maven.apache.org/maven2/org/apache/avro/avro-parent/1.8.1/avro-parent-1.8.1.pom
2017-05-29T06:03:05.678 [INFO] Downloaded: https://repo.maven.apache.org/maven2/org/apache/avro/avro-parent/1.8.1/avro-parent-1.8.1.pom
(21 KB at 743.2 KB/sec)
2017-05-29T06:03:05.680 [INFO] Downloading: https://repo.maven.apache.org/maven2/org/apache/avro/avro-toplevel/1.8.1/avro-toplevel-1.8.1.pom
2017-05-29T06:03:05.707 [INFO] Downloaded: https://repo.maven.apache.org/maven2/org/apache/avro/avro-toplevel/1.8.1/avro-toplevel-1.8.1.pom
(15 KB at 554.7 KB/sec)
2017-05-29T06:03:05.710 [INFO] Downloading: https://repo.maven.apache.org/maven2/org/apache/avro/avro-maven-plugin/1.8.1/avro-maven-plugin-1.8.1.jar
2017-05-29T06:03:05.738 [INFO] Downloaded: https://repo.maven.apache.org/maven2/org/apache/avro/avro-maven-plugin/1.8.1/avro-maven-plugin-1.8.1.jar
(27 KB at 947.0 KB/sec)
2017-05-29T06:03:05.745 [INFO] Downloading: https://repo.maven.apache.org/maven2/com/google/guava/guava-testlib/20.0/guava-testlib-20.0.pom
2017-05-29T06:03:05.771 [INFO] Downloaded: https://repo.maven.apache.org/maven2/com/google/guava/guava-testlib/20.0/guava-testlib-20.0.pom
(3 KB at 108.4 KB/sec)
2017-05-29T06:03:05.775 [INFO] Downloading: https://repo.maven.apache.org/maven2/com/fasterxml/jackson/core/jackson-core/2.8.8/jackson-core-2.8.8.pom
2017-05-29T06:03:05.800 [INFO] Downloaded: https://repo.maven.apache.org/maven2/com/fasterxml/jackson/core/jackson-core/2.8.8/jackson-core-2.8.8.pom
(6 KB at 211.5 KB/sec)
2017-05-29T06:03:05.802 [INFO] Downloading: https://repo.maven.apache.org/maven2/com/fasterxml/jackson/jackson-parent/2.8/jackson-parent-2.8.pom
2017-05-29T06:03:05.828 [INFO] Downloaded: https://repo.maven.apache.org/maven2/com/fasterxml/jackson/jackson-parent/2.8/jackson-parent-2.8.pom
(8 KB at 299.4 KB/sec)
2017-05-29T06:03:05.829 [INFO] Downloading: https://repo.maven.apache.org/maven2/com/fasterxml/oss-parent/27/oss-parent-27.pom
2017-05-29T06:03:05.857 [INFO] Downloaded: https://repo.maven.apache.org/maven2/com/fasterxml/oss-parent/27/oss-parent-27.pom
(20 KB at 685.0 KB/sec)
2017-05-29T06:03:05.861 [INFO] Downloading: https://repo.maven.apache.org/maven2/com/fasterxml/jackson/core/jackson-annotations/2.8.8/jackson-annotations-2.8.8.pom
2017-05-29T06:03:05.887 [INFO] Downloaded: https://repo.maven.apache.org/maven2/com/fasterxml/jackson/core/jackson-annotations/2.8.8/jackson-annotations-2.8.8.pom
(2 KB at 69.4 KB/sec)
2017-05-29T06:03:05.891 [INFO] Downloading: https://repo.maven.apache.org/maven2/com/fasterxml/jackson/core/jackson-databind/2.8.8/jackson-databind-2.8.8.pom
2017-05-29T06:03:05.917 [INFO] Downloaded: https://repo.maven.apache.org/maven2/com/fasterxml/jackson/core/jackson-databind/2.8.8/jackson-databind-2.8.8.pom
(6 KB at 203.8 KB/sec)
2017-05-29T06:03:05.922 [INFO] Downloading: https://repo.maven.apache.org/maven2/org/slf4j/slf4j-api/1.7.14/slf4j-api-1.7.14.pom
2017-05-29T06:03:05.949 [INFO] Downloaded: https://repo.maven.apache.org/maven2/org/slf4j/slf4j-api/1.7.14/slf4j-api-1.7.14.pom
(3 KB at 100.4 KB/sec)
2017-05-29T06:03:05.950 [INFO] Downloading: https://repo.maven.apache.org/maven2/org/slf4j/slf4j-parent/1.7.14/slf4j-parent-1.7.14.pom
2017-05-29T06:03:05.977 [INFO] Downloaded: https://repo.maven.apache.org/maven2/org/slf4j/slf4j-parent/1.7.14/slf4j-parent-1.7.14.pom
(14 KB at 486.8 KB/sec)
2017-05-29T06:03:05.980 [INFO] Downloading: https://repo.maven.apache.org/maven2/net/bytebuddy/byte-buddy/1.6.8/byte-buddy-1.6.8.pom
2017-05-29T06:03:06.009 [INFO] Downloaded: https://repo.maven.apache.org/maven2/net/bytebuddy/byte-buddy/1.6.8/byte-buddy-1.6.8.pom
(12 KB at 396.8 KB/sec)
2017-05-29T06:03:06.010 [INFO] Downloading: https://repo.maven.apache.org/maven2/net/bytebuddy/byte-buddy-parent/1.6.8/byte-buddy-parent-1.6.8.pom
2017-05-29T06:03:06.039 [INFO] Downloaded: https://repo.maven.apache.org/maven2/net/bytebuddy/byte-buddy-parent/1.6.8/byte-buddy-parent-1.6.8.pom
(26 KB at 869.3 KB/sec)
2017-05-29T06:03:06.044 [INFO] Downloading: https://repo.maven.apache.org/maven2/org/apache/avro/avro/1.8.1/avro-1.8.1.pom
2017-05-29T06:03:06.070 [INFO] Downloaded: https://repo.maven.apache.org/maven2/org/apache/avro/avro/1.8.1/avro-1.8.1.pom
(7 KB at 266.2 KB/sec)
2017-05-29T06:03:06.074 [INFO] Downloading: https://repo.maven.apache.org/maven2/org/codehaus/jackson/jackson-core-asl/1.9.13/jackson-core-asl-1.9.13.pom
2017-05-29T06:03:06.100 [INFO] Downloaded: https://repo.maven.apache.org/maven2/org/codehaus/jackson/jackson-core-asl/1.9.13/jackson-core-asl-1.9.13.pom
(2 KB at 48.0 KB/sec)
2017-05-29T06:03:06.102 [INFO] Downloading: https://repo.maven.apache.org/maven2/org/codehaus/jackson/jackson-mapper-asl/1.9.13/jackson-mapper-asl-1.9.13.pom
2017-05-29T06:03:06.127 [INFO] Downloaded: https://repo.maven.apache.org/maven2/org/codehaus/jackson/jackson-mapper-asl/1.9.13/jackson-mapper-asl-1.9.13.pom
(2 KB at 58.8 KB/sec)
2017-05-29T06:03:06.129 [INFO] Downloading: https://repo.maven.apache.org/maven2/com/thoughtworks/paranamer/paranamer/2.7/paranamer-2.7.pom
2017-05-29T06:03:06.155 [INFO] Downloaded: https://repo.maven.apache.org/maven2/com/thoughtworks/paranamer/paranamer/2.7/paranamer-2.7.pom
(6 KB at 198.0 KB/sec)
2017-05-29T06:03:06.157 [INFO] Downloading: https://repo.maven.apache.org/maven2/com/thoughtworks/paranamer/paranamer-parent/2.7/paranamer-parent-2.7.pom
2017-05-29T06:03:06.184 [INFO] Downloaded: https://repo.maven.apache.org/maven2/com/thoughtworks/paranamer/paranamer-parent/2.7/paranamer-parent-2.7.pom
(12 KB at 416.1 KB/sec)
2017-05-29T06:03:06.186 [INFO] Downloading: https://repo.maven.apache.org/maven2/org/xerial/snappy/snappy-java/1.1.4-M3/snappy-java-1.1.4-M3.pom
2017-05-29T06:03:06.212 [INFO] Downloaded: https://repo.maven.apache.org/maven2/org/xerial/snappy/snappy-java/1.1.4-M3/snappy-java-1.1.4-M3.pom
(4 KB at 123.5 KB/sec)
2017-05-29T06:03:06.215 [INFO] Downloading: https://repo.maven.apache.org/maven2/org/apache/commons/commons-lang3/3.5/commons-lang3-3.5.pom
2017-05-29T06:03:06.242 [INFO] Downloaded: https://repo.maven.apache.org/maven2/org/apache/commons/commons-lang3/3.5/commons-lang3-3.5.pom
(23 KB at 844.4 KB/sec)
2017-05-29T06:03:06.244 [INFO] Downloading: https://repo.maven.apache.org/maven2/org/apache/commons/commons-parent/41/commons-parent-41.pom
2017-05-29T06:03:06.275 [INFO] Downloaded: https://repo.maven.apache.org/maven2/org/apache/commons/commons-parent/41/commons-parent-41.pom
(64 KB at 2042.5 KB/sec)
2017-05-29T06:03:06.281 [INFO] Downloading: https://repo.maven.apache.org/maven2/joda-time/joda-time/2.4/joda-time-2.4.pom
2017-05-29T06:03:06.310 [INFO] Downloaded: https://repo.maven.apache.org/maven2/joda-time/joda-time/2.4/joda-time-2.4.pom
(26 KB at 887.6 KB/sec)
2017-05-29T06:03:06.314 [INFO] Downloading: https://repo.maven.apache.org/maven2/com/google/auto/service/auto-service/1.0-rc2/auto-service-1.0-rc2.pom
2017-05-29T06:03:06.340 [INFO] Downloaded: https://repo.maven.apache.org/maven2/com/google/auto/service/auto-service/1.0-rc2/auto-service-1.0-rc2.pom
(3 KB at 103.2 KB/sec)
2017-05-29T06:03:06.341 [INFO] Downloading: https://repo.maven.apache.org/maven2/com/google/auto/auto-parent/2/auto-parent-2.pom
2017-05-29T06:03:06.367 [INFO] Downloaded: https://repo.maven.apache.org/maven2/com/google/auto/auto-parent/2/auto-parent-2.pom
(5 KB at 170.3 KB/sec)
2017-05-29T06:03:06.369 [INFO] Downloading: https://repo.maven.apache.org/maven2/com/google/auto/auto-common/0.3/auto-common-0.3.pom
2017-05-29T06:03:06.397 [INFO] Downloaded: https://repo.maven.apache.org/maven2/com/google/auto/auto-common/0.3/auto-common-0.3.pom
(3 KB at 82.0 KB/sec)
2017-05-29T06:03:06.399 [INFO] Downloading: https://repo.maven.apache.org/maven2/com/google/auto/value/auto-value/1.4.1/auto-value-1.4.1.pom
2017-05-29T06:03:06.426 [INFO] Downloaded: https://repo.maven.apache.org/maven2/com/google/auto/value/auto-value/1.4.1/auto-value-1.4.1.pom
(7 KB at 230.6 KB/sec)
2017-05-29T06:03:06.428 [INFO] Downloading: https://repo.maven.apache.org/maven2/com/google/auto/auto-parent/3/auto-parent-3.pom
2017-05-29T06:03:06.454 [INFO] Downloaded: https://repo.maven.apache.org/maven2/com/google/auto/auto-parent/3/auto-parent-3.pom
(4 KB at 144.2 KB/sec)
2017-05-29T06:03:06.457 [INFO] Downloading: https://repo.maven.apache.org/maven2/com/fasterxml/jackson/dataformat/jackson-dataformat-yaml/2.8.8/jackson-dataformat-yaml-2.8.8.pom
2017-05-29T06:03:06.484 [INFO] Downloaded: https://repo.maven.apache.org/maven2/com/fasterxml/jackson/dataformat/jackson-dataformat-yaml/2.8.8/jackson-dataformat-yaml-2.8.8.pom
(7 KB at 222.9 KB/sec)
2017-05-29T06:03:06.488 [INFO] Downloading: https://repo.maven.apache.org/maven2/org/yaml/snakeyaml/1.17/snakeyaml-1.17.pom
2017-05-29T06:03:06.516 [INFO] Downloaded: https://repo.maven.apache.org/maven2/org/yaml/snakeyaml/1.17/snakeyaml-1.17.pom
(28 KB at 976.7 KB/sec)
2017-05-29T06:03:06.519 [INFO] Downloading: https://repo.maven.apache.org/maven2/org/hamcrest/hamcrest-all/1.3/hamcrest-all-1.3.pom
2017-05-29T06:03:06.544 [INFO] Downloaded: https://repo.maven.apache.org/maven2/org/hamcrest/hamcrest-all/1.3/hamcrest-all-1.3.pom
(650 B at 25.4 KB/sec)
2017-05-29T06:03:06.545 [INFO] Downloading: https://repo.maven.apache.org/maven2/org/slf4j/slf4j-jdk14/1.7.14/slf4j-jdk14-1.7.14.pom
2017-05-29T06:03:06.571 [INFO] Downloaded: https://repo.maven.apache.org/maven2/org/slf4j/slf4j-jdk14/1.7.14/slf4j-jdk14-1.7.14.pom
(1008 B at 37.9 KB/sec)
2017-05-29T06:03:06.574 [INFO] Downloading: https://repo.maven.apache.org/maven2/org/mockito/mockito-all/1.9.5/mockito-all-1.9.5.pom
2017-05-29T06:03:06.600 [INFO] Downloaded: https://repo.maven.apache.org/maven2/org/mockito/mockito-all/1.9.5/mockito-all-1.9.5.pom
(2 KB at 39.1 KB/sec)
2017-05-29T06:03:06.601 [INFO] Downloading: https://repo.maven.apache.org/maven2/com/esotericsoftware/kryo/kryo/2.21/kryo-2.21.pom
2017-05-29T06:03:06.628 [INFO] Downloaded: https://repo.maven.apache.org/maven2/com/esotericsoftware/kryo/kryo/2.21/kryo-2.21.pom
(6 KB at 204.5 KB/sec)
2017-05-29T06:03:06.631 [INFO] Downloading: https://repo.maven.apache.org/maven2/com/esotericsoftware/reflectasm/reflectasm/1.07/reflectasm-1.07.pom
2017-05-29T06:03:06.656 [INFO] Downloaded: https://repo.maven.apache.org/maven2/com/esotericsoftware/reflectasm/reflectasm/1.07/reflectasm-1.07.pom
(4 KB at 120.3 KB/sec)
2017-05-29T06:03:06.658 [INFO] Downloading: https://repo.maven.apache.org/maven2/org/ow2/asm/asm/4.0/asm-4.0.pom
2017-05-29T06:03:06.683 [INFO] Downloaded: https://repo.maven.apache.org/maven2/org/ow2/asm/asm/4.0/asm-4.0.pom
(2 KB at 75.5 KB/sec)
2017-05-29T06:03:06.685 [INFO] Downloading: https://repo.maven.apache.org/maven2/org/ow2/asm/asm-parent/4.0/asm-parent-4.0.pom
2017-05-29T06:03:06.711 [INFO] Downloaded: https://repo.maven.apache.org/maven2/org/ow2/asm/asm-parent/4.0/asm-parent-4.0.pom
(6 KB at 206.3 KB/sec)
2017-05-29T06:03:06.713 [INFO] Downloading: https://repo.maven.apache.org/maven2/com/esotericsoftware/minlog/minlog/1.2/minlog-1.2.pom
2017-05-29T06:03:06.738 [INFO] Downloaded: https://repo.maven.apache.org/maven2/com/esotericsoftware/minlog/minlog/1.2/minlog-1.2.pom
(2 KB at 59.6 KB/sec)
2017-05-29T06:03:06.740 [INFO] Downloading: https://repo.maven.apache.org/maven2/org/objenesis/objenesis/1.2/objenesis-1.2.pom
2017-05-29T06:03:06.766 [INFO] Downloaded: https://repo.maven.apache.org/maven2/org/objenesis/objenesis/1.2/objenesis-1.2.pom
(3 KB at 113.0 KB/sec)
2017-05-29T06:03:06.767 [INFO] Downloading: https://repo.maven.apache.org/maven2/org/objenesis/objenesis-parent/1.2/objenesis-parent-1.2.pom
2017-05-29T06:03:06.793 [INFO] Downloaded: https://repo.maven.apache.org/maven2/org/objenesis/objenesis-parent/1.2/objenesis-parent-1.2.pom
(11 KB at 388.8 KB/sec)
2017-05-29T06:03:06.799 [INFO] Downloading: https://repo.maven.apache.org/maven2/com/google/guava/guava-testlib/20.0/guava-testlib-20.0.jar
2017-05-29T06:03:06.799 [INFO] Downloading: https://repo.maven.apache.org/maven2/com/fasterxml/jackson/core/jackson-core/2.8.8/jackson-core-2.8.8.jar
2017-05-29T06:03:06.800 [INFO] Downloading: https://repo.maven.apache.org/maven2/com/fasterxml/jackson/core/jackson-annotations/2.8.8/jackson-annotations-2.8.8.jar
2017-05-29T06:03:06.801 [INFO] Downloading: https://repo.maven.apache.org/maven2/com/fasterxml/jackson/core/jackson-databind/2.8.8/jackson-databind-2.8.8.jar
2017-05-29T06:03:06.801 [INFO] Downloading: https://repo.maven.apache.org/maven2/org/slf4j/slf4j-api/1.7.14/slf4j-api-1.7.14.jar
2017-05-29T06:03:06.835 [INFO] Downloaded: https://repo.maven.apache.org/maven2/org/slf4j/slf4j-api/1.7.14/slf4j-api-1.7.14.jar
(33 KB at 993.2 KB/sec)
2017-05-29T06:03:06.836 [INFO] Downloading: https://repo.maven.apache.org/maven2/net/bytebuddy/byte-buddy/1.6.8/byte-buddy-1.6.8.jar
2017-05-29T06:03:06.835 [INFO] Downloaded: https://repo.maven.apache.org/maven2/com/fasterxml/jackson/core/jackson-annotations/2.8.8/jackson-annotations-2.8.8.jar
(55 KB at 1509.6 KB/sec)
2017-05-29T06:03:06.836 [INFO] Downloading: https://repo.maven.apache.org/maven2/org/apache/avro/avro/1.8.1/avro-1.8.1.jar
2017-05-29T06:03:06.853 [INFO] Downloaded: https://repo.maven.apache.org/maven2/com/fasterxml/jackson/core/jackson-core/2.8.8/jackson-core-2.8.8.jar
(276 KB at 5107.7 KB/sec)
2017-05-29T06:03:06.853 [INFO] Downloading: https://repo.maven.apache.org/maven2/org/codehaus/jackson/jackson-core-asl/1.9.13/jackson-core-asl-1.9.13.jar
2017-05-29T06:03:06.929 [INFO] Downloaded: https://repo.maven.apache.org/maven2/com/google/guava/guava-testlib/20.0/guava-testlib-20.0.jar
(749 KB at 5712.0 KB/sec)
2017-05-29T06:03:06.930 [INFO] Downloading: https://repo.maven.apache.org/maven2/org/codehaus/jackson/jackson-mapper-asl/1.9.13/jackson-mapper-asl-1.9.13.jar
2017-05-29T06:03:06.930 [INFO] Downloaded: https://repo.maven.apache.org/maven2/org/codehaus/jackson/jackson-core-asl/1.9.13/jackson-core-asl-1.9.13.jar
(227 KB at 1758.2 KB/sec)
2017-05-29T06:03:06.931 [INFO] Downloading: https://repo.maven.apache.org/maven2/com/thoughtworks/paranamer/paranamer/2.7/paranamer-2.7.jar
2017-05-29T06:03:06.968 [INFO] Downloaded: https://repo.maven.apache.org/maven2/com/thoughtworks/paranamer/paranamer/2.7/paranamer-2.7.jar
(34 KB at 202.4 KB/sec)
2017-05-29T06:03:06.969 [INFO] Downloading: https://repo.maven.apache.org/maven2/org/xerial/snappy/snappy-java/1.1.4-M3/snappy-java-1.1.4-M3.jar
2017-05-29T06:03:06.970 [INFO] Downloaded: https://repo.maven.apache.org/maven2/com/fasterxml/jackson/core/jackson-databind/2.8.8/jackson-databind-2.8.8.jar
(1210 KB at 7115.1 KB/sec)
2017-05-29T06:03:06.970 [INFO] Downloading: https://repo.maven.apache.org/maven2/org/apache/commons/commons-lang3/3.5/commons-lang3-3.5.jar
[INFO] I/O exception (java.net.SocketException) caught when processing request to {s}->https://repo.maven.apache.org:443:
Connection reset
[INFO] Retrying request to {s}->https://repo.maven.apache.org:443
[INFO] I/O exception (java.net.SocketException) caught when processing request to {s}->https://repo.maven.apache.org:443:
Connection reset
2017-05-29T06:03:07.073 [INFO] Downloaded: https://repo.maven.apache.org/maven2/org/apache/commons/commons-lang3/3.5/commons-lang3-3.5.jar
(469 KB at 1722.9 KB/sec)
2017-05-29T06:03:07.073 [INFO] Downloading: https://repo.maven.apache.org/maven2/joda-time/joda-time/2.4/joda-time-2.4.jar
[INFO] Retrying request to {s}->https://repo.maven.apache.org:443
2017-05-29T06:03:07.082 [INFO] Downloading: https://repo.maven.apache.org/maven2/com/google/auto/service/auto-service/1.0-rc2/auto-service-1.0-rc2.jar
2017-05-29T06:03:07.136 [INFO] Downloaded: https://repo.maven.apache.org/maven2/org/apache/avro/avro/1.8.1/avro-1.8.1.jar
(1314 KB at 3920.4 KB/sec)
2017-05-29T06:03:07.136 [INFO] Downloading: https://repo.maven.apache.org/maven2/com/google/auto/auto-common/0.3/auto-common-0.3.jar
2017-05-29T06:03:07.155 [INFO] Downloaded: https://repo.maven.apache.org/maven2/org/codehaus/jackson/jackson-mapper-asl/1.9.13/jackson-mapper-asl-1.9.13.jar
(763 KB at 2153.6 KB/sec)
2017-05-29T06:03:07.155 [INFO] Downloading: https://repo.maven.apache.org/maven2/com/google/auto/value/auto-value/1.4.1/auto-value-1.4.1.jar
2017-05-29T06:03:07.165 [INFO] Downloaded: https://repo.maven.apache.org/maven2/com/google/auto/service/auto-service/1.0-rc2/auto-service-1.0-rc2.jar
(11 KB at 27.8 KB/sec)
2017-05-29T06:03:07.165 [INFO] Downloading: https://repo.maven.apache.org/maven2/com/fasterxml/jackson/dataformat/jackson-dataformat-yaml/2.8.8/jackson-dataformat-yaml-2.8.8.jar
2017-05-29T06:03:07.170 [INFO] Downloaded: https://repo.maven.apache.org/maven2/joda-time/joda-time/2.4/joda-time-2.4.jar
(573 KB at 1551.4 KB/sec)
2017-05-29T06:03:07.170 [INFO] Downloading: https://repo.maven.apache.org/maven2/org/yaml/snakeyaml/1.17/snakeyaml-1.17.jar
2017-05-29T06:03:07.177 [INFO] Downloaded: https://repo.maven.apache.org/maven2/com/google/auto/auto-common/0.3/auto-common-0.3.jar
(39 KB at 101.3 KB/sec)
2017-05-29T06:03:07.177 [INFO] Downloading: https://repo.maven.apache.org/maven2/org/hamcrest/hamcrest-all/1.3/hamcrest-all-1.3.jar
2017-05-29T06:03:07.193 [INFO] Downloading: https://repo.maven.apache.org/maven2/org/slf4j/slf4j-jdk14/1.7.14/slf4j-jdk14-1.7.14.jar
2017-05-29T06:03:07.205 [INFO] Downloaded: https://repo.maven.apache.org/maven2/com/fasterxml/jackson/dataformat/jackson-dataformat-yaml/2.8.8/jackson-dataformat-yaml-2.8.8.jar
(40 KB at 98.8 KB/sec)
2017-05-29T06:03:07.205 [INFO] Downloading: https://repo.maven.apache.org/maven2/org/mockito/mockito-all/1.9.5/mockito-all-1.9.5.jar
2017-05-29T06:03:07.217 [INFO] Downloaded: https://repo.maven.apache.org/maven2/org/yaml/snakeyaml/1.17/snakeyaml-1.17.jar
(268 KB at 642.3 KB/sec)
2017-05-29T06:03:07.217 [INFO] Downloading: https://repo.maven.apache.org/maven2/com/esotericsoftware/kryo/kryo/2.21/kryo-2.21.jar
2017-05-29T06:03:07.243 [INFO] Downloaded: https://repo.maven.apache.org/maven2/org/slf4j/slf4j-jdk14/1.7.14/slf4j-jdk14-1.7.14.jar
(8 KB at 17.3 KB/sec)
2017-05-29T06:03:07.243 [INFO] Downloading: https://repo.maven.apache.org/maven2/com/esotericsoftware/reflectasm/reflectasm/1.07/reflectasm-1.07-shaded.jar
2017-05-29T06:03:07.260 [INFO] Downloaded: https://repo.maven.apache.org/maven2/org/hamcrest/hamcrest-all/1.3/hamcrest-all-1.3.jar
(300 KB at 652.3 KB/sec)
2017-05-29T06:03:07.260 [INFO] Downloading: https://repo.maven.apache.org/maven2/org/ow2/asm/asm/4.0/asm-4.0.jar
2017-05-29T06:03:07.290 [INFO] Downloaded: https://repo.maven.apache.org/maven2/com/esotericsoftware/kryo/kryo/2.21/kryo-2.21.jar
(355 KB at 725.9 KB/sec)
2017-05-29T06:03:07.291 [INFO] Downloading: https://repo.maven.apache.org/maven2/com/esotericsoftware/minlog/minlog/1.2/minlog-1.2.jar
2017-05-29T06:03:07.293 [INFO] Downloaded: https://repo.maven.apache.org/maven2/com/esotericsoftware/reflectasm/reflectasm/1.07/reflectasm-1.07-shaded.jar
(65 KB at 130.2 KB/sec)
2017-05-29T06:03:07.293 [INFO] Downloading: https://repo.maven.apache.org/maven2/org/objenesis/objenesis/1.2/objenesis-1.2.jar
2017-05-29T06:03:07.294 [INFO] Downloaded: https://repo.maven.apache.org/maven2/org/ow2/asm/asm/4.0/asm-4.0.jar
(45 KB at 91.2 KB/sec)
2017-05-29T06:03:07.316 [INFO] Downloaded: https://repo.maven.apache.org/maven2/com/esotericsoftware/minlog/minlog/1.2/minlog-1.2.jar
(5 KB at 9.4 KB/sec)
2017-05-29T06:03:07.324 [INFO] Downloaded: https://repo.maven.apache.org/maven2/org/objenesis/objenesis/1.2/objenesis-1.2.jar
(36 KB at 67.3 KB/sec)
2017-05-29T06:03:07.363 [INFO] Downloaded: https://repo.maven.apache.org/maven2/com/google/auto/value/auto-value/1.4.1/auto-value-1.4.1.jar
(1470 KB at 2614.7 KB/sec)
2017-05-29T06:03:07.457 [INFO] Downloaded: https://repo.maven.apache.org/maven2/org/mockito/mockito-all/1.9.5/mockito-all-1.9.5.jar
(1545 KB at 2353.7 KB/sec)
[JENKINS] Archiving disabled
[JENKINS] Archiving disabled
[JENKINS] Archiving disabled
[JENKINS] Archiving disabled
[JENKINS] Archiving disabled
[JENKINS] Archiving disabled
[JENKINS] Archiving disabled
[JENKINS] Archiving disabled
[JENKINS] Archiving disabled
[JENKINS] Archiving disabled
[JENKINS] Archiving disabled
[JENKINS] Archiving disabled
[JENKINS] Archiving disabled2017-05-29T06:03:12.390 [INFO] ------------------------------------------------------------------------
2017-05-29T06:03:12.390 [INFO] Reactor Summary:
2017-05-29T06:03:12.390 [INFO] 
2017-05-29T06:03:12.390 [INFO] Apache Beam :: Parent .............................. SUCCESS
[ 20.717 s]
2017-05-29T06:03:12.390 [INFO] Apache Beam :: SDKs :: Java :: Build Tools ......... SUCCESS
[  9.766 s]
2017-05-29T06:03:12.390 [INFO] Apache Beam :: SDKs ................................ SUCCESS
[  2.008 s]
2017-05-29T06:03:12.390 [INFO] Apache Beam :: SDKs :: Common ...................... SUCCESS
[  1.245 s]

2017-05-29T06:03:12.390 [INFO] Apache Beam :: SDKs :: Common :: Fn API ............ SUCCESS
[ 12.881 s]
2017-05-29T06:03:12.390 [INFO] Apache Beam :: SDKs :: Common :: Runner API ........ SUCCESS
[  4.518 s]
2017-05-29T06:03:12.390 [INFO] Apache Beam :: SDKs :: Java ........................ SUCCESS
[  1.501 s]
2017-05-29T06:03:12.390 [INFO] Apache Beam :: SDKs :: Java :: Core ................ FAILURE
[  2.089 s]
2017-05-29T06:03:12.390 [INFO] Apache Beam :: Runners ............................. SKIPPED
2017-05-29T06:03:12.390 [INFO] Apache Beam :: Runners :: Core Construction Java ... SKIPPED
2017-05-29T06:03:12.390 [INFO] Apache Beam :: Runners :: Core Java ................ SKIPPED
2017-05-29T06:03:12.390 [INFO] Apache Beam :: Runners :: Apex ..................... SKIPPED
2017-05-29T06:03:12.390 [INFO] ------------------------------------------------------------------------
2017-05-29T06:03:12.390 [INFO] BUILD FAILURE
2017-05-29T06:03:12.390 [INFO] ------------------------------------------------------------------------
2017-05-29T06:03:12.391 [INFO] Total time: 01:33 min
2017-05-29T06:03:12.391 [INFO] Finished at: 2017-05-29T06:03:12+00:00
2017-05-29T06:03:12.796 [INFO] Final Memory: 86M/1384M
2017-05-29T06:03:12.796 [INFO] ------------------------------------------------------------------------
2017-05-29T06:03:12.796 [WARNING] The requested profile "validates-runner-tests" could not
be activated because it does not exist.
Waiting for Jenkins to finish collecting data
2017-05-29T06:03:15.897 [ERROR] Failed to execute goal on project beam-sdks-java-core: Could
not resolve dependencies for project org.apache.beam:beam-sdks-java-core:jar:2.1.0-SNAPSHOT:
The following artifacts could not be resolved: net.bytebuddy:byte-buddy:jar:1.6.8, org.xerial.snappy:snappy-java:jar:1.1.4-M3:
Could not transfer artifact net.bytebuddy:byte-buddy:jar:1.6.8 from/to central (https://repo.maven.apache.org/maven2):
GET request of: net/bytebuddy/byte-buddy/1.6.8/byte-buddy-1.6.8.jar from central failed: Connection
reset -> [Help 1]
2017-05-29T06:03:15.897 [ERROR] 
2017-05-29T06:03:15.897 [ERROR] To see the full stack trace of the errors, re-run Maven with
the -e switch.
2017-05-29T06:03:15.897 [ERROR] Re-run Maven using the -X switch to enable full debug logging.
2017-05-29T06:03:15.898 [ERROR] 
2017-05-29T06:03:15.898 [ERROR] For more information about the errors and possible solutions,
please read the following articles:
2017-05-29T06:03:15.898 [ERROR] [Help 1] http://cwiki.apache.org/confluence/display/MAVEN/DependencyResolutionException
2017-05-29T06:03:15.898 [ERROR] 
2017-05-29T06:03:15.898 [ERROR] After correcting the problems, you can resume the build with
the command
2017-05-29T06:03:15.898 [ERROR]   mvn <goals> -rf :beam-sdks-java-core
channel stopped

Mime
View raw message