beam-commits mailing list archives

Site index · List index
Message view « Date » · « Thread »
Top « Date » · « Thread »
From Apache Jenkins Server <jenk...@builds.apache.org>
Subject Build failed in Jenkins: beam_PostCommit_Java_MavenInstall #3697
Date Mon, 08 May 2017 00:08:18 GMT
See <https://builds.apache.org/job/beam_PostCommit_Java_MavenInstall/3697/display/redirect>

------------------------------------------
[...truncated 460.30 KB...]
2017-05-08T00:07:04.374 [INFO] Running org.apache.beam.sdk.util.common.ReflectHelpersTest
2017-05-08T00:07:04.376 [INFO] Tests run: 12, Failures: 0, Errors: 0, Skipped: 0, Time elapsed:
0 s - in org.apache.beam.sdk.util.common.ReflectHelpersTest
2017-05-08T00:07:04.376 [INFO] Running org.apache.beam.sdk.util.ExposedByteArrayInputStreamTest
2017-05-08T00:07:04.378 [INFO] Tests run: 4, Failures: 0, Errors: 0, Skipped: 0, Time elapsed:
0.001 s - in org.apache.beam.sdk.util.ExposedByteArrayInputStreamTest
2017-05-08T00:07:04.378 [INFO] Running org.apache.beam.sdk.util.BufferedElementCountingOutputStreamTest
2017-05-08T00:07:04.541 [INFO] Tests run: 14, Failures: 0, Errors: 0, Skipped: 0, Time elapsed:
0.161 s - in org.apache.beam.sdk.util.BufferedElementCountingOutputStreamTest
2017-05-08T00:07:04.541 [INFO] Running org.apache.beam.sdk.util.FluentBackoffTest
2017-05-08T00:07:04.555 [INFO] Tests run: 11, Failures: 0, Errors: 0, Skipped: 0, Time elapsed:
0.012 s - in org.apache.beam.sdk.util.FluentBackoffTest
2017-05-08T00:07:04.556 [INFO] Running org.apache.beam.sdk.util.CoderUtilsTest
2017-05-08T00:07:04.564 [INFO] Tests run: 7, Failures: 0, Errors: 0, Skipped: 0, Time elapsed:
0.006 s - in org.apache.beam.sdk.util.CoderUtilsTest
2017-05-08T00:07:04.565 [INFO] Running org.apache.beam.sdk.util.InstanceBuilderTest
2017-05-08T00:07:04.569 [INFO] Tests run: 6, Failures: 0, Errors: 0, Skipped: 0, Time elapsed:
0.002 s - in org.apache.beam.sdk.util.InstanceBuilderTest
2017-05-08T00:07:04.569 [INFO] Running org.apache.beam.sdk.util.SerializableUtilsTest
2017-05-08T00:07:04.581 [INFO] Tests run: 4, Failures: 0, Errors: 0, Skipped: 0, Time elapsed:
0.01 s - in org.apache.beam.sdk.util.SerializableUtilsTest
2017-05-08T00:07:04.581 [INFO] Running org.apache.beam.sdk.util.UploadIdResponseInterceptorTest
2017-05-08T00:07:04.646 [INFO] Tests run: 2, Failures: 0, Errors: 0, Skipped: 0, Time elapsed:
0.063 s - in org.apache.beam.sdk.util.UploadIdResponseInterceptorTest
2017-05-08T00:07:04.646 [INFO] Running org.apache.beam.sdk.util.NumberedShardedFileTest
2017-05-08T00:07:04.719 [INFO] Tests run: 9, Failures: 0, Errors: 0, Skipped: 0, Time elapsed:
0.071 s - in org.apache.beam.sdk.util.NumberedShardedFileTest
2017-05-08T00:07:04.719 [INFO] Running org.apache.beam.sdk.util.UnownedOutputStreamTest
2017-05-08T00:07:04.722 [INFO] Tests run: 2, Failures: 0, Errors: 0, Skipped: 0, Time elapsed:
0.001 s - in org.apache.beam.sdk.util.UnownedOutputStreamTest
2017-05-08T00:07:04.722 [INFO] Running org.apache.beam.sdk.util.CombineFnUtilTest
2017-05-08T00:07:04.735 [INFO] Tests run: 3, Failures: 0, Errors: 0, Skipped: 0, Time elapsed:
0.011 s - in org.apache.beam.sdk.util.CombineFnUtilTest
2017-05-08T00:07:04.735 [INFO] Running org.apache.beam.sdk.util.BucketingFunctionTest
2017-05-08T00:07:04.739 [INFO] Tests run: 4, Failures: 0, Errors: 0, Skipped: 0, Time elapsed:
0.002 s - in org.apache.beam.sdk.util.BucketingFunctionTest
2017-05-08T00:07:04.739 [INFO] Running org.apache.beam.sdk.util.NameUtilsTest
2017-05-08T00:07:04.745 [INFO] Tests run: 11, Failures: 0, Errors: 0, Skipped: 0, Time elapsed:
0.005 s - in org.apache.beam.sdk.util.NameUtilsTest
2017-05-08T00:07:04.746 [INFO] Running org.apache.beam.sdk.util.UserCodeExceptionTest
2017-05-08T00:07:04.749 [INFO] Tests run: 8, Failures: 0, Errors: 0, Skipped: 0, Time elapsed:
0.001 s - in org.apache.beam.sdk.util.UserCodeExceptionTest
2017-05-08T00:07:04.750 [INFO] Running org.apache.beam.sdk.util.MovingFunctionTest
2017-05-08T00:07:04.756 [INFO] Tests run: 5, Failures: 0, Errors: 0, Skipped: 0, Time elapsed:
0.005 s - in org.apache.beam.sdk.util.MovingFunctionTest
2017-05-08T00:07:05.265 [INFO] 
2017-05-08T00:07:05.265 [INFO] Results:
2017-05-08T00:07:05.265 [INFO] 
2017-05-08T00:07:05.265 [WARNING] Tests run: 2324, Failures: 0, Errors: 0, Skipped: 1
2017-05-08T00:07:05.265 [INFO] 
[JENKINS] Recording test results
2017-05-08T00:07:42.512 [INFO] 
2017-05-08T00:07:42.512 [INFO] --- jacoco-maven-plugin:0.7.8:report (report) @ beam-sdks-java-core
---
2017-05-08T00:07:42.574 [INFO] Loading execution data file <https://builds.apache.org/job/beam_PostCommit_Java_MavenInstall/ws/sdks/java/core/target/jacoco.exec>
2017-05-08T00:07:42.873 [INFO] Analyzed bundle 'Apache Beam :: SDKs :: Java :: Core' with
1062 classes
[WARNING] Cannot calculate digest of mojo class, because mojo wasn't loaded from a jar, but
from: <https://builds.apache.org/job/beam_PostCommit_Java_MavenInstall/ws/.repository/org/jacoco/jacoco-maven-plugin/0.7.8/jacoco-maven-plugin-0.7.8.jar>
2017-05-08T00:07:44.054 [INFO] 
2017-05-08T00:07:44.054 [INFO] --- build-helper-maven-plugin:3.0.0:regex-properties (render-artifact-id)
@ beam-sdks-java-core ---
[WARNING] Cannot calculate digest of mojo class, because mojo wasn't loaded from a jar, but
from: <https://builds.apache.org/job/beam_PostCommit_Java_MavenInstall/ws/.repository/org/codehaus/mojo/build-helper-maven-plugin/3.0.0/build-helper-maven-plugin-3.0.0.jar>
2017-05-08T00:07:44.178 [INFO] 
2017-05-08T00:07:44.178 [INFO] --- maven-jar-plugin:3.0.2:jar (default-jar) @ beam-sdks-java-core
---
2017-05-08T00:07:44.290 [INFO] Building jar: <https://builds.apache.org/job/beam_PostCommit_Java_MavenInstall/ws/sdks/java/core/target/beam-sdks-java-core-2.1.0-SNAPSHOT.jar>
[WARNING] Cannot calculate digest of mojo class, because mojo wasn't loaded from a jar, but
from: <https://builds.apache.org/job/beam_PostCommit_Java_MavenInstall/ws/.repository/org/apache/maven/plugins/maven-jar-plugin/3.0.2/maven-jar-plugin-3.0.2.jar>
2017-05-08T00:07:44.681 [INFO] 
2017-05-08T00:07:44.681 [INFO] --- maven-site-plugin:3.5.1:attach-descriptor (attach-descriptor)
@ beam-sdks-java-core ---
[WARNING] Cannot calculate digest of mojo class, because mojo wasn't loaded from a jar, but
from: <https://builds.apache.org/job/beam_PostCommit_Java_MavenInstall/ws/.repository/org/apache/maven/plugins/maven-site-plugin/3.5.1/maven-site-plugin-3.5.1.jar>
2017-05-08T00:07:44.763 [INFO] 
2017-05-08T00:07:44.763 [INFO] --- maven-shade-plugin:3.0.0:shade (bundle-and-repackage) @
beam-sdks-java-core ---
2017-05-08T00:07:44.767 [INFO] Excluding com.google.http-client:google-http-client:jar:1.22.0
from the shaded jar.
2017-05-08T00:07:44.767 [INFO] Excluding org.apache.httpcomponents:httpclient:jar:4.0.1 from
the shaded jar.
2017-05-08T00:07:44.767 [INFO] Excluding org.apache.httpcomponents:httpcore:jar:4.0.1 from
the shaded jar.
2017-05-08T00:07:44.767 [INFO] Excluding commons-logging:commons-logging:jar:1.1.1 from the
shaded jar.
2017-05-08T00:07:44.767 [INFO] Excluding commons-codec:commons-codec:jar:1.3 from the shaded
jar.
2017-05-08T00:07:44.767 [INFO] Including com.google.guava:guava:jar:20.0 in the shaded jar.
2017-05-08T00:07:44.767 [INFO] Excluding com.google.protobuf:protobuf-java:jar:3.2.0 from
the shaded jar.
2017-05-08T00:07:44.767 [INFO] Excluding com.google.code.findbugs:jsr305:jar:3.0.1 from the
shaded jar.
2017-05-08T00:07:44.767 [INFO] Excluding com.fasterxml.jackson.core:jackson-core:jar:2.8.8
from the shaded jar.
2017-05-08T00:07:44.767 [INFO] Excluding com.fasterxml.jackson.core:jackson-annotations:jar:2.8.8
from the shaded jar.
2017-05-08T00:07:44.767 [INFO] Excluding com.fasterxml.jackson.core:jackson-databind:jar:2.8.8
from the shaded jar.
2017-05-08T00:07:44.767 [INFO] Excluding org.slf4j:slf4j-api:jar:1.7.14 from the shaded jar.
2017-05-08T00:07:44.767 [INFO] Excluding net.bytebuddy:byte-buddy:jar:1.6.8 from the shaded
jar.
2017-05-08T00:07:44.767 [INFO] Excluding org.apache.avro:avro:jar:1.8.1 from the shaded jar.
2017-05-08T00:07:44.767 [INFO] Excluding org.codehaus.jackson:jackson-core-asl:jar:1.9.13
from the shaded jar.
2017-05-08T00:07:44.767 [INFO] Excluding org.codehaus.jackson:jackson-mapper-asl:jar:1.9.13
from the shaded jar.
2017-05-08T00:07:44.767 [INFO] Excluding com.thoughtworks.paranamer:paranamer:jar:2.7 from
the shaded jar.
2017-05-08T00:07:44.767 [INFO] Excluding org.xerial.snappy:snappy-java:jar:1.1.4-M3 from the
shaded jar.
2017-05-08T00:07:44.767 [INFO] Excluding org.apache.commons:commons-compress:jar:1.9 from
the shaded jar.
2017-05-08T00:07:44.767 [INFO] Excluding org.apache.commons:commons-lang3:jar:3.5 from the
shaded jar.
2017-05-08T00:07:44.767 [INFO] Excluding joda-time:joda-time:jar:2.4 from the shaded jar.
2017-05-08T00:07:44.767 [INFO] Excluding org.tukaani:xz:jar:1.5 from the shaded jar.
2017-05-08T00:07:44.767 [INFO] Excluding com.google.auto.service:auto-service:jar:1.0-rc2
from the shaded jar.
2017-05-08T00:07:44.768 [INFO] Excluding com.google.auto:auto-common:jar:0.3 from the shaded
jar.
[WARNING] Cannot calculate digest of mojo class, because mojo wasn't loaded from a jar, but
from: <https://builds.apache.org/job/beam_PostCommit_Java_MavenInstall/ws/.repository/org/apache/maven/plugins/maven-shade-plugin/3.0.0/maven-shade-plugin-3.0.0.jar>
[JENKINS] Archiving disabled
2017-05-08T00:07:46.434 [INFO]                                                           
             
2017-05-08T00:07:46.434 [INFO] ------------------------------------------------------------------------
2017-05-08T00:07:46.434 [INFO] Skipping Apache Beam :: Parent
2017-05-08T00:07:46.434 [INFO] This project has been banned from the build due to previous
failures.
2017-05-08T00:07:46.434 [INFO] ------------------------------------------------------------------------
[JENKINS] Archiving disabled
[JENKINS] Archiving disabled
[JENKINS] Archiving disabled
[JENKINS] Archiving disabled
[JENKINS] Archiving disabled
[JENKINS] Archiving disabled
[JENKINS] Archiving disabled
[JENKINS] Archiving disabled
[JENKINS] Archiving disabled
[JENKINS] Archiving disabled
[JENKINS] Archiving disabled
[JENKINS] Archiving disabled
[JENKINS] Archiving disabled
[JENKINS] Archiving disabled
[JENKINS] Archiving disabled
[JENKINS] Archiving disabled
[JENKINS] Archiving disabled
[JENKINS] Archiving disabled
[JENKINS] Archiving disabled
[JENKINS] Archiving disabled
[JENKINS] Archiving disabled
[JENKINS] Archiving disabled
[JENKINS] Archiving disabled
[JENKINS] Archiving disabled
[JENKINS] Archiving disabled
[JENKINS] Archiving disabled
[JENKINS] Archiving disabled
[JENKINS] Archiving disabled
[JENKINS] Archiving disabled
[JENKINS] Archiving disabled
[JENKINS] Archiving disabled
[JENKINS] Archiving disabled
[JENKINS] Archiving disabled
[JENKINS] Archiving disabled
[JENKINS] Archiving disabled
[JENKINS] Archiving disabled
[JENKINS] Archiving disabled
[JENKINS] Archiving disabled
[JENKINS] Archiving disabled
[JENKINS] Archiving disabled
[JENKINS] Archiving disabled
[JENKINS] Archiving disabled
[JENKINS] Archiving disabled
[JENKINS] Archiving disabled
[JENKINS] Archiving disabled
[JENKINS] Archiving disabled
2017-05-08T00:07:59.520 [INFO] ------------------------------------------------------------------------
2017-05-08T00:07:59.521 [INFO] Reactor Summary:
2017-05-08T00:07:59.521 [INFO] 
2017-05-08T00:07:59.521 [INFO] Apache Beam :: Parent .............................. SUCCESS
[ 47.790 s]
2017-05-08T00:07:59.521 [INFO] Apache Beam :: SDKs :: Java :: Build Tools ......... SUCCESS
[ 12.526 s]
2017-05-08T00:07:59.521 [INFO] Apache Beam :: SDKs ................................ SUCCESS
[  5.929 s]
2017-05-08T00:07:59.521 [INFO] Apache Beam :: SDKs :: Common ...................... SUCCESS
[  1.648 s]
2017-05-08T00:07:59.521 [INFO] Apache Beam :: SDKs :: Common :: Fn API ............ SUCCESS
[ 24.850 s]
2017-05-08T00:07:59.521 [INFO] Apache Beam :: SDKs :: Common :: Runner API ........ SUCCESS
[ 17.284 s]
2017-05-08T00:07:59.521 [INFO] Apache Beam :: SDKs :: Java ........................ SUCCESS
[  5.688 s]
2017-05-08T00:07:59.521 [INFO] Apache Beam :: SDKs :: Java :: Core ................ FAILURE
[02:46 min]
2017-05-08T00:07:59.521 [INFO] Apache Beam :: SDKs :: Java :: IO .................. SKIPPED
2017-05-08T00:07:59.521 [INFO] Apache Beam :: SDKs :: Java :: IO :: Common ........ SKIPPED
2017-05-08T00:07:59.521 [INFO] Apache Beam :: Runners ............................. SKIPPED
2017-05-08T00:07:59.522 [INFO] Apache Beam :: Runners :: Core Construction Java ... SKIPPED
2017-05-08T00:07:59.522 [INFO] Apache Beam :: Runners :: Core Java ................ SKIPPED
2017-05-08T00:07:59.522 [INFO] Apache Beam :: Runners :: Direct Java .............. SKIPPED
2017-05-08T00:07:59.522 [INFO] Apache Beam :: SDKs :: Java :: IO :: Elasticsearch . SKIPPED
2017-05-08T00:07:59.522 [INFO] Apache Beam :: SDKs :: Java :: Extensions .......... SKIPPED
2017-05-08T00:07:59.522 [INFO] Apache Beam :: SDKs :: Java :: Extensions :: Google Cloud Platform
Core SKIPPED
2017-05-08T00:07:59.522 [INFO] Apache Beam :: SDKs :: Java :: Extensions :: Protobuf SKIPPED
2017-05-08T00:07:59.522 [INFO] Apache Beam :: SDKs :: Java :: IO :: Google Cloud Platform
SKIPPED
2017-05-08T00:07:59.522 [INFO] Apache Beam :: SDKs :: Java :: IO :: Hadoop Common . SKIPPED
2017-05-08T00:07:59.522 [INFO] Apache Beam :: SDKs :: Java :: IO :: Hadoop File System SKIPPED
2017-05-08T00:07:59.522 [INFO] Apache Beam :: SDKs :: Java :: IO :: Hadoop ........ SKIPPED
2017-05-08T00:07:59.522 [INFO] Apache Beam :: SDKs :: Java :: IO :: Hadoop :: input-format
SKIPPED
2017-05-08T00:07:59.522 [INFO] Apache Beam :: Runners :: Google Cloud Dataflow .... SKIPPED
2017-05-08T00:07:59.522 [INFO] Apache Beam :: SDKs :: Java :: IO :: Hadoop :: jdk1.8-tests
SKIPPED
2017-05-08T00:07:59.522 [INFO] Apache Beam :: SDKs :: Java :: IO :: HBase ......... SKIPPED
2017-05-08T00:07:59.522 [INFO] Apache Beam :: SDKs :: Java :: IO :: JDBC .......... SKIPPED
2017-05-08T00:07:59.522 [INFO] Apache Beam :: SDKs :: Java :: IO :: JMS ........... SKIPPED
2017-05-08T00:07:59.522 [INFO] Apache Beam :: SDKs :: Java :: IO :: Kafka ......... SKIPPED
2017-05-08T00:07:59.522 [INFO] Apache Beam :: SDKs :: Java :: IO :: Kinesis ....... SKIPPED
2017-05-08T00:07:59.522 [INFO] Apache Beam :: SDKs :: Java :: IO :: MongoDB ....... SKIPPED
2017-05-08T00:07:59.522 [INFO] Apache Beam :: SDKs :: Java :: IO :: MQTT .......... SKIPPED
2017-05-08T00:07:59.522 [INFO] Apache Beam :: SDKs :: Java :: IO :: XML ........... SKIPPED
2017-05-08T00:07:59.522 [INFO] Apache Beam :: SDKs :: Java :: Maven Archetypes .... SKIPPED
2017-05-08T00:07:59.522 [INFO] Apache Beam :: SDKs :: Java :: Maven Archetypes :: Starter
SKIPPED
2017-05-08T00:07:59.522 [INFO] Apache Beam :: Examples ............................ SKIPPED
2017-05-08T00:07:59.522 [INFO] Apache Beam :: Examples :: Java .................... SKIPPED
2017-05-08T00:07:59.522 [INFO] Apache Beam :: SDKs :: Java :: Maven Archetypes :: Examples
SKIPPED
2017-05-08T00:07:59.522 [INFO] Apache Beam :: Runners :: Flink .................... SKIPPED
2017-05-08T00:07:59.522 [INFO] Apache Beam :: Runners :: Spark .................... SKIPPED
2017-05-08T00:07:59.522 [INFO] Apache Beam :: Examples :: Java 8 .................. SKIPPED
2017-05-08T00:07:59.522 [INFO] Apache Beam :: SDKs :: Java :: Maven Archetypes :: Examples
- Java 8 SKIPPED
2017-05-08T00:07:59.522 [INFO] Apache Beam :: SDKs :: Java :: Extensions :: Jackson SKIPPED
2017-05-08T00:07:59.522 [INFO] Apache Beam :: SDKs :: Java :: Extensions :: Join library SKIPPED
2017-05-08T00:07:59.522 [INFO] Apache Beam :: SDKs :: Java :: Extensions :: Sorter  SKIPPED
2017-05-08T00:07:59.522 [INFO] Apache Beam :: SDKs :: Java :: Harness ............. SKIPPED
2017-05-08T00:07:59.522 [INFO] Apache Beam :: SDKs :: Java :: Java 8 Tests ........ SKIPPED
2017-05-08T00:07:59.522 [INFO] Apache Beam :: SDKs :: Python ...................... SKIPPED
2017-05-08T00:07:59.523 [INFO] Apache Beam :: Runners :: Apex ..................... SKIPPED
2017-05-08T00:07:59.523 [INFO] Apache Beam :: SDKs :: Java :: Aggregated Javadoc .. SKIPPED
2017-05-08T00:07:59.523 [INFO] ------------------------------------------------------------------------
2017-05-08T00:07:59.523 [INFO] BUILD FAILURE
2017-05-08T00:07:59.523 [INFO] ------------------------------------------------------------------------
2017-05-08T00:07:59.523 [INFO] Total time: 05:13 min
2017-05-08T00:07:59.523 [INFO] Finished at: 2017-05-08T00:07:59+00:00
2017-05-08T00:08:00.055 [INFO] Final Memory: 124M/1410M
2017-05-08T00:08:00.056 [INFO] ------------------------------------------------------------------------
2017-05-08T00:08:00.060 [ERROR] Failed to execute goal org.apache.maven.plugins:maven-shade-plugin:3.0.0:shade
(bundle-and-repackage) on project beam-sdks-java-core: Error creating shaded jar: <https://builds.apache.org/job/beam_PostCommit_Java_MavenInstall/ws/.repository/com/google/guava/guava/20.0/guava-20.0.jar>
(No such file or directory) -> [Help 1]
org.apache.maven.lifecycle.LifecycleExecutionException: Failed to execute goal org.apache.maven.plugins:maven-shade-plugin:3.0.0:shade
(bundle-and-repackage) on project beam-sdks-java-core: Error creating shaded jar: <https://builds.apache.org/job/beam_PostCommit_Java_MavenInstall/ws/.repository/com/google/guava/guava/20.0/guava-20.0.jar>
(No such file or directory)
	at org.apache.maven.lifecycle.internal.MojoExecutor.execute(MojoExecutor.java:216)
	at org.apache.maven.lifecycle.internal.MojoExecutor.execute(MojoExecutor.java:153)
	at org.apache.maven.lifecycle.internal.MojoExecutor.execute(MojoExecutor.java:145)
	at org.apache.maven.lifecycle.internal.LifecycleModuleBuilder.buildProject(LifecycleModuleBuilder.java:116)
	at org.apache.maven.lifecycle.internal.LifecycleModuleBuilder.buildProject(LifecycleModuleBuilder.java:80)
	at org.apache.maven.lifecycle.internal.builder.singlethreaded.SingleThreadedBuilder.build(SingleThreadedBuilder.java:51)
	at org.apache.maven.lifecycle.internal.LifecycleStarter.execute(LifecycleStarter.java:128)
	at org.apache.maven.DefaultMaven.doExecute(DefaultMaven.java:307)
	at org.apache.maven.DefaultMaven.doExecute(DefaultMaven.java:193)
	at org.apache.maven.DefaultMaven.execute(DefaultMaven.java:106)
	at org.jvnet.hudson.maven3.launcher.Maven33Launcher.main(Maven33Launcher.java:129)
	at sun.reflect.NativeMethodAccessorImpl.invoke0(Native Method)
	at sun.reflect.NativeMethodAccessorImpl.invoke(NativeMethodAccessorImpl.java:62)
	at sun.reflect.DelegatingMethodAccessorImpl.invoke(DelegatingMethodAccessorImpl.java:43)
	at java.lang.reflect.Method.invoke(Method.java:498)
	at org.codehaus.plexus.classworlds.launcher.Launcher.launchStandard(Launcher.java:330)
	at org.codehaus.plexus.classworlds.launcher.Launcher.launch(Launcher.java:238)
	at jenkins.maven3.agent.Maven33Main.launch(Maven33Main.java:176)
	at sun.reflect.NativeMethodAccessorImpl.invoke0(Native Method)
	at sun.reflect.NativeMethodAccessorImpl.invoke(NativeMethodAccessorImpl.java:62)
	at sun.reflect.DelegatingMethodAccessorImpl.invoke(DelegatingMethodAccessorImpl.java:43)
	at java.lang.reflect.Method.invoke(Method.java:498)
	at hudson.maven.Maven3Builder.call(Maven3Builder.java:139)
	at hudson.maven.Maven3Builder.call(Maven3Builder.java:70)
	at hudson.remoting.UserRequest.perform(UserRequest.java:153)
	at hudson.remoting.UserRequest.perform(UserRequest.java:50)
	at hudson.remoting.Request$2.run(Request.java:336)
	at hudson.remoting.InterceptingExecutorService$1.call(InterceptingExecutorService.java:68)
	at java.util.concurrent.FutureTask.run(FutureTask.java:266)
	at java.util.concurrent.ThreadPoolExecutor.runWorker(ThreadPoolExecutor.java:1142)
	at java.util.concurrent.ThreadPoolExecutor$Worker.run(ThreadPoolExecutor.java:617)
	at java.lang.Thread.run(Thread.java:745)
Caused by: org.apache.maven.plugin.MojoExecutionException: Error creating shaded jar: <https://builds.apache.org/job/beam_PostCommit_Java_MavenInstall/ws/.repository/com/google/guava/guava/20.0/guava-20.0.jar>
(No such file or directory)
	at org.apache.maven.plugins.shade.mojo.ShadeMojo.execute(ShadeMojo.java:546)
	at org.apache.maven.plugin.DefaultBuildPluginManager.executeMojo(DefaultBuildPluginManager.java:134)
	at org.apache.maven.lifecycle.internal.MojoExecutor.execute(MojoExecutor.java:208)
	... 31 more
Caused by: java.io.FileNotFoundException: <https://builds.apache.org/job/beam_PostCommit_Java_MavenInstall/ws/.repository/com/google/guava/guava/20.0/guava-20.0.jar>
(No such file or directory)
	at java.util.zip.ZipFile.open(Native Method)
	at java.util.zip.ZipFile.<init>(ZipFile.java:219)
	at java.util.zip.ZipFile.<init>(ZipFile.java:149)
	at java.util.jar.JarFile.<init>(JarFile.java:166)
	at java.util.jar.JarFile.<init>(JarFile.java:130)
	at org.apache.maven.plugins.shade.DefaultShader.newJarFile(DefaultShader.java:354)
	at org.apache.maven.plugins.shade.DefaultShader.shadeJars(DefaultShader.java:160)
	at org.apache.maven.plugins.shade.DefaultShader.shade(DefaultShader.java:104)
	at org.apache.maven.plugins.shade.mojo.ShadeMojo.execute(ShadeMojo.java:442)
	... 33 more
2017-05-08T00:08:00.061 [ERROR] 
2017-05-08T00:08:00.061 [ERROR] Re-run Maven using the -X switch to enable full debug logging.
2017-05-08T00:08:00.061 [ERROR] 
2017-05-08T00:08:00.061 [ERROR] For more information about the errors and possible solutions,
please read the following articles:
2017-05-08T00:08:00.061 [ERROR] [Help 1] http://cwiki.apache.org/confluence/display/MAVEN/MojoExecutionException
2017-05-08T00:08:00.061 [ERROR] 
2017-05-08T00:08:00.061 [ERROR] After correcting the problems, you can resume the build with
the command
2017-05-08T00:08:00.061 [ERROR]   mvn <goals> -rf :beam-sdks-java-core
channel stopped

Mime
View raw message