beam-commits mailing list archives

Site index · List index
Message view « Date » · « Thread »
Top « Date » · « Thread »
From Apache Jenkins Server <jenk...@builds.apache.org>
Subject Build failed in Jenkins: beam_PostCommit_Java_JDK_Versions_Test » JDK 1.8 (latest),beam #2
Date Tue, 02 May 2017 23:47:18 GMT
See <https://builds.apache.org/job/beam_PostCommit_Java_JDK_Versions_Test/jdk=JDK%201.8%20(latest),label=beam/2/display/redirect>

------------------------------------------
[...truncated 1.20 MB...]
2017-05-02\T\23:47:14.277 [INFO] 2017-05-02\T\23:47:14.277 [INFO] Downloading: https://repo.maven.apache.org/maven2/org/apache/maven/maven-profile/2.0.9/maven-profile-2.0.9.pom
2017-05-02\T\23:47:14.307 [INFO] 2017-05-02\T\23:47:14.307 [INFO] Downloaded: https://repo.maven.apache.org/maven2/org/apache/maven/maven-profile/2.0.9/maven-profile-2.0.9.pom
(3 KB at 66.7 KB/sec)
2017-05-02\T\23:47:14.311 [INFO] 2017-05-02\T\23:47:14.310 [INFO] Downloading: https://repo.maven.apache.org/maven2/org/apache/maven/maven-artifact-manager/2.0.9/maven-artifact-manager-2.0.9.pom
2017-05-02\T\23:47:14.339 [INFO] 2017-05-02\T\23:47:14.339 [INFO] Downloaded: https://repo.maven.apache.org/maven2/org/apache/maven/maven-artifact-manager/2.0.9/maven-artifact-manager-2.0.9.pom
(3 KB at 94.2 KB/sec)
2017-05-02\T\23:47:14.343 [INFO] 2017-05-02\T\23:47:14.343 [INFO] Downloading: https://repo.maven.apache.org/maven2/org/apache/maven/maven-repository-metadata/2.0.9/maven-repository-metadata-2.0.9.pom
2017-05-02\T\23:47:14.372 [INFO] 2017-05-02\T\23:47:14.372 [INFO] Downloaded: https://repo.maven.apache.org/maven2/org/apache/maven/maven-repository-metadata/2.0.9/maven-repository-metadata-2.0.9.pom
(2 KB at 64.0 KB/sec)
2017-05-02\T\23:47:14.376 [INFO] 2017-05-02\T\23:47:14.376 [INFO] Downloading: https://repo.maven.apache.org/maven2/org/apache/maven/maven-plugin-registry/2.0.9/maven-plugin-registry-2.0.9.pom
2017-05-02\T\23:47:14.405 [INFO] 2017-05-02\T\23:47:14.404 [INFO] Downloaded: https://repo.maven.apache.org/maven2/org/apache/maven/maven-plugin-registry/2.0.9/maven-plugin-registry-2.0.9.pom
(2 KB at 68.7 KB/sec)
2017-05-02\T\23:47:14.410 [INFO] 2017-05-02\T\23:47:14.409 [INFO] Downloading: https://repo.maven.apache.org/maven2/org/apache/maven/maven-core/2.0.9/maven-core-2.0.9.pom
2017-05-02\T\23:47:14.441 [INFO] 2017-05-02\T\23:47:14.441 [INFO] Downloaded: https://repo.maven.apache.org/maven2/org/apache/maven/maven-core/2.0.9/maven-core-2.0.9.pom
(8 KB at 237.6 KB/sec)
2017-05-02\T\23:47:14.446 [INFO] 2017-05-02\T\23:47:14.446 [INFO] Downloading: https://repo.maven.apache.org/maven2/org/apache/maven/maven-plugin-parameter-documenter/2.0.9/maven-plugin-parameter-documenter-2.0.9.pom
2017-05-02\T\23:47:14.474 [INFO] 2017-05-02\T\23:47:14.474 [INFO] Downloaded: https://repo.maven.apache.org/maven2/org/apache/maven/maven-plugin-parameter-documenter/2.0.9/maven-plugin-parameter-documenter-2.0.9.pom
(2 KB at 68.5 KB/sec)
2017-05-02\T\23:47:14.479 [INFO] 2017-05-02\T\23:47:14.479 [INFO] Downloading: https://repo.maven.apache.org/maven2/org/apache/maven/reporting/maven-reporting-api/2.0.9/maven-reporting-api-2.0.9.pom
2017-05-02\T\23:47:14.509 [INFO] 2017-05-02\T\23:47:14.509 [INFO] Downloaded: https://repo.maven.apache.org/maven2/org/apache/maven/reporting/maven-reporting-api/2.0.9/maven-reporting-api-2.0.9.pom
(2 KB at 60.7 KB/sec)
2017-05-02\T\23:47:14.512 [INFO] 2017-05-02\T\23:47:14.511 [INFO] Downloading: https://repo.maven.apache.org/maven2/org/apache/maven/reporting/maven-reporting/2.0.9/maven-reporting-2.0.9.pom
2017-05-02\T\23:47:14.541 [INFO] 2017-05-02\T\23:47:14.540 [INFO] Downloaded: https://repo.maven.apache.org/maven2/org/apache/maven/reporting/maven-reporting/2.0.9/maven-reporting-2.0.9.pom
(2 KB at 49.7 KB/sec)
2017-05-02\T\23:47:14.546 [INFO] 2017-05-02\T\23:47:14.546 [INFO] Downloading: https://repo.maven.apache.org/maven2/org/apache/maven/maven-error-diagnostics/2.0.9/maven-error-diagnostics-2.0.9.pom
2017-05-02\T\23:47:14.576 [INFO] 2017-05-02\T\23:47:14.576 [INFO] Downloaded: https://repo.maven.apache.org/maven2/org/apache/maven/maven-error-diagnostics/2.0.9/maven-error-diagnostics-2.0.9.pom
(2 KB at 56.8 KB/sec)
2017-05-02\T\23:47:14.581 [INFO] 2017-05-02\T\23:47:14.581 [INFO] Downloading: https://repo.maven.apache.org/maven2/org/apache/maven/maven-plugin-descriptor/2.0.9/maven-plugin-descriptor-2.0.9.pom
2017-05-02\T\23:47:14.612 [INFO] 2017-05-02\T\23:47:14.612 [INFO] Downloaded: https://repo.maven.apache.org/maven2/org/apache/maven/maven-plugin-descriptor/2.0.9/maven-plugin-descriptor-2.0.9.pom
(3 KB at 65.4 KB/sec)
2017-05-02\T\23:47:14.617 [INFO] 2017-05-02\T\23:47:14.617 [INFO] Downloading: https://repo.maven.apache.org/maven2/org/apache/maven/maven-monitor/2.0.9/maven-monitor-2.0.9.pom
2017-05-02\T\23:47:14.645 [INFO] 2017-05-02\T\23:47:14.645 [INFO] Downloaded: https://repo.maven.apache.org/maven2/org/apache/maven/maven-monitor/2.0.9/maven-monitor-2.0.9.pom
(2 KB at 43.3 KB/sec)
2017-05-02\T\23:47:14.649 [INFO] 2017-05-02\T\23:47:14.649 [INFO] Downloading: https://repo.maven.apache.org/maven2/org/apache/maven/maven-toolchain/2.0.9/maven-toolchain-2.0.9.pom
2017-05-02\T\23:47:14.679 [INFO] 2017-05-02\T\23:47:14.679 [INFO] Downloaded: https://repo.maven.apache.org/maven2/org/apache/maven/maven-toolchain/2.0.9/maven-toolchain-2.0.9.pom
(4 KB at 113.2 KB/sec)
2017-05-02\T\23:47:14.692 [INFO] 2017-05-02\T\23:47:14.692 [INFO] Downloading: https://repo.maven.apache.org/maven2/org/apache/maven/shared/maven-common-artifact-filters/1.3/maven-common-artifact-filters-1.3.pom
2017-05-02\T\23:47:14.721 [INFO] 2017-05-02\T\23:47:14.721 [INFO] Downloaded: https://repo.maven.apache.org/maven2/org/apache/maven/shared/maven-common-artifact-filters/1.3/maven-common-artifact-filters-1.3.pom
(4 KB at 124.7 KB/sec)
2017-05-02\T\23:47:14.749 [INFO] 2017-05-02\T\23:47:14.748 [INFO] Downloading: https://repo.maven.apache.org/maven2/org/apache/maven/maven-plugin-api/2.0.9/maven-plugin-api-2.0.9.jar
2017-05-02\T\23:47:14.750 [INFO] 2017-05-02\T\23:47:14.750 [INFO] Downloading: https://repo.maven.apache.org/maven2/org/apache/maven/surefire/surefire-booter/2.12.4/surefire-booter-2.12.4.jar
2017-05-02\T\23:47:14.751 [INFO] 2017-05-02\T\23:47:14.751 [INFO] Downloading: https://repo.maven.apache.org/maven2/org/apache/maven/surefire/surefire-api/2.12.4/surefire-api-2.12.4.jar
2017-05-02\T\23:47:14.752 [INFO] 2017-05-02\T\23:47:14.751 [INFO] Downloading: https://repo.maven.apache.org/maven2/org/apache/maven/surefire/maven-surefire-common/2.12.4/maven-surefire-common-2.12.4.jar
2017-05-02\T\23:47:14.755 [INFO] 2017-05-02\T\23:47:14.755 [INFO] Downloading: https://repo.maven.apache.org/maven2/org/apache/maven/shared/maven-common-artifact-filters/1.3/maven-common-artifact-filters-1.3.jar
2017-05-02\T\23:47:14.781 [INFO] 2017-05-02\T\23:47:14.781 [INFO] Downloaded: https://repo.maven.apache.org/maven2/org/apache/maven/maven-plugin-api/2.0.9/maven-plugin-api-2.0.9.jar
(13 KB at 381.5 KB/sec)
2017-05-02\T\23:47:14.781 [INFO] 2017-05-02\T\23:47:14.781 [INFO] Downloading: https://repo.maven.apache.org/maven2/org/codehaus/plexus/plexus-utils/3.0.8/plexus-utils-3.0.8.jar
2017-05-02\T\23:47:14.790 [INFO] 2017-05-02\T\23:47:14.790 [INFO] Downloaded: https://repo.maven.apache.org/maven2/org/apache/maven/surefire/surefire-booter/2.12.4/surefire-booter-2.12.4.jar
(34 KB at 806.4 KB/sec)
2017-05-02\T\23:47:14.791 [INFO] 2017-05-02\T\23:47:14.790 [INFO] Downloading: https://repo.maven.apache.org/maven2/org/apache/maven/maven-artifact/2.0.9/maven-artifact-2.0.9.jar
2017-05-02\T\23:47:14.800 [INFO] 2017-05-02\T\23:47:14.800 [INFO] Downloaded: https://repo.maven.apache.org/maven2/org/apache/maven/shared/maven-common-artifact-filters/1.3/maven-common-artifact-filters-1.3.jar
(31 KB at 619.0 KB/sec)
2017-05-02\T\23:47:14.800 [INFO] 2017-05-02\T\23:47:14.800 [INFO] Downloading: https://repo.maven.apache.org/maven2/org/apache/maven/maven-project/2.0.9/maven-project-2.0.9.jar
2017-05-02\T\23:47:14.812 [INFO] 2017-05-02\T\23:47:14.812 [INFO] Downloaded: https://repo.maven.apache.org/maven2/org/apache/maven/surefire/surefire-api/2.12.4/surefire-api-2.12.4.jar
(115 KB at 1852.1 KB/sec)
2017-05-02\T\23:47:14.812 [INFO] 2017-05-02\T\23:47:14.812 [INFO] Downloading: https://repo.maven.apache.org/maven2/org/apache/maven/maven-settings/2.0.9/maven-settings-2.0.9.jar
2017-05-02\T\23:47:14.838 [INFO] 2017-05-02\T\23:47:14.838 [INFO] Downloaded: https://repo.maven.apache.org/maven2/org/apache/maven/maven-artifact/2.0.9/maven-artifact-2.0.9.jar
(87 KB at 1033.6 KB/sec)
2017-05-02\T\23:47:14.838 [INFO] 2017-05-02\T\23:47:14.838 [INFO] Downloading: https://repo.maven.apache.org/maven2/org/apache/maven/maven-profile/2.0.9/maven-profile-2.0.9.jar
2017-05-02\T\23:47:14.850 [INFO] 2017-05-02\T\23:47:14.850 [INFO] Downloaded: https://repo.maven.apache.org/maven2/org/apache/maven/surefire/maven-surefire-common/2.12.4/maven-surefire-common-2.12.4.jar
(257 KB at 2564.7 KB/sec)
2017-05-02\T\23:47:14.851 [INFO] 2017-05-02\T\23:47:14.850 [INFO] Downloading: https://repo.maven.apache.org/maven2/org/apache/maven/maven-artifact-manager/2.0.9/maven-artifact-manager-2.0.9.jar
2017-05-02\T\23:47:14.855 [INFO] 2017-05-02\T\23:47:14.855 [INFO] Downloaded: https://repo.maven.apache.org/maven2/org/apache/maven/maven-settings/2.0.9/maven-settings-2.0.9.jar
(48 KB at 474.9 KB/sec)
2017-05-02\T\23:47:14.857 [INFO] 2017-05-02\T\23:47:14.857 [INFO] Downloading: https://repo.maven.apache.org/maven2/org/apache/maven/maven-plugin-registry/2.0.9/maven-plugin-registry-2.0.9.jar
2017-05-02\T\23:47:14.858 [INFO] 2017-05-02\T\23:47:14.856 [INFO] Downloaded: https://repo.maven.apache.org/maven2/org/apache/maven/maven-project/2.0.9/maven-project-2.0.9.jar
(119 KB at 1165.9 KB/sec)
2017-05-02\T\23:47:14.858 [INFO] 2017-05-02\T\23:47:14.858 [INFO] Downloading: https://repo.maven.apache.org/maven2/org/apache/maven/maven-core/2.0.9/maven-core-2.0.9.jar
2017-05-02\T\23:47:14.871 [INFO] 2017-05-02\T\23:47:14.871 [INFO] Downloaded: https://repo.maven.apache.org/maven2/org/apache/maven/maven-profile/2.0.9/maven-profile-2.0.9.jar
(35 KB at 295.1 KB/sec)
2017-05-02\T\23:47:14.873 [INFO] 2017-05-02\T\23:47:14.873 [INFO] Downloading: https://repo.maven.apache.org/maven2/org/apache/maven/maven-plugin-parameter-documenter/2.0.9/maven-plugin-parameter-documenter-2.0.9.jar
2017-05-02\T\23:47:14.878 [INFO] 2017-05-02\T\23:47:14.878 [INFO] Downloaded: https://repo.maven.apache.org/maven2/org/codehaus/plexus/plexus-utils/3.0.8/plexus-utils-3.0.8.jar
(227 KB at 1825.7 KB/sec)
2017-05-02\T\23:47:14.878 [INFO] 2017-05-02\T\23:47:14.878 [INFO] Downloading: https://repo.maven.apache.org/maven2/org/apache/maven/reporting/maven-reporting-api/2.0.9/maven-reporting-api-2.0.9.jar
2017-05-02\T\23:47:14.891 [INFO] 2017-05-02\T\23:47:14.891 [INFO] Downloaded: https://repo.maven.apache.org/maven2/org/apache/maven/maven-artifact-manager/2.0.9/maven-artifact-manager-2.0.9.jar
(57 KB at 412.3 KB/sec)
2017-05-02\T\23:47:14.892 [INFO] 2017-05-02\T\23:47:14.892 [INFO] Downloading: https://repo.maven.apache.org/maven2/org/apache/maven/maven-repository-metadata/2.0.9/maven-repository-metadata-2.0.9.jar
2017-05-02\T\23:47:14.893 [INFO] 2017-05-02\T\23:47:14.893 [INFO] Downloaded: https://repo.maven.apache.org/maven2/org/apache/maven/maven-plugin-registry/2.0.9/maven-plugin-registry-2.0.9.jar
(29 KB at 204.3 KB/sec)
2017-05-02\T\23:47:14.893 [INFO] 2017-05-02\T\23:47:14.893 [INFO] Downloading: https://repo.maven.apache.org/maven2/org/apache/maven/maven-error-diagnostics/2.0.9/maven-error-diagnostics-2.0.9.jar
2017-05-02\T\23:47:14.908 [INFO] 2017-05-02\T\23:47:14.908 [INFO] Downloaded: https://repo.maven.apache.org/maven2/org/apache/maven/maven-plugin-parameter-documenter/2.0.9/maven-plugin-parameter-documenter-2.0.9.jar
(21 KB at 132.4 KB/sec)
2017-05-02\T\23:47:14.908 [INFO] 2017-05-02\T\23:47:14.908 [INFO] Downloading: https://repo.maven.apache.org/maven2/org/apache/maven/maven-plugin-descriptor/2.0.9/maven-plugin-descriptor-2.0.9.jar
2017-05-02\T\23:47:14.910 [INFO] 2017-05-02\T\23:47:14.910 [INFO] Downloaded: https://repo.maven.apache.org/maven2/org/apache/maven/reporting/maven-reporting-api/2.0.9/maven-reporting-api-2.0.9.jar
(10 KB at 63.5 KB/sec)
2017-05-02\T\23:47:14.910 [INFO] 2017-05-02\T\23:47:14.910 [INFO] Downloading: https://repo.maven.apache.org/maven2/org/apache/maven/maven-monitor/2.0.9/maven-monitor-2.0.9.jar
2017-05-02\T\23:47:14.916 [INFO] 2017-05-02\T\23:47:14.915 [INFO] Downloaded: https://repo.maven.apache.org/maven2/org/apache/maven/maven-core/2.0.9/maven-core-2.0.9.jar
(156 KB at 968.3 KB/sec)
2017-05-02\T\23:47:14.916 [INFO] 2017-05-02\T\23:47:14.916 [INFO] Downloading: https://repo.maven.apache.org/maven2/org/apache/maven/maven-toolchain/2.0.9/maven-toolchain-2.0.9.jar
2017-05-02\T\23:47:14.923 [INFO] 2017-05-02\T\23:47:14.923 [INFO] Downloaded: https://repo.maven.apache.org/maven2/org/apache/maven/maven-error-diagnostics/2.0.9/maven-error-diagnostics-2.0.9.jar
(14 KB at 79.7 KB/sec)
2017-05-02\T\23:47:14.923 [INFO] 2017-05-02\T\23:47:14.923 [INFO] Downloading: https://repo.maven.apache.org/maven2/org/apache/maven/plugin-tools/maven-plugin-annotations/3.1/maven-plugin-annotations-3.1.jar
2017-05-02\T\23:47:14.925 [INFO] 2017-05-02\T\23:47:14.924 [INFO] Downloaded: https://repo.maven.apache.org/maven2/org/apache/maven/maven-repository-metadata/2.0.9/maven-repository-metadata-2.0.9.jar
(24 KB at 141.1 KB/sec)
2017-05-02\T\23:47:14.941 [INFO] 2017-05-02\T\23:47:14.941 [INFO] Downloaded: https://repo.maven.apache.org/maven2/org/apache/maven/maven-monitor/2.0.9/maven-monitor-2.0.9.jar
(11 KB at 53.7 KB/sec)
2017-05-02\T\23:47:14.946 [INFO] 2017-05-02\T\23:47:14.946 [INFO] Downloaded: https://repo.maven.apache.org/maven2/org/apache/maven/maven-plugin-descriptor/2.0.9/maven-plugin-descriptor-2.0.9.jar
(37 KB at 188.4 KB/sec)
2017-05-02\T\23:47:14.952 [INFO] 2017-05-02\T\23:47:14.952 [INFO] Downloaded: https://repo.maven.apache.org/maven2/org/apache/maven/plugin-tools/maven-plugin-annotations/3.1/maven-plugin-annotations-3.1.jar
(14 KB at 69.2 KB/sec)
2017-05-02\T\23:47:14.955 [INFO] 2017-05-02\T\23:47:14.955 [INFO] Downloaded: https://repo.maven.apache.org/maven2/org/apache/maven/maven-toolchain/2.0.9/maven-toolchain-2.0.9.jar
(38 KB at 184.5 KB/sec)
2017-05-02\T\23:47:15.019 [INFO] 2017-05-02\T\23:47:15.019 [INFO] No tests to run.
2017-05-02\T\23:47:15.024 [INFO] 2017-05-02\T\23:47:15.024 [INFO] 
2017-05-02\T\23:47:15.024 [INFO] 2017-05-02\T\23:47:15.024 [INFO] --- maven-jar-plugin:2.4:jar
(default-jar) @ basic ---
2017-05-02\T\23:47:15.078 [INFO] 2017-05-02\T\23:47:15.077 [INFO] Downloading: https://repo.maven.apache.org/maven2/org/codehaus/plexus/plexus-interpolation/1.15/plexus-interpolation-1.15.jar
2017-05-02\T\23:47:15.078 [INFO] 2017-05-02\T\23:47:15.078 [INFO] Downloading: https://repo.maven.apache.org/maven2/org/codehaus/plexus/plexus-archiver/2.1/plexus-archiver-2.1.jar
2017-05-02\T\23:47:15.080 [INFO] 2017-05-02\T\23:47:15.078 [INFO] Downloading: https://repo.maven.apache.org/maven2/org/codehaus/plexus/plexus-io/2.0.2/plexus-io-2.0.2.jar
2017-05-02\T\23:47:15.080 [INFO] 2017-05-02\T\23:47:15.079 [INFO] Downloading: https://repo.maven.apache.org/maven2/org/codehaus/plexus/plexus-utils/3.0/plexus-utils-3.0.jar
2017-05-02\T\23:47:15.125 [INFO] 2017-05-02\T\23:47:15.125 [INFO] Downloaded: https://repo.maven.apache.org/maven2/org/codehaus/plexus/plexus-interpolation/1.15/plexus-interpolation-1.15.jar
(60 KB at 1230.3 KB/sec)
2017-05-02\T\23:47:15.126 [INFO] 2017-05-02\T\23:47:15.126 [INFO] Downloaded: https://repo.maven.apache.org/maven2/org/codehaus/plexus/plexus-io/2.0.2/plexus-io-2.0.2.jar
(57 KB at 1161.2 KB/sec)
2017-05-02\T\23:47:15.146 [INFO] 2017-05-02\T\23:47:15.146 [INFO] Downloaded: https://repo.maven.apache.org/maven2/org/codehaus/plexus/plexus-archiver/2.1/plexus-archiver-2.1.jar
(181 KB at 2610.4 KB/sec)
2017-05-02\T\23:47:15.168 [INFO] 2017-05-02\T\23:47:15.168 [INFO] Downloaded: https://repo.maven.apache.org/maven2/org/codehaus/plexus/plexus-utils/3.0/plexus-utils-3.0.jar
(221 KB at 2453.0 KB/sec)
2017-05-02\T\23:47:15.291 [INFO] 2017-05-02\T\23:47:15.291 [INFO] Building jar: <https://builds.apache.org/job/beam_PostCommit_Java_JDK_Versions_Test/jdk=JDK%201.8%20(latest),label=beam/ws/sdks/java/maven-archetypes/starter/target/test-classes/projects/basic/project/basic/target/basic-0.1.jar>
2017-05-02\T\23:47:15.305 [INFO] 2017-05-02\T\23:47:15.305 [INFO] ------------------------------------------------------------------------
2017-05-02\T\23:47:15.305 [INFO] 2017-05-02\T\23:47:15.305 [INFO] BUILD SUCCESS
2017-05-02\T\23:47:15.305 [INFO] 2017-05-02\T\23:47:15.305 [INFO] ------------------------------------------------------------------------
2017-05-02\T\23:47:15.305 [INFO] 2017-05-02\T\23:47:15.305 [INFO] Total time: 5.925 s
2017-05-02\T\23:47:15.305 [INFO] 2017-05-02\T\23:47:15.305 [INFO] Finished at: 2017-05-02T23:47:15+00:00
2017-05-02\T\23:47:15.448 [INFO] 2017-05-02\T\23:47:15.447 [INFO] Final Memory: 24M/312M
2017-05-02\T\23:47:15.448 [INFO] 2017-05-02\T\23:47:15.447 [INFO] ------------------------------------------------------------------------
2017-05-02\T\23:47:15.466 [INFO] Post-archetype-generation invoker exit code: 0
2017-05-02\T\23:47:15.469 [INFO] 
2017-05-02\T\23:47:15.469 [INFO] --- maven-archetype-plugin:2.4:update-local-catalog (default-update-local-catalog)
@ beam-sdks-java-maven-archetypes-starter ---
2017-05-02\T\23:47:15.512 [INFO]                                                         
               
2017-05-02\T\23:47:15.512 [INFO] ------------------------------------------------------------------------
2017-05-02\T\23:47:15.512 [INFO] Building Apache Beam :: SDKs :: Java :: Maven Archetypes
:: Examples 0.7.0-SNAPSHOT
2017-05-02\T\23:47:15.512 [INFO] ------------------------------------------------------------------------
2017-05-02\T\23:47:15.513 [INFO] Downloading: https://repo.maven.apache.org/maven2/org/codehaus/mojo/exec-maven-plugin/1.5.0/exec-maven-plugin-1.5.0.pom
2017-05-02\T\23:47:15.543 [INFO] Downloaded: https://repo.maven.apache.org/maven2/org/codehaus/mojo/exec-maven-plugin/1.5.0/exec-maven-plugin-1.5.0.pom
(13 KB at 401.2 KB/sec)
2017-05-02\T\23:47:15.545 [INFO] Downloading: https://repo.maven.apache.org/maven2/org/codehaus/mojo/mojo-parent/38/mojo-parent-38.pom
2017-05-02\T\23:47:15.579 [INFO] Downloaded: https://repo.maven.apache.org/maven2/org/codehaus/mojo/mojo-parent/38/mojo-parent-38.pom
(33 KB at 950.1 KB/sec)
2017-05-02\T\23:47:15.584 [INFO] Downloading: https://repo.maven.apache.org/maven2/org/codehaus/mojo/exec-maven-plugin/1.5.0/exec-maven-plugin-1.5.0.jar
2017-05-02\T\23:47:15.617 [INFO] Downloaded: https://repo.maven.apache.org/maven2/org/codehaus/mojo/exec-maven-plugin/1.5.0/exec-maven-plugin-1.5.0.jar
(53 KB at 1577.4 KB/sec)
2017-05-02\T\23:47:15.642 [INFO] 
2017-05-02\T\23:47:15.642 [INFO] --- maven-clean-plugin:3.0.0:clean (default-clean) @ beam-sdks-java-maven-archetypes-examples
---
2017-05-02\T\23:47:15.643 [INFO] Deleting <https://builds.apache.org/job/beam_PostCommit_Java_JDK_Versions_Test/jdk=JDK%201.8%20(latest),label=beam/ws/sdks/java/maven-archetypes/examples>
(includes = [**/*.pyc, **/*.egg-info/], excludes = [])
2017-05-02\T\23:47:15.643 [INFO] 
2017-05-02\T\23:47:15.643 [INFO] --- maven-enforcer-plugin:1.4.1:enforce (enforce) @ beam-sdks-java-maven-archetypes-examples
---
2017-05-02\T\23:47:16.431 [INFO] 
2017-05-02\T\23:47:16.431 [INFO] --- exec-maven-plugin:1.5.0:exec (generate-archetype-contents)
@ beam-sdks-java-maven-archetypes-examples ---
2017-05-02\T\23:47:16.436 [INFO] Downloading: https://repo.maven.apache.org/maven2/org/apache/maven/maven-toolchain/1.0/maven-toolchain-1.0.pom
2017-05-02\T\23:47:16.462 [INFO] Downloaded: https://repo.maven.apache.org/maven2/org/apache/maven/maven-toolchain/1.0/maven-toolchain-1.0.pom
(4 KB at 128.2 KB/sec)
2017-05-02\T\23:47:16.466 [INFO] Downloading: https://repo.maven.apache.org/maven2/org/apache/commons/commons-exec/1.3/commons-exec-1.3.pom
2017-05-02\T\23:47:16.493 [INFO] Downloaded: https://repo.maven.apache.org/maven2/org/apache/commons/commons-exec/1.3/commons-exec-1.3.pom
(11 KB at 397.6 KB/sec)
2017-05-02\T\23:47:16.503 [INFO] Downloading: https://repo.maven.apache.org/maven2/org/apache/maven/maven-toolchain/1.0/maven-toolchain-1.0.jar
2017-05-02\T\23:47:16.503 [INFO] Downloading: https://repo.maven.apache.org/maven2/org/apache/commons/commons-exec/1.3/commons-exec-1.3.jar
2017-05-02\T\23:47:16.541 [INFO] Downloaded: https://repo.maven.apache.org/maven2/org/apache/maven/maven-toolchain/1.0/maven-toolchain-1.0.jar
(33 KB at 845.8 KB/sec)
2017-05-02\T\23:47:16.542 [INFO] Downloaded: https://repo.maven.apache.org/maven2/org/apache/commons/commons-exec/1.3/commons-exec-1.3.jar
(54 KB at 1362.8 KB/sec)
rsync: change_dir "/home/jenkins/jenkins-slave/workspace/beam_PostCommit_Java_JDK_Versions_Test/jdk\#012.\#012(latest)/label/beam/sdks/java/maven-archetypes/examples/../../../../examples/java/src/main/java/org/apache/beam/examples"
failed: No such file or directory (2)
rsync error: some files/attrs were not transferred (see previous errors) (code 23) at main.c(1183)
[sender=3.1.0]
2017-05-02\T\23:47:16.804 [ERROR] Command execution failed.
org.apache.commons.exec.ExecuteException: Process exited with an error: 23 (Exit value: 23)
	at org.apache.commons.exec.DefaultExecutor.executeInternal(DefaultExecutor.java:404)
	at org.apache.commons.exec.DefaultExecutor.execute(DefaultExecutor.java:166)
	at org.codehaus.mojo.exec.ExecMojo.executeCommandLine(ExecMojo.java:764)
	at org.codehaus.mojo.exec.ExecMojo.executeCommandLine(ExecMojo.java:711)
	at org.codehaus.mojo.exec.ExecMojo.execute(ExecMojo.java:289)
	at org.apache.maven.plugin.DefaultBuildPluginManager.executeMojo(DefaultBuildPluginManager.java:134)
	at org.apache.maven.lifecycle.internal.MojoExecutor.execute(MojoExecutor.java:208)
	at org.apache.maven.lifecycle.internal.MojoExecutor.execute(MojoExecutor.java:153)
	at org.apache.maven.lifecycle.internal.MojoExecutor.execute(MojoExecutor.java:145)
	at org.apache.maven.lifecycle.internal.LifecycleModuleBuilder.buildProject(LifecycleModuleBuilder.java:116)
	at org.apache.maven.lifecycle.internal.LifecycleModuleBuilder.buildProject(LifecycleModuleBuilder.java:80)
	at org.apache.maven.lifecycle.internal.builder.singlethreaded.SingleThreadedBuilder.build(SingleThreadedBuilder.java:51)
	at org.apache.maven.lifecycle.internal.LifecycleStarter.execute(LifecycleStarter.java:128)
	at org.apache.maven.DefaultMaven.doExecute(DefaultMaven.java:307)
	at org.apache.maven.DefaultMaven.doExecute(DefaultMaven.java:193)
	at org.apache.maven.DefaultMaven.execute(DefaultMaven.java:106)
	at org.apache.maven.cli.MavenCli.execute(MavenCli.java:862)
	at org.apache.maven.cli.MavenCli.doMain(MavenCli.java:286)
	at org.apache.maven.cli.MavenCli.main(MavenCli.java:197)
	at sun.reflect.NativeMethodAccessorImpl.invoke0(Native Method)
	at sun.reflect.NativeMethodAccessorImpl.invoke(NativeMethodAccessorImpl.java:62)
	at sun.reflect.DelegatingMethodAccessorImpl.invoke(DelegatingMethodAccessorImpl.java:43)
	at java.lang.reflect.Method.invoke(Method.java:498)
	at org.codehaus.plexus.classworlds.launcher.Launcher.launchEnhanced(Launcher.java:289)
	at org.codehaus.plexus.classworlds.launcher.Launcher.launch(Launcher.java:229)
	at org.codehaus.plexus.classworlds.launcher.Launcher.mainWithExitCode(Launcher.java:415)
	at org.codehaus.plexus.classworlds.launcher.Launcher.main(Launcher.java:356)
2017-05-02\T\23:47:16.805 [INFO] ------------------------------------------------------------------------
2017-05-02\T\23:47:16.805 [INFO] Reactor Summary:
2017-05-02\T\23:47:16.805 [INFO] 
2017-05-02\T\23:47:16.806 [INFO] Apache Beam :: Parent .............................. SUCCESS
[ 23.126 s]
2017-05-02\T\23:47:16.806 [INFO] Apache Beam :: SDKs :: Java :: Build Tools ......... SUCCESS
[  9.053 s]
2017-05-02\T\23:47:16.806 [INFO] Apache Beam :: SDKs ................................ SUCCESS
[  0.889 s]
2017-05-02\T\23:47:16.806 [INFO] Apache Beam :: SDKs :: Common ...................... SUCCESS
[  2.332 s]
2017-05-02\T\23:47:16.806 [INFO] Apache Beam :: SDKs :: Common :: Fn API ............ SUCCESS
[ 14.452 s]
2017-05-02\T\23:47:16.806 [INFO] Apache Beam :: SDKs :: Common :: Runner API ........ SUCCESS
[  2.227 s]
2017-05-02\T\23:47:16.806 [INFO] Apache Beam :: SDKs :: Java ........................ SUCCESS
[  2.230 s]
2017-05-02\T\23:47:16.806 [INFO] Apache Beam :: SDKs :: Java :: Core ................ SUCCESS
[01:51 min]
2017-05-02\T\23:47:16.806 [INFO] Apache Beam :: SDKs :: Java :: IO .................. SUCCESS
[  0.483 s]
2017-05-02\T\23:47:16.806 [INFO] Apache Beam :: SDKs :: Java :: IO :: Common ........ SUCCESS
[  3.012 s]
2017-05-02\T\23:47:16.806 [INFO] Apache Beam :: Runners ............................. SUCCESS
[  0.467 s]
2017-05-02\T\23:47:16.806 [INFO] Apache Beam :: Runners :: Core Construction Java ... SUCCESS
[ 12.890 s]
2017-05-02\T\23:47:16.806 [INFO] Apache Beam :: Runners :: Core Java ................ SUCCESS
[ 41.052 s]
2017-05-02\T\23:47:16.806 [INFO] Apache Beam :: Runners :: Direct Java .............. SUCCESS
[02:47 min]
2017-05-02\T\23:47:16.806 [INFO] Apache Beam :: SDKs :: Java :: IO :: Elasticsearch . SUCCESS
[ 26.353 s]
2017-05-02\T\23:47:16.806 [INFO] Apache Beam :: SDKs :: Java :: Extensions .......... SUCCESS
[  0.398 s]
2017-05-02\T\23:47:16.806 [INFO] Apache Beam :: SDKs :: Java :: Extensions :: Google Cloud
Platform Core SUCCESS [ 18.073 s]
2017-05-02\T\23:47:16.806 [INFO] Apache Beam :: SDKs :: Java :: Extensions :: Protobuf SUCCESS
[ 10.401 s]
2017-05-02\T\23:47:16.806 [INFO] Apache Beam :: SDKs :: Java :: IO :: Google Cloud Platform
SUCCESS [01:13 min]
2017-05-02\T\23:47:16.806 [INFO] Apache Beam :: SDKs :: Java :: IO :: Hadoop Common . SUCCESS
[ 12.502 s]
2017-05-02\T\23:47:16.806 [INFO] Apache Beam :: SDKs :: Java :: IO :: Hadoop File System SUCCESS
[ 47.062 s]
2017-05-02\T\23:47:16.807 [INFO] Apache Beam :: SDKs :: Java :: IO :: Hadoop ........ SUCCESS
[  2.022 s]
2017-05-02\T\23:47:16.807 [INFO] Apache Beam :: SDKs :: Java :: IO :: Hadoop :: input-format
SUCCESS [ 10.778 s]
2017-05-02\T\23:47:16.807 [INFO] Apache Beam :: Runners :: Google Cloud Dataflow .... SUCCESS
[ 31.814 s]
2017-05-02\T\23:47:16.807 [INFO] Apache Beam :: SDKs :: Java :: IO :: Hadoop :: jdk1.8-tests
SUCCESS [01:22 min]
2017-05-02\T\23:47:16.807 [INFO] Apache Beam :: SDKs :: Java :: IO :: HBase ......... SUCCESS
[ 58.489 s]
2017-05-02\T\23:47:16.807 [INFO] Apache Beam :: SDKs :: Java :: IO :: JDBC .......... SUCCESS
[ 14.440 s]
2017-05-02\T\23:47:16.807 [INFO] Apache Beam :: SDKs :: Java :: IO :: JMS ........... SUCCESS
[ 11.645 s]
2017-05-02\T\23:47:16.807 [INFO] Apache Beam :: SDKs :: Java :: IO :: Kafka ......... SUCCESS
[ 26.828 s]
2017-05-02\T\23:47:16.807 [INFO] Apache Beam :: SDKs :: Java :: IO :: Kinesis ....... SUCCESS
[ 12.695 s]
2017-05-02\T\23:47:16.807 [INFO] Apache Beam :: SDKs :: Java :: IO :: MongoDB ....... SUCCESS
[ 33.616 s]
2017-05-02\T\23:47:16.807 [INFO] Apache Beam :: SDKs :: Java :: IO :: MQTT .......... SUCCESS
[ 12.180 s]
2017-05-02\T\23:47:16.807 [INFO] Apache Beam :: SDKs :: Java :: IO :: XML ........... SUCCESS
[ 22.241 s]
2017-05-02\T\23:47:16.807 [INFO] Apache Beam :: SDKs :: Java :: Maven Archetypes .... SUCCESS
[  0.483 s]
2017-05-02\T\23:47:16.807 [INFO] Apache Beam :: SDKs :: Java :: Maven Archetypes :: Starter
SUCCESS [ 17.392 s]
2017-05-02\T\23:47:16.807 [INFO] Apache Beam :: SDKs :: Java :: Maven Archetypes :: Examples
FAILURE [  1.293 s]
2017-05-02\T\23:47:16.807 [INFO] Apache Beam :: SDKs :: Java :: Maven Archetypes :: Examples
- Java 8 SKIPPED
2017-05-02\T\23:47:16.807 [INFO] Apache Beam :: SDKs :: Java :: Extensions :: Jackson SKIPPED
2017-05-02\T\23:47:16.807 [INFO] Apache Beam :: SDKs :: Java :: Extensions :: Join library
SKIPPED
2017-05-02\T\23:47:16.807 [INFO] Apache Beam :: SDKs :: Java :: Extensions :: Sorter  SKIPPED
2017-05-02\T\23:47:16.807 [INFO] Apache Beam :: SDKs :: Java :: Harness ............. SKIPPED
2017-05-02\T\23:47:16.807 [INFO] Apache Beam :: SDKs :: Java :: Java 8 Tests ........ SKIPPED
2017-05-02\T\23:47:16.807 [INFO] Apache Beam :: Runners :: Flink .................... SKIPPED
2017-05-02\T\23:47:16.807 [INFO] Apache Beam :: Runners :: Spark .................... SKIPPED
2017-05-02\T\23:47:16.807 [INFO] Apache Beam :: Runners :: Apex ..................... SKIPPED
2017-05-02\T\23:47:16.807 [INFO] Apache Beam :: Examples ............................ SKIPPED
2017-05-02\T\23:47:16.807 [INFO] Apache Beam :: Examples :: Java .................... SKIPPED
2017-05-02\T\23:47:16.807 [INFO] Apache Beam :: Examples :: Java 8 .................. SKIPPED
2017-05-02\T\23:47:16.807 [INFO] Apache Beam :: SDKs :: Java :: Aggregated Javadoc .. SKIPPED
2017-05-02\T\23:47:16.807 [INFO] ------------------------------------------------------------------------
2017-05-02\T\23:47:16.807 [INFO] BUILD FAILURE
2017-05-02\T\23:47:16.807 [INFO] ------------------------------------------------------------------------
2017-05-02\T\23:47:16.807 [INFO] Total time: 15:24 min
2017-05-02\T\23:47:16.808 [INFO] Finished at: 2017-05-02T23:47:16+00:00
2017-05-02\T\23:47:18.202 [INFO] Final Memory: 421M/1881M
2017-05-02\T\23:47:18.202 [INFO] ------------------------------------------------------------------------
2017-05-02\T\23:47:18.203 [ERROR] Failed to execute goal org.codehaus.mojo:exec-maven-plugin:1.5.0:exec
(generate-archetype-contents) on project beam-sdks-java-maven-archetypes-examples: Command
execution failed. Process exited with an error: 23 (Exit value: 23) -> [Help 1]
org.apache.maven.lifecycle.LifecycleExecutionException: Failed to execute goal org.codehaus.mojo:exec-maven-plugin:1.5.0:exec
(generate-archetype-contents) on project beam-sdks-java-maven-archetypes-examples: Command
execution failed.
	at org.apache.maven.lifecycle.internal.MojoExecutor.execute(MojoExecutor.java:216)
	at org.apache.maven.lifecycle.internal.MojoExecutor.execute(MojoExecutor.java:153)
	at org.apache.maven.lifecycle.internal.MojoExecutor.execute(MojoExecutor.java:145)
	at org.apache.maven.lifecycle.internal.LifecycleModuleBuilder.buildProject(LifecycleModuleBuilder.java:116)
	at org.apache.maven.lifecycle.internal.LifecycleModuleBuilder.buildProject(LifecycleModuleBuilder.java:80)
	at org.apache.maven.lifecycle.internal.builder.singlethreaded.SingleThreadedBuilder.build(SingleThreadedBuilder.java:51)
	at org.apache.maven.lifecycle.internal.LifecycleStarter.execute(LifecycleStarter.java:128)
	at org.apache.maven.DefaultMaven.doExecute(DefaultMaven.java:307)
	at org.apache.maven.DefaultMaven.doExecute(DefaultMaven.java:193)
	at org.apache.maven.DefaultMaven.execute(DefaultMaven.java:106)
	at org.apache.maven.cli.MavenCli.execute(MavenCli.java:862)
	at org.apache.maven.cli.MavenCli.doMain(MavenCli.java:286)
	at org.apache.maven.cli.MavenCli.main(MavenCli.java:197)
	at sun.reflect.NativeMethodAccessorImpl.invoke0(Native Method)
	at sun.reflect.NativeMethodAccessorImpl.invoke(NativeMethodAccessorImpl.java:62)
	at sun.reflect.DelegatingMethodAccessorImpl.invoke(DelegatingMethodAccessorImpl.java:43)
	at java.lang.reflect.Method.invoke(Method.java:498)
	at org.codehaus.plexus.classworlds.launcher.Launcher.launchEnhanced(Launcher.java:289)
	at org.codehaus.plexus.classworlds.launcher.Launcher.launch(Launcher.java:229)
	at org.codehaus.plexus.classworlds.launcher.Launcher.mainWithExitCode(Launcher.java:415)
	at org.codehaus.plexus.classworlds.launcher.Launcher.main(Launcher.java:356)
Caused by: org.apache.maven.plugin.MojoExecutionException: Command execution failed.
	at org.codehaus.mojo.exec.ExecMojo.execute(ExecMojo.java:302)
	at org.apache.maven.plugin.DefaultBuildPluginManager.executeMojo(DefaultBuildPluginManager.java:134)
	at org.apache.maven.lifecycle.internal.MojoExecutor.execute(MojoExecutor.java:208)
	... 20 more
Caused by: org.apache.commons.exec.ExecuteException: Process exited with an error: 23 (Exit
value: 23)
	at org.apache.commons.exec.DefaultExecutor.executeInternal(DefaultExecutor.java:404)
	at org.apache.commons.exec.DefaultExecutor.execute(DefaultExecutor.java:166)
	at org.codehaus.mojo.exec.ExecMojo.executeCommandLine(ExecMojo.java:764)
	at org.codehaus.mojo.exec.ExecMojo.executeCommandLine(ExecMojo.java:711)
	at org.codehaus.mojo.exec.ExecMojo.execute(ExecMojo.java:289)
	... 22 more
2017-05-02\T\23:47:18.204 [ERROR] 
2017-05-02\T\23:47:18.204 [ERROR] Re-run Maven using the -X switch to enable full debug logging.
2017-05-02\T\23:47:18.204 [ERROR] 
2017-05-02\T\23:47:18.204 [ERROR] For more information about the errors and possible solutions,
please read the following articles:
2017-05-02\T\23:47:18.204 [ERROR] [Help 1] http://cwiki.apache.org/confluence/display/MAVEN/MojoExecutionException
2017-05-02\T\23:47:18.204 [ERROR] 
2017-05-02\T\23:47:18.204 [ERROR] After correcting the problems, you can resume the build
with the command
2017-05-02\T\23:47:18.204 [ERROR]   mvn <goals> -rf :beam-sdks-java-maven-archetypes-examples
Build step 'Invoke top-level Maven targets' marked build as failure

Mime
View raw message