beam-commits mailing list archives

Site index · List index
Message view « Date » · « Thread »
Top « Date » · « Thread »
From Apache Jenkins Server <jenk...@builds.apache.org>
Subject Build failed in Jenkins: beam_PostCommit_Java_MavenInstall_Windows #73
Date Tue, 30 May 2017 18:05:44 GMT
See <https://builds.apache.org/job/beam_PostCommit_Java_MavenInstall_Windows/73/display/redirect?page=changes>

Changes:

[aljoscha.krettek] [BEAM-2380] Forward additional outputs to DoFnRunner in Flink Batch

[aljoscha.krettek] Fix flushing of pushed-back data in Flink Runner on +Inf watermark

[dhalperi] fix javadoc of View

------------------------------------------
[...truncated 351.53 KB...]
2017-05-30T18:03:26.271 [INFO] Downloading: https://repo.maven.apache.org/maven2/com/google/errorprone/error_prone_annotations/2.0.15/error_prone_annotations-2.0.15.pom
2017-05-30T18:03:26.302 [INFO] Downloaded: https://repo.maven.apache.org/maven2/com/google/errorprone/error_prone_annotations/2.0.15/error_prone_annotations-2.0.15.pom
(2 KB at 51.5 KB/sec)
2017-05-30T18:03:26.318 [INFO] Downloading: https://repo.maven.apache.org/maven2/com/google/errorprone/error_prone_parent/2.0.15/error_prone_parent-2.0.15.pom
2017-05-30T18:03:26.349 [INFO] Downloaded: https://repo.maven.apache.org/maven2/com/google/errorprone/error_prone_parent/2.0.15/error_prone_parent-2.0.15.pom
(6 KB at 161.5 KB/sec)
2017-05-30T18:03:26.349 [INFO] Downloading: https://repo.maven.apache.org/maven2/com/google/code/findbugs/jsr305/3.0.1/jsr305-3.0.1.pom
2017-05-30T18:03:26.380 [INFO] Downloaded: https://repo.maven.apache.org/maven2/com/google/code/findbugs/jsr305/3.0.1/jsr305-3.0.1.pom
(5 KB at 135.0 KB/sec)
2017-05-30T18:03:26.380 [INFO] Downloading: https://repo.maven.apache.org/maven2/io/grpc/grpc-context/1.2.0/grpc-context-1.2.0.pom
2017-05-30T18:03:26.412 [INFO] Downloaded: https://repo.maven.apache.org/maven2/io/grpc/grpc-context/1.2.0/grpc-context-1.2.0.pom
(2 KB at 53.3 KB/sec)
2017-05-30T18:03:26.412 [INFO] Downloading: https://repo.maven.apache.org/maven2/com/google/instrumentation/instrumentation-api/0.3.0/instrumentation-api-0.3.0.pom
2017-05-30T18:03:26.443 [INFO] Downloaded: https://repo.maven.apache.org/maven2/com/google/instrumentation/instrumentation-api/0.3.0/instrumentation-api-0.3.0.pom
(2 KB at 47.2 KB/sec)
2017-05-30T18:03:26.443 [INFO] Downloading: https://repo.maven.apache.org/maven2/io/grpc/grpc-protobuf/1.2.0/grpc-protobuf-1.2.0.pom
2017-05-30T18:03:26.474 [INFO] Downloaded: https://repo.maven.apache.org/maven2/io/grpc/grpc-protobuf/1.2.0/grpc-protobuf-1.2.0.pom
(3 KB at 83.6 KB/sec)
2017-05-30T18:03:26.474 [INFO] Downloading: https://repo.maven.apache.org/maven2/com/google/protobuf/protobuf-java-util/3.2.0/protobuf-java-util-3.2.0.pom
2017-05-30T18:03:26.505 [INFO] Downloaded: https://repo.maven.apache.org/maven2/com/google/protobuf/protobuf-java-util/3.2.0/protobuf-java-util-3.2.0.pom
(5 KB at 133.9 KB/sec)
2017-05-30T18:03:26.505 [INFO] Downloading: https://repo.maven.apache.org/maven2/com/google/code/gson/gson/2.7/gson-2.7.pom
2017-05-30T18:03:26.537 [INFO] Downloaded: https://repo.maven.apache.org/maven2/com/google/code/gson/gson/2.7/gson-2.7.pom
(2 KB at 44.1 KB/sec)
2017-05-30T18:03:26.537 [INFO] Downloading: https://repo.maven.apache.org/maven2/com/google/code/gson/gson-parent/2.7/gson-parent-2.7.pom
2017-05-30T18:03:26.568 [INFO] Downloaded: https://repo.maven.apache.org/maven2/com/google/code/gson/gson-parent/2.7/gson-parent-2.7.pom
(4 KB at 112.8 KB/sec)
2017-05-30T18:03:26.568 [INFO] Downloading: https://repo.maven.apache.org/maven2/io/grpc/grpc-protobuf-lite/1.2.0/grpc-protobuf-lite-1.2.0.pom
2017-05-30T18:03:26.599 [INFO] Downloaded: https://repo.maven.apache.org/maven2/io/grpc/grpc-protobuf-lite/1.2.0/grpc-protobuf-lite-1.2.0.pom
(3 KB at 66.9 KB/sec)
2017-05-30T18:03:26.599 [INFO] Downloading: https://repo.maven.apache.org/maven2/io/grpc/grpc-stub/1.2.0/grpc-stub-1.2.0.pom
2017-05-30T18:03:26.630 [INFO] Downloaded: https://repo.maven.apache.org/maven2/io/grpc/grpc-stub/1.2.0/grpc-stub-1.2.0.pom
(3 KB at 65.5 KB/sec)
2017-05-30T18:03:26.646 [INFO] Downloading: https://repo.maven.apache.org/maven2/com/google/protobuf/protobuf-java/3.2.0/protobuf-java-3.2.0.jar
2017-05-30T18:03:26.646 [INFO] Downloading: https://repo.maven.apache.org/maven2/io/grpc/grpc-core/1.2.0/grpc-core-1.2.0.jar
2017-05-30T18:03:26.646 [INFO] Downloading: https://repo.maven.apache.org/maven2/com/google/errorprone/error_prone_annotations/2.0.15/error_prone_annotations-2.0.15.jar
2017-05-30T18:03:26.646 [INFO] Downloading: https://repo.maven.apache.org/maven2/com/google/code/findbugs/jsr305/3.0.1/jsr305-3.0.1.jar
2017-05-30T18:03:26.646 [INFO] Downloading: https://repo.maven.apache.org/maven2/io/grpc/grpc-context/1.2.0/grpc-context-1.2.0.jar
2017-05-30T18:03:26.677 [INFO] Downloaded: https://repo.maven.apache.org/maven2/io/grpc/grpc-context/1.2.0/grpc-context-1.2.0.jar
(20 KB at 637.0 KB/sec)
2017-05-30T18:03:26.677 [INFO] Downloading: https://repo.maven.apache.org/maven2/com/google/instrumentation/instrumentation-api/0.3.0/instrumentation-api-0.3.0.jar
2017-05-30T18:03:26.677 [INFO] Downloaded: https://repo.maven.apache.org/maven2/com/google/code/findbugs/jsr305/3.0.1/jsr305-3.0.1.jar
(20 KB at 628.2 KB/sec)
2017-05-30T18:03:26.677 [INFO] Downloading: https://repo.maven.apache.org/maven2/io/grpc/grpc-protobuf/1.2.0/grpc-protobuf-1.2.0.jar
2017-05-30T18:03:26.677 [INFO] Downloaded: https://repo.maven.apache.org/maven2/com/google/errorprone/error_prone_annotations/2.0.15/error_prone_annotations-2.0.15.jar
(11 KB at 342.3 KB/sec)
2017-05-30T18:03:26.677 [INFO] Downloading: https://repo.maven.apache.org/maven2/com/google/protobuf/protobuf-java-util/3.2.0/protobuf-java-util-3.2.0.jar
2017-05-30T18:03:26.708 [INFO] Downloaded: https://repo.maven.apache.org/maven2/io/grpc/grpc-protobuf/1.2.0/grpc-protobuf-1.2.0.jar
(4 KB at 62.8 KB/sec)
2017-05-30T18:03:26.708 [INFO] Downloading: https://repo.maven.apache.org/maven2/com/google/code/gson/gson/2.7/gson-2.7.jar
2017-05-30T18:03:26.708 [INFO] Downloaded: https://repo.maven.apache.org/maven2/com/google/instrumentation/instrumentation-api/0.3.0/instrumentation-api-0.3.0.jar
(30 KB at 477.0 KB/sec)
2017-05-30T18:03:26.708 [INFO] Downloading: https://repo.maven.apache.org/maven2/io/grpc/grpc-protobuf-lite/1.2.0/grpc-protobuf-lite-1.2.0.jar
2017-05-30T18:03:26.724 [INFO] Downloaded: https://repo.maven.apache.org/maven2/com/google/protobuf/protobuf-java-util/3.2.0/protobuf-java-util-3.2.0.jar
(66 KB at 845.8 KB/sec)
2017-05-30T18:03:26.724 [INFO] Downloading: https://repo.maven.apache.org/maven2/io/grpc/grpc-stub/1.2.0/grpc-stub-1.2.0.jar
2017-05-30T18:03:26.724 [INFO] Downloaded: https://repo.maven.apache.org/maven2/io/grpc/grpc-core/1.2.0/grpc-core-1.2.0.jar
(414 KB at 5305.2 KB/sec)
2017-05-30T18:03:26.740 [INFO] Downloaded: https://repo.maven.apache.org/maven2/io/grpc/grpc-protobuf-lite/1.2.0/grpc-protobuf-lite-1.2.0.jar
(8 KB at 79.2 KB/sec)
2017-05-30T18:03:26.755 [INFO] Downloaded: https://repo.maven.apache.org/maven2/io/grpc/grpc-stub/1.2.0/grpc-stub-1.2.0.jar
(36 KB at 326.1 KB/sec)
2017-05-30T18:03:26.771 [INFO] Downloaded: https://repo.maven.apache.org/maven2/com/google/code/gson/gson/2.7/gson-2.7.jar
(227 KB at 1812.1 KB/sec)
2017-05-30T18:03:26.818 [INFO] Downloaded: https://repo.maven.apache.org/maven2/com/google/protobuf/protobuf-java/3.2.0/protobuf-java-3.2.0.jar
(1316 KB at 7648.5 KB/sec)
2017-05-30T18:03:26.833 [INFO] 
2017-05-30T18:03:26.833 [INFO] --- maven-clean-plugin:3.0.0:clean (default-clean) @ beam-sdks-common-fn-api
---
2017-05-30T18:03:26.833 [INFO] Deleting F:\jenkins\jenkins-slave\workspace\beam_PostCommit_Java_MavenInstall_Windows\sdks\common\fn-api
(includes = [**/*.pyc, **/*.egg-info/, **/sdks/python/LICENSE, **/sdks/python/NOTICE, **/sdks/python/README.md],
excludes = [])
2017-05-30T18:03:27.037 [INFO] 
2017-05-30T18:03:27.037 [INFO] --- maven-enforcer-plugin:1.4.1:enforce (enforce) @ beam-sdks-common-fn-api
---
2017-05-30T18:03:27.474 [INFO] 
2017-05-30T18:03:27.474 [INFO] --- maven-enforcer-plugin:1.4.1:enforce (enforce-banned-dependencies)
@ beam-sdks-common-fn-api ---
2017-05-30T18:03:27.646 [INFO] 
2017-05-30T18:03:27.646 [INFO] --- protobuf-maven-plugin:0.5.0:compile (default) @ beam-sdks-common-fn-api
---
2017-05-30T18:03:27.662 [INFO] Downloading: https://repo.maven.apache.org/maven2/com/google/guava/guava/18.0/guava-18.0.pom
2017-05-30T18:03:27.693 [INFO] Downloaded: https://repo.maven.apache.org/maven2/com/google/guava/guava/18.0/guava-18.0.pom
(6 KB at 178.5 KB/sec)
2017-05-30T18:03:27.693 [INFO] Downloading: https://repo.maven.apache.org/maven2/com/google/guava/guava-parent/18.0/guava-parent-18.0.pom
2017-05-30T18:03:27.724 [INFO] Downloaded: https://repo.maven.apache.org/maven2/com/google/guava/guava-parent/18.0/guava-parent-18.0.pom
(8 KB at 242.1 KB/sec)
2017-05-30T18:03:27.724 [INFO] Downloading: https://repo.maven.apache.org/maven2/org/apache/maven/plugin-tools/maven-plugin-annotations/3.4/maven-plugin-annotations-3.4.pom
2017-05-30T18:03:27.755 [INFO] Downloaded: https://repo.maven.apache.org/maven2/org/apache/maven/plugin-tools/maven-plugin-annotations/3.4/maven-plugin-annotations-3.4.pom
(2 KB at 51.3 KB/sec)
2017-05-30T18:03:27.787 [INFO] Downloading: https://repo.maven.apache.org/maven2/com/google/guava/guava/18.0/guava-18.0.jar
2017-05-30T18:03:27.787 [INFO] Downloading: https://repo.maven.apache.org/maven2/org/apache/maven/plugin-tools/maven-plugin-annotations/3.4/maven-plugin-annotations-3.4.jar
2017-05-30T18:03:27.818 [INFO] Downloaded: https://repo.maven.apache.org/maven2/org/apache/maven/plugin-tools/maven-plugin-annotations/3.4/maven-plugin-annotations-3.4.jar
(14 KB at 296.0 KB/sec)
2017-05-30T18:03:28.021 [INFO] Downloaded: https://repo.maven.apache.org/maven2/com/google/guava/guava/18.0/guava-18.0.jar
(2204 KB at 8813.3 KB/sec)
2017-05-30T18:03:28.208 [INFO] Downloading: https://repo.maven.apache.org/maven2/com/google/protobuf/protoc/3.2.0/protoc-3.2.0.pom
2017-05-30T18:03:28.240 [INFO] Downloaded: https://repo.maven.apache.org/maven2/com/google/protobuf/protoc/3.2.0/protoc-3.2.0.pom
(5 KB at 138.6 KB/sec)
2017-05-30T18:03:28.255 [INFO] Downloading: https://repo.maven.apache.org/maven2/com/google/protobuf/protoc/3.2.0/protoc-3.2.0-windows-x86_64.exe
2017-05-30T18:03:28.708 [INFO] Downloaded: https://repo.maven.apache.org/maven2/com/google/protobuf/protoc/3.2.0/protoc-3.2.0-windows-x86_64.exe
(4025 KB at 8885.2 KB/sec)
2017-05-30T18:03:28.724 [INFO] Compiling 1 proto file(s) to F:\jenkins\jenkins-slave\workspace\beam_PostCommit_Java_MavenInstall_Windows\sdks\common\fn-api\target\generated-sources\protobuf\java
2017-05-30T18:03:29.177 [INFO] 
2017-05-30T18:03:29.177 [INFO] --- protobuf-maven-plugin:0.5.0:compile-custom (default) @
beam-sdks-common-fn-api ---
[JENKINS] Archiving disabled
2017-05-30T18:03:32.771 [INFO]                                                           
             
2017-05-30T18:03:32.771 [INFO] ------------------------------------------------------------------------
2017-05-30T18:03:32.771 [INFO] Skipping Apache Beam :: Parent
2017-05-30T18:03:32.771 [INFO] This project has been banned from the build due to previous
failures.
2017-05-30T18:03:32.771 [INFO] ------------------------------------------------------------------------
[JENKINS] Archiving disabled
[JENKINS] Archiving disabled
[JENKINS] Archiving disabled
[JENKINS] Archiving disabled
[JENKINS] Archiving disabled
[JENKINS] Archiving disabled
[JENKINS] Archiving disabled
[JENKINS] Archiving disabled
[JENKINS] Archiving disabled
[JENKINS] Archiving disabled
[JENKINS] Archiving disabled
[JENKINS] Archiving disabled
[JENKINS] Archiving disabled
[JENKINS] Archiving disabled
[JENKINS] Archiving disabled
[JENKINS] Archiving disabled
[JENKINS] Archiving disabled
[JENKINS] Archiving disabled
[JENKINS] Archiving disabled
[JENKINS] Archiving disabled
[JENKINS] Archiving disabled
[JENKINS] Archiving disabled
[JENKINS] Archiving disabled
[JENKINS] Archiving disabled
[JENKINS] Archiving disabled
[JENKINS] Archiving disabled
[JENKINS] Archiving disabled
[JENKINS] Archiving disabled
[JENKINS] Archiving disabled
[JENKINS] Archiving disabled
[JENKINS] Archiving disabled
[JENKINS] Archiving disabled
[JENKINS] Archiving disabled
[JENKINS] Archiving disabled
[JENKINS] Archiving disabled
[JENKINS] Archiving disabled
[JENKINS] Archiving disabled
[JENKINS] Archiving disabled
[JENKINS] Archiving disabled
[JENKINS] Archiving disabled
[JENKINS] Archiving disabled
[JENKINS] Archiving disabled
[JENKINS] Archiving disabled
[JENKINS] Archiving disabled
[JENKINS] Archiving disabled
[JENKINS] Archiving disabled
[JENKINS] Archiving disabled
[JENKINS] Archiving disabled
2017-05-30T18:04:06.927 [INFO] ------------------------------------------------------------------------
2017-05-30T18:04:06.927 [INFO] Reactor Summary:
2017-05-30T18:04:06.927 [INFO] 
2017-05-30T18:04:06.927 [INFO] Apache Beam :: Parent .............................. SUCCESS
[ 36.219 s]
2017-05-30T18:04:06.927 [INFO] Apache Beam :: SDKs :: Java :: Build Tools ......... SUCCESS
[ 20.125 s]
2017-05-30T18:04:06.927 [INFO] Apache Beam :: SDKs ................................ SUCCESS
[ 13.282 s]
2017-05-30T18:04:06.927 [INFO] Apache Beam :: SDKs :: Common ...................... SUCCESS
[  9.453 s]
2017-05-30T18:04:06.927 [INFO] Apache Beam :: SDKs :: Common :: Fn API ............ FAILURE
[  5.016 s]
2017-05-30T18:04:06.927 [INFO] Apache Beam :: SDKs :: Common :: Runner API ........ SKIPPED
2017-05-30T18:04:06.927 [INFO] Apache Beam :: SDKs :: Java ........................ SKIPPED
2017-05-30T18:04:06.927 [INFO] Apache Beam :: SDKs :: Java :: Core ................ SKIPPED
2017-05-30T18:04:06.927 [INFO] Apache Beam :: SDKs :: Java :: IO .................. SKIPPED
2017-05-30T18:04:06.927 [INFO] Apache Beam :: SDKs :: Java :: IO :: Common ........ SKIPPED
2017-05-30T18:04:06.927 [INFO] Apache Beam :: Runners ............................. SKIPPED
2017-05-30T18:04:06.927 [INFO] Apache Beam :: Runners :: Core Construction Java ... SKIPPED
2017-05-30T18:04:06.927 [INFO] Apache Beam :: Runners :: Core Java ................ SKIPPED
2017-05-30T18:04:06.927 [INFO] Apache Beam :: Runners :: Direct Java .............. SKIPPED
2017-05-30T18:04:06.927 [INFO] Apache Beam :: SDKs :: Java :: IO :: Elasticsearch . SKIPPED
2017-05-30T18:04:06.927 [INFO] Apache Beam :: SDKs :: Java :: Extensions .......... SKIPPED
2017-05-30T18:04:06.927 [INFO] Apache Beam :: SDKs :: Java :: Extensions :: Google Cloud Platform
Core SKIPPED
2017-05-30T18:04:06.927 [INFO] Apache Beam :: SDKs :: Java :: Extensions :: Protobuf SKIPPED
2017-05-30T18:04:06.927 [INFO] Apache Beam :: SDKs :: Java :: IO :: Google Cloud Platform
SKIPPED
2017-05-30T18:04:06.927 [INFO] Apache Beam :: SDKs :: Java :: IO :: Hadoop Common . SKIPPED
2017-05-30T18:04:06.927 [INFO] Apache Beam :: SDKs :: Java :: IO :: Hadoop File System SKIPPED
2017-05-30T18:04:06.927 [INFO] Apache Beam :: SDKs :: Java :: IO :: Hadoop ........ SKIPPED
2017-05-30T18:04:06.927 [INFO] Apache Beam :: SDKs :: Java :: IO :: Hadoop :: input-format
SKIPPED
2017-05-30T18:04:06.927 [INFO] Apache Beam :: SDKs :: Java :: IO :: Hadoop :: jdk1.8-tests
SKIPPED
2017-05-30T18:04:06.943 [INFO] Apache Beam :: SDKs :: Java :: IO :: HBase ......... SKIPPED
2017-05-30T18:04:06.943 [INFO] Apache Beam :: SDKs :: Java :: IO :: JDBC .......... SKIPPED
2017-05-30T18:04:06.943 [INFO] Apache Beam :: SDKs :: Java :: IO :: JMS ........... SKIPPED
2017-05-30T18:04:06.943 [INFO] Apache Beam :: SDKs :: Java :: IO :: Kafka ......... SKIPPED
2017-05-30T18:04:06.943 [INFO] Apache Beam :: SDKs :: Java :: IO :: Kinesis ....... SKIPPED
2017-05-30T18:04:06.943 [INFO] Apache Beam :: SDKs :: Java :: IO :: MongoDB ....... SKIPPED
2017-05-30T18:04:06.943 [INFO] Apache Beam :: SDKs :: Java :: IO :: MQTT .......... SKIPPED
2017-05-30T18:04:06.943 [INFO] Apache Beam :: SDKs :: Java :: IO :: XML ........... SKIPPED
2017-05-30T18:04:06.943 [INFO] Apache Beam :: SDKs :: Java :: Maven Archetypes .... SKIPPED
2017-05-30T18:04:06.943 [INFO] Apache Beam :: SDKs :: Java :: Maven Archetypes :: Starter
SKIPPED
2017-05-30T18:04:06.943 [INFO] Apache Beam :: SDKs :: Java :: Extensions :: Jackson SKIPPED
2017-05-30T18:04:06.943 [INFO] Apache Beam :: SDKs :: Java :: Extensions :: Join library SKIPPED
2017-05-30T18:04:06.943 [INFO] Apache Beam :: SDKs :: Java :: Extensions :: Sorter  SKIPPED
2017-05-30T18:04:06.943 [INFO] Apache Beam :: Runners :: Google Cloud Dataflow .... SKIPPED
2017-05-30T18:04:06.943 [INFO] Apache Beam :: SDKs :: Java :: Harness ............. SKIPPED
2017-05-30T18:04:06.943 [INFO] Apache Beam :: SDKs :: Java :: Java 8 Tests ........ SKIPPED
2017-05-30T18:04:06.943 [INFO] Apache Beam :: SDKs :: Python ...................... SKIPPED
2017-05-30T18:04:06.943 [INFO] Apache Beam :: Runners :: Flink .................... SKIPPED
2017-05-30T18:04:06.943 [INFO] Apache Beam :: Runners :: Spark .................... SKIPPED
2017-05-30T18:04:06.943 [INFO] Apache Beam :: Runners :: Apex ..................... SKIPPED
2017-05-30T18:04:06.943 [INFO] Apache Beam :: Examples ............................ SKIPPED
2017-05-30T18:04:06.943 [INFO] Apache Beam :: Examples :: Java .................... SKIPPED
2017-05-30T18:04:06.943 [INFO] Apache Beam :: Examples :: Java 8 .................. SKIPPED
2017-05-30T18:04:06.943 [INFO] Apache Beam :: SDKs :: Java :: Aggregated Javadoc .. SKIPPED
2017-05-30T18:04:06.943 [INFO] ------------------------------------------------------------------------
2017-05-30T18:04:06.943 [INFO] BUILD FAILURE
2017-05-30T18:04:06.943 [INFO] ------------------------------------------------------------------------
2017-05-30T18:04:06.943 [INFO] Total time: 03:08 min
2017-05-30T18:04:06.943 [INFO] Finished at: 2017-05-30T18:04:06+00:00
2017-05-30T18:04:07.458 [INFO] Final Memory: 106M/1333M
2017-05-30T18:04:07.458 [INFO] ------------------------------------------------------------------------
Waiting for Jenkins to finish collecting data
2017-05-30T18:04:17.099 [ERROR] Failed to execute goal org.xolstice.maven.plugins:protobuf-maven-plugin:0.5.0:compile-custom
(default) on project beam-sdks-common-fn-api: Unable to copy the file to F:\jenkins\jenkins-slave\workspace\beam_PostCommit_Java_MavenInstall_Windows\sdks\common\fn-api\target\protoc-plugins:
F:\jenkins\jenkins-slave\workspace\beam_PostCommit_Java_MavenInstall_Windows\sdks\common\fn-api\target\protoc-plugins\protoc-3.2.0-windows-x86_64.exe
(The process cannot access the file because it is being used by another process) -> [Help
1]
org.apache.maven.lifecycle.LifecycleExecutionException: Failed to execute goal org.xolstice.maven.plugins:protobuf-maven-plugin:0.5.0:compile-custom
(default) on project beam-sdks-common-fn-api: Unable to copy the file to F:\jenkins\jenkins-slave\workspace\beam_PostCommit_Java_MavenInstall_Windows\sdks\common\fn-api\target\protoc-plugins
	at org.apache.maven.lifecycle.internal.MojoExecutor.execute(MojoExecutor.java:216)
	at org.apache.maven.lifecycle.internal.MojoExecutor.execute(MojoExecutor.java:153)
	at org.apache.maven.lifecycle.internal.MojoExecutor.execute(MojoExecutor.java:145)
	at org.apache.maven.lifecycle.internal.LifecycleModuleBuilder.buildProject(LifecycleModuleBuilder.java:116)
	at org.apache.maven.lifecycle.internal.LifecycleModuleBuilder.buildProject(LifecycleModuleBuilder.java:80)
	at org.apache.maven.lifecycle.internal.builder.singlethreaded.SingleThreadedBuilder.build(SingleThreadedBuilder.java:51)
	at org.apache.maven.lifecycle.internal.LifecycleStarter.execute(LifecycleStarter.java:128)
	at org.apache.maven.DefaultMaven.doExecute(DefaultMaven.java:307)
	at org.apache.maven.DefaultMaven.doExecute(DefaultMaven.java:193)
	at org.apache.maven.DefaultMaven.execute(DefaultMaven.java:106)
	at org.jvnet.hudson.maven3.launcher.Maven33Launcher.main(Maven33Launcher.java:129)
	at sun.reflect.NativeMethodAccessorImpl.invoke0(Native Method)
	at sun.reflect.NativeMethodAccessorImpl.invoke(NativeMethodAccessorImpl.java:62)
	at sun.reflect.DelegatingMethodAccessorImpl.invoke(DelegatingMethodAccessorImpl.java:43)
	at java.lang.reflect.Method.invoke(Method.java:498)
	at org.codehaus.plexus.classworlds.launcher.Launcher.launchStandard(Launcher.java:330)
	at org.codehaus.plexus.classworlds.launcher.Launcher.launch(Launcher.java:238)
	at jenkins.maven3.agent.Maven33Main.launch(Maven33Main.java:176)
	at sun.reflect.NativeMethodAccessorImpl.invoke0(Native Method)
	at sun.reflect.NativeMethodAccessorImpl.invoke(NativeMethodAccessorImpl.java:62)
	at sun.reflect.DelegatingMethodAccessorImpl.invoke(DelegatingMethodAccessorImpl.java:43)
	at java.lang.reflect.Method.invoke(Method.java:498)
	at hudson.maven.Maven3Builder.call(Maven3Builder.java:139)
	at hudson.maven.Maven3Builder.call(Maven3Builder.java:70)
	at hudson.remoting.UserRequest.perform(UserRequest.java:120)
	at hudson.remoting.UserRequest.perform(UserRequest.java:48)
	at hudson.remoting.Request$2.run(Request.java:326)
	at hudson.remoting.InterceptingExecutorService$1.call(InterceptingExecutorService.java:68)
	at java.util.concurrent.FutureTask.run(FutureTask.java:266)
	at java.util.concurrent.ThreadPoolExecutor.runWorker(ThreadPoolExecutor.java:1142)
	at java.util.concurrent.ThreadPoolExecutor$Worker.run(ThreadPoolExecutor.java:617)
	at java.lang.Thread.run(Thread.java:745)
Caused by: org.apache.maven.plugin.MojoExecutionException: Unable to copy the file to F:\jenkins\jenkins-slave\workspace\beam_PostCommit_Java_MavenInstall_Windows\sdks\common\fn-api\target\protoc-plugins
	at org.xolstice.maven.plugin.protobuf.AbstractProtocMojo.resolveBinaryArtifact(AbstractProtocMojo.java:994)
	at org.xolstice.maven.plugin.protobuf.AbstractProtocMojo.execute(AbstractProtocMojo.java:489)
	at org.xolstice.maven.plugin.protobuf.AbstractProtocCompileMojo.execute(AbstractProtocCompileMojo.java:31)
	at org.apache.maven.plugin.DefaultBuildPluginManager.executeMojo(DefaultBuildPluginManager.java:134)
	at org.apache.maven.lifecycle.internal.MojoExecutor.execute(MojoExecutor.java:208)
	... 31 more
Caused by: java.io.FileNotFoundException: F:\jenkins\jenkins-slave\workspace\beam_PostCommit_Java_MavenInstall_Windows\sdks\common\fn-api\target\protoc-plugins\protoc-3.2.0-windows-x86_64.exe
(The process cannot access the file because it is being used by another process)
	at java.io.FileOutputStream.open0(Native Method)
	at java.io.FileOutputStream.open(FileOutputStream.java:270)
	at java.io.FileOutputStream.<init>(FileOutputStream.java:213)
	at java.io.FileOutputStream.<init>(FileOutputStream.java:162)
	at org.codehaus.plexus.util.FileUtils.doCopyFile(FileUtils.java:1104)
	at org.codehaus.plexus.util.FileUtils.copyFile(FileUtils.java:1085)
	at org.xolstice.maven.plugin.protobuf.AbstractProtocMojo.resolveBinaryArtifact(AbstractProtocMojo.java:992)
	... 35 more
2017-05-30T18:04:17.099 [ERROR] 
2017-05-30T18:04:17.099 [ERROR] Re-run Maven using the -X switch to enable full debug logging.
2017-05-30T18:04:17.099 [ERROR] 
2017-05-30T18:04:17.099 [ERROR] For more information about the errors and possible solutions,
please read the following articles:
2017-05-30T18:04:17.099 [ERROR] [Help 1] http://cwiki.apache.org/confluence/display/MAVEN/MojoExecutionException
2017-05-30T18:04:17.099 [ERROR] 
2017-05-30T18:04:17.099 [ERROR] After correcting the problems, you can resume the build with
the command
2017-05-30T18:04:17.099 [ERROR]   mvn <goals> -rf :beam-sdks-common-fn-api
channel stopped
Not sending mail to unregistered user github@nakomis.com
Not sending mail to unregistered user mingmxu@ebay.com
Not sending mail to unregistered user kirpichov@google.com
Not sending mail to unregistered user klk@google.com
Not sending mail to unregistered user aljoscha.krettek@gmail.com
Not sending mail to unregistered user sourabhbajaj@google.com
Not sending mail to unregistered user hepei.hp@alibaba-inc.com

Mime
View raw message