beam-commits mailing list archives

Site index · List index
Message view « Date » · « Thread »
Top « Date » · « Thread »
From Apache Jenkins Server <jenk...@builds.apache.org>
Subject Build failed in Jenkins: beam_PostCommit_Java_ValidatesRunner_Dataflow #3042
Date Fri, 05 May 2017 00:55:56 GMT
See <https://builds.apache.org/job/beam_PostCommit_Java_ValidatesRunner_Dataflow/3042/display/redirect>

------------------------------------------
[...truncated 1.86 MB...]
[INFO] Closing reader after reading 9 records.
[WARNING] ByteKeyRangeTracker{range=ByteKeyRange{startKey=[6b6579303030303030303030], endKey=[6b6579303030303030303039]},
position=[6b6579303030303030303038]}: Rejecting split request at [6b657930303030303030303402000000000000]
because it is not after current position [6b6579303030303030303038].
[INFO] Closing reader after reading 9 records.
[WARNING] ByteKeyRangeTracker{range=ByteKeyRange{startKey=[6b6579303030303030303030], endKey=[6b6579303030303030303039]},
position=[6b6579303030303030303038]}: Rejecting split request at [6b657930303030303030303402000000000000]
because it is not after current position [6b6579303030303030303038].
[INFO] Closing reader after reading 9 records.
[WARNING] ByteKeyRangeTracker{range=ByteKeyRange{startKey=[6b6579303030303030303030], endKey=[6b6579303030303030303039]},
position=[6b6579303030303030303038]}: Rejecting split request at [6b657930303030303030303402000000000000]
because it is not after current position [6b6579303030303030303038].
[INFO] Closing reader after reading 9 records.
[WARNING] ByteKeyRangeTracker{range=ByteKeyRange{startKey=[6b6579303030303030303030], endKey=[6b6579303030303030303039]},
position=[6b6579303030303030303038]}: Rejecting split request at [6b657930303030303030303402000000000000]
because it is not after current position [6b6579303030303030303038].
[INFO] Closing reader after reading 9 records.
[WARNING] ByteKeyRangeTracker{range=ByteKeyRange{startKey=[6b6579303030303030303030], endKey=[6b6579303030303030303039]},
position=[6b6579303030303030303038]}: Rejecting split request at [6b657930303030303030303402000000000000]
because it is not after current position [6b6579303030303030303038].
[INFO] Closing reader after reading 9 records.
[WARNING] ByteKeyRangeTracker{range=ByteKeyRange{startKey=[6b6579303030303030303030], endKey=[6b6579303030303030303039]},
position=[6b6579303030303030303038]}: Rejecting split request at [6b657930303030303030303402000000000000]
because it is not after current position [6b6579303030303030303038].
[INFO] Closing reader after reading 9 records.
[WARNING] ByteKeyRangeTracker{range=ByteKeyRange{startKey=[6b6579303030303030303030], endKey=[6b6579303030303030303039]},
position=[6b6579303030303030303038]}: Rejecting split request at [6b657930303030303030303402000000000000]
because it is not after current position [6b6579303030303030303038].
[INFO] Closing reader after reading 9 records.
[WARNING] ByteKeyRangeTracker{range=ByteKeyRange{startKey=[6b6579303030303030303030], endKey=[6b6579303030303030303039]},
position=[6b6579303030303030303038]}: Rejecting split request at [6b657930303030303030303402000000000000]
because it is not after current position [6b6579303030303030303038].
[INFO] Closing reader after reading 9 records.
[WARNING] ByteKeyRangeTracker{range=ByteKeyRange{startKey=[6b6579303030303030303030], endKey=[6b6579303030303030303039]},
position=[6b6579303030303030303038]}: Rejecting split request at [6b657930303030303030303402000000000000]
because it is not after current position [6b6579303030303030303038].
[INFO] Closing reader after reading 9 records.
[WARNING] ByteKeyRangeTracker{range=ByteKeyRange{startKey=[6b6579303030303030303030], endKey=[6b6579303030303030303039]},
position=[6b6579303030303030303038]}: Rejecting split request at [6b657930303030303030303402000000000000]
because it is not after current position [6b6579303030303030303038].
[INFO] Closing reader after reading 9 records.
[WARNING] ByteKeyRangeTracker{range=ByteKeyRange{startKey=[6b6579303030303030303030], endKey=[6b6579303030303030303039]},
position=[6b6579303030303030303038]}: Rejecting split request at [6b657930303030303030303402000000000000]
because it is not after current position [6b6579303030303030303038].
[INFO] Closing reader after reading 9 records.
[WARNING] ByteKeyRangeTracker{range=ByteKeyRange{startKey=[6b6579303030303030303030], endKey=[6b6579303030303030303039]},
position=[6b6579303030303030303038]}: Rejecting split request at [6b657930303030303030303402000000000000]
because it is not after current position [6b6579303030303030303038].
[INFO] Closing reader after reading 9 records.
[WARNING] ByteKeyRangeTracker{range=ByteKeyRange{startKey=[6b6579303030303030303030], endKey=[6b6579303030303030303039]},
position=[6b6579303030303030303038]}: Rejecting split request at [6b657930303030303030303402000000000000]
because it is not after current position [6b6579303030303030303038].
[INFO] Closing reader after reading 9 records.
[WARNING] ByteKeyRangeTracker{range=ByteKeyRange{startKey=[6b6579303030303030303030], endKey=[6b6579303030303030303039]},
position=[6b6579303030303030303038]}: Rejecting split request at [6b657930303030303030303402000000000000]
because it is not after current position [6b6579303030303030303038].
[INFO] Closing reader after reading 9 records.
[WARNING] ByteKeyRangeTracker{range=ByteKeyRange{startKey=[6b6579303030303030303030], endKey=[6b6579303030303030303039]},
position=[6b6579303030303030303038]}: Rejecting split request at [6b657930303030303030303402000000000000]
because it is not after current position [6b6579303030303030303038].
[INFO] Closing reader after reading 9 records.
[WARNING] ByteKeyRangeTracker{range=ByteKeyRange{startKey=[6b6579303030303030303030], endKey=[6b6579303030303030303039]},
position=[6b6579303030303030303038]}: Rejecting split request at [6b657930303030303030303402000000000000]
because it is not after current position [6b6579303030303030303038].
[INFO] Closing reader after reading 9 records.
[WARNING] ByteKeyRangeTracker{range=ByteKeyRange{startKey=[6b6579303030303030303030], endKey=[6b6579303030303030303039]},
position=[6b6579303030303030303038]}: Rejecting split request at [6b657930303030303030303402000000000000]
because it is not after current position [6b6579303030303030303038].
[WARNING] After 101 concurrent splitting trials at item #5, observed only failure, giving
up on this item
[INFO] 505 total concurrent splitting trials for 9 items
[ERROR] At least 1 errors occurred writing to Bigtable. First 1 errors: 
Error mutating row KEY with mutations []: cell value missing
[INFO] About to split into bundles of size 5000 with sampleRowKeys length 10 first element
row_key: "key000000100"
offset_bytes: 10000

[INFO] Generated 20 splits. First split: BigtableSource{tableId=TEST-MANY-ROWS-SPLITS-TABLE,
filter=null, range=ByteKeyRange{startKey=[], endKey=[35b2bc981818181818189818]}, estimatedSizeBytes=5000}
[INFO] Closing reader after reading 1000 records.
[INFO] Closing reader after reading 0 records.
[INFO] Closing reader after reading 100 records.
[INFO] Closing reader after reading 100 records.
[INFO] Closing reader after reading 0 records.
[INFO] Closing reader after reading 100 records.
[INFO] Closing reader after reading 0 records.
[INFO] Closing reader after reading 100 records.
[INFO] Closing reader after reading 0 records.
[INFO] Closing reader after reading 100 records.
[INFO] Closing reader after reading 0 records.
[INFO] Closing reader after reading 100 records.
[INFO] Closing reader after reading 0 records.
[INFO] Closing reader after reading 100 records.
[INFO] Closing reader after reading 0 records.
[INFO] Closing reader after reading 100 records.
[INFO] Closing reader after reading 0 records.
[INFO] Closing reader after reading 100 records.
[INFO] Closing reader after reading 0 records.
[INFO] Closing reader after reading 100 records.
[INFO] Closing reader after reading 0 records.
[INFO] Wrote 1 records
[INFO] Closing reader after reading 100 records.
[INFO] Enabling the use of null credentials. This should not be used in production.
2017-05-05T00:55:13.998 [INFO] Tests run: 27, Failures: 0, Errors: 0, Skipped: 0, Time elapsed:
6.401 s - in org.apache.beam.sdk.io.gcp.bigtable.BigtableIOTest
2017-05-05T00:55:14.003 [INFO] Running org.apache.beam.sdk.io.gcp.datastore.DatastoreV1Test
[INFO] Latest stats timestamp for kind testKind is 1234000000
[INFO] Estimated size bytes for the query is: 1342177280
[INFO] Splitting the query into 20 splits
[WARNING] Failed to translate Gql query 'SELECT * from DummyKind LIMIT 10 LIMIT 0': invalid
query
[WARNING] User query might have a limit already set, so trying without zero limit
[INFO] Latest stats timestamp for kind testKind is 1234000000
[INFO] Splitting the query into 100 splits
2017-05-05T00:55:14.592 [INFO] Tests run: 56, Failures: 0, Errors: 0, Skipped: 0, Time elapsed:
0.579 s - in org.apache.beam.sdk.io.gcp.datastore.DatastoreV1Test
2017-05-05T00:55:14.595 [INFO] 
2017-05-05T00:55:14.595 [INFO] Results:
2017-05-05T00:55:14.595 [INFO] 
2017-05-05T00:55:14.596 [INFO] Tests run: 252, Failures: 0, Errors: 0, Skipped: 0
2017-05-05T00:55:14.596 [INFO] 
[JENKINS] Recording test results
2017-05-05T00:55:15.837 [INFO] 
2017-05-05T00:55:15.837 [INFO] --- build-helper-maven-plugin:3.0.0:regex-properties (render-artifact-id)
@ beam-sdks-java-io-google-cloud-platform ---
2017-05-05T00:55:15.977 [INFO] 
2017-05-05T00:55:15.977 [INFO] --- maven-jar-plugin:3.0.2:jar (default-jar) @ beam-sdks-java-io-google-cloud-platform
---
2017-05-05T00:55:16.048 [INFO] Building jar: <https://builds.apache.org/job/beam_PostCommit_Java_ValidatesRunner_Dataflow/ws/sdks/java/io/google-cloud-platform/target/beam-sdks-java-io-google-cloud-platform-0.7.0-SNAPSHOT.jar>
2017-05-05T00:55:16.169 [INFO] 
2017-05-05T00:55:16.169 [INFO] --- maven-site-plugin:3.5.1:attach-descriptor (attach-descriptor)
@ beam-sdks-java-io-google-cloud-platform ---
2017-05-05T00:55:16.283 [INFO] 
2017-05-05T00:55:16.283 [INFO] --- maven-jar-plugin:3.0.2:test-jar (default-test-jar) @ beam-sdks-java-io-google-cloud-platform
---
2017-05-05T00:55:16.312 [INFO] Building jar: <https://builds.apache.org/job/beam_PostCommit_Java_ValidatesRunner_Dataflow/ws/sdks/java/io/google-cloud-platform/target/beam-sdks-java-io-google-cloud-platform-0.7.0-SNAPSHOT-tests.jar>
2017-05-05T00:55:16.449 [INFO] 
2017-05-05T00:55:16.449 [INFO] --- maven-dependency-plugin:3.0.0:analyze-only (default) @
beam-sdks-java-io-google-cloud-platform ---
2017-05-05T00:55:16.651 [INFO] No dependency problems found
[JENKINS] Archiving disabled
2017-05-05T00:55:18.931 [INFO]                                                           
             
2017-05-05T00:55:18.931 [INFO] ------------------------------------------------------------------------
2017-05-05T00:55:18.931 [INFO] Building Apache Beam :: Runners :: Google Cloud Dataflow 0.7.0-SNAPSHOT
2017-05-05T00:55:18.931 [INFO] ------------------------------------------------------------------------
2017-05-05T00:55:18.977 [INFO] Downloading: https://repo.maven.apache.org/maven2/com/google/apis/google-api-services-dataflow/v1b3-rev196-1.22.0/google-api-services-dataflow-v1b3-rev196-1.22.0.pom
2017-05-05T00:55:19.011 [INFO] Downloaded: https://repo.maven.apache.org/maven2/com/google/apis/google-api-services-dataflow/v1b3-rev196-1.22.0/google-api-services-dataflow-v1b3-rev196-1.22.0.pom
(3 KB at 75.8 KB/sec)
2017-05-05T00:55:19.014 [INFO] Downloading: https://repo.maven.apache.org/maven2/com/google/apis/google-api-services-clouddebugger/v2-rev8-1.22.0/google-api-services-clouddebugger-v2-rev8-1.22.0.pom
2017-05-05T00:55:19.044 [INFO] Downloaded: https://repo.maven.apache.org/maven2/com/google/apis/google-api-services-clouddebugger/v2-rev8-1.22.0/google-api-services-clouddebugger-v2-rev8-1.22.0.pom
(3 KB at 86.4 KB/sec)
2017-05-05T00:55:19.084 [INFO] Downloading: https://repo.maven.apache.org/maven2/com/google/apis/google-api-services-dataflow/v1b3-rev196-1.22.0/google-api-services-dataflow-v1b3-rev196-1.22.0.jar
2017-05-05T00:55:19.115 [INFO] Downloading: https://repo.maven.apache.org/maven2/com/google/apis/google-api-services-clouddebugger/v2-rev8-1.22.0/google-api-services-clouddebugger-v2-rev8-1.22.0.jar
2017-05-05T00:55:19.152 [INFO] Downloaded: https://repo.maven.apache.org/maven2/com/google/apis/google-api-services-clouddebugger/v2-rev8-1.22.0/google-api-services-clouddebugger-v2-rev8-1.22.0.jar
(52 KB at 750.0 KB/sec)
2017-05-05T00:55:19.164 [INFO] Downloaded: https://repo.maven.apache.org/maven2/com/google/apis/google-api-services-dataflow/v1b3-rev196-1.22.0/google-api-services-dataflow-v1b3-rev196-1.22.0.jar
(187 KB at 1986.9 KB/sec)
2017-05-05T00:55:19.168 [INFO] 
2017-05-05T00:55:19.168 [INFO] --- maven-clean-plugin:3.0.0:clean (default-clean) @ beam-runners-google-cloud-dataflow-java
---
2017-05-05T00:55:19.189 [INFO] Deleting <https://builds.apache.org/job/beam_PostCommit_Java_ValidatesRunner_Dataflow/ws/runners/google-cloud-dataflow-java>
(includes = [**/*.pyc, **/*.egg-info/, **/sdks/python/LICENSE, **/sdks/python/NOTICE], excludes
= [])
2017-05-05T00:55:19.333 [INFO] 
2017-05-05T00:55:19.333 [INFO] --- maven-enforcer-plugin:1.4.1:enforce (enforce) @ beam-runners-google-cloud-dataflow-java
---
2017-05-05T00:55:21.732 [INFO] 
2017-05-05T00:55:21.735 [INFO] --- jacoco-maven-plugin:0.7.8:prepare-agent (default) @ beam-runners-google-cloud-dataflow-java
---
2017-05-05T00:55:21.738 [INFO] argLine set to -javaagent:<https://builds.apache.org/job/beam_PostCommit_Java_ValidatesRunner_Dataflow/ws/.repository/org/jacoco/org.jacoco.agent/0.7.8/org.jacoco.agent-0.7.8-runtime.jar=destfile=/home/jenkins/jenkins-slave/workspace/beam_PostCommit_Java_ValidatesRunner_Dataflow/runners/google-cloud-dataflow-java/target/jacoco.exec,excludes=**/AutoValue_*.class,dumponexit=true,output=file>
2017-05-05T00:55:21.828 [INFO] 
2017-05-05T00:55:21.828 [INFO] --- maven-remote-resources-plugin:1.5:process (process-resource-bundles)
@ beam-runners-google-cloud-dataflow-java ---
2017-05-05T00:55:23.942 [INFO] 
2017-05-05T00:55:23.942 [INFO] --- maven-resources-plugin:3.0.2:resources (default-resources)
@ beam-runners-google-cloud-dataflow-java ---
2017-05-05T00:55:23.945 [INFO] Using 'UTF-8' encoding to copy filtered resources.
2017-05-05T00:55:23.946 [INFO] Copying 1 resource
2017-05-05T00:55:23.979 [INFO] Copying 3 resources
2017-05-05T00:55:24.070 [INFO] 
2017-05-05T00:55:24.071 [INFO] --- maven-compiler-plugin:3.6.1:compile (default-compile) @
beam-runners-google-cloud-dataflow-java ---
2017-05-05T00:55:24.089 [INFO] Changes detected - recompiling the module!
2017-05-05T00:55:24.090 [INFO] Compiling 59 source files to <https://builds.apache.org/job/beam_PostCommit_Java_ValidatesRunner_Dataflow/ws/runners/google-cloud-dataflow-java/target/classes>
2017-05-05T00:55:28.329 [WARNING] bootstrap class path not set in conjunction with -source
1.7
2017-05-05T00:55:28.329 [WARNING] <https://builds.apache.org/job/beam_PostCommit_Java_ValidatesRunner_Dataflow/ws/runners/google-cloud-dataflow-java/src/main/java/org/apache/beam/runners/dataflow/internal/IsmFormat.java>:[113,31]
An @AutoValue property that is a primitive array returns the original array, which can therefore
be modified by the caller. If this OK, you can suppress this warning with @SuppressWarnings("mutable").
Otherwise, you should replace the property with an immutable type, perhaps a simple wrapper
around the original array.
2017-05-05T00:55:28.330 [INFO] <https://builds.apache.org/job/beam_PostCommit_Java_ValidatesRunner_Dataflow/ws/runners/google-cloud-dataflow-java/src/main/java/org/apache/beam/runners/dataflow/ReshuffleOverrideFactory.java>:
Some input files use or override a deprecated API.
2017-05-05T00:55:28.330 [INFO] <https://builds.apache.org/job/beam_PostCommit_Java_ValidatesRunner_Dataflow/ws/runners/google-cloud-dataflow-java/src/main/java/org/apache/beam/runners/dataflow/ReshuffleOverrideFactory.java>:
Recompile with -Xlint:deprecation for details.
2017-05-05T00:55:28.330 [INFO] <https://builds.apache.org/job/beam_PostCommit_Java_ValidatesRunner_Dataflow/ws/runners/google-cloud-dataflow-java/src/main/java/org/apache/beam/runners/dataflow/util/CloudObjects.java>:
Some input files use unchecked or unsafe operations.
2017-05-05T00:55:28.330 [INFO] <https://builds.apache.org/job/beam_PostCommit_Java_ValidatesRunner_Dataflow/ws/runners/google-cloud-dataflow-java/src/main/java/org/apache/beam/runners/dataflow/util/CloudObjects.java>:
Recompile with -Xlint:unchecked for details.
2017-05-05T00:55:28.425 [INFO] 
2017-05-05T00:55:28.425 [INFO] --- maven-resources-plugin:3.0.2:testResources (default-testResources)
@ beam-runners-google-cloud-dataflow-java ---
2017-05-05T00:55:28.427 [INFO] Using 'UTF-8' encoding to copy filtered resources.
2017-05-05T00:55:28.427 [INFO] skip non existing resourceDirectory <https://builds.apache.org/job/beam_PostCommit_Java_ValidatesRunner_Dataflow/ws/runners/google-cloud-dataflow-java/src/test/resources>
2017-05-05T00:55:28.427 [INFO] Copying 3 resources
2017-05-05T00:55:28.482 [INFO] 
2017-05-05T00:55:28.483 [INFO] --- maven-compiler-plugin:3.6.1:testCompile (default-testCompile)
@ beam-runners-google-cloud-dataflow-java ---
2017-05-05T00:55:28.544 [INFO] Changes detected - recompiling the module!
2017-05-05T00:55:28.544 [INFO] Compiling 23 source files to <https://builds.apache.org/job/beam_PostCommit_Java_ValidatesRunner_Dataflow/ws/runners/google-cloud-dataflow-java/target/test-classes>
2017-05-05T00:55:32.150 [INFO] <https://builds.apache.org/job/beam_PostCommit_Java_ValidatesRunner_Dataflow/ws/runners/google-cloud-dataflow-java/src/test/java/org/apache/beam/runners/dataflow/DataflowMetricsTest.java>:
Some input files use or override a deprecated API.
2017-05-05T00:55:32.153 [INFO] <https://builds.apache.org/job/beam_PostCommit_Java_ValidatesRunner_Dataflow/ws/runners/google-cloud-dataflow-java/src/test/java/org/apache/beam/runners/dataflow/DataflowMetricsTest.java>:
Recompile with -Xlint:deprecation for details.
2017-05-05T00:55:32.154 [INFO] <https://builds.apache.org/job/beam_PostCommit_Java_ValidatesRunner_Dataflow/ws/runners/google-cloud-dataflow-java/src/test/java/org/apache/beam/runners/dataflow/DataflowMetricsTest.java>:
Some input files use unchecked or unsafe operations.
2017-05-05T00:55:32.154 [INFO] <https://builds.apache.org/job/beam_PostCommit_Java_ValidatesRunner_Dataflow/ws/runners/google-cloud-dataflow-java/src/test/java/org/apache/beam/runners/dataflow/DataflowMetricsTest.java>:
Recompile with -Xlint:unchecked for details.
2017-05-05T00:55:32.249 [INFO] 
2017-05-05T00:55:32.249 [INFO] --- maven-checkstyle-plugin:2.17:check (default) @ beam-runners-google-cloud-dataflow-java
---
2017-05-05T00:55:38.263 [INFO] Starting audit...
[ERROR] <https://builds.apache.org/job/beam_PostCommit_Java_ValidatesRunner_Dataflow/ws/runners/google-cloud-dataflow-java/src/main/java/org/apache/beam/runners/dataflow/testing/TestDataflowRunner.java>:33:8:
Unused import: java.util.concurrent.Future. [UnusedImports]
Audit done.
2017-05-05T00:55:38.263 [INFO] There is 1 error reported by Checkstyle 6.19 with beam/checkstyle.xml
ruleset.
2017-05-05T00:55:38.267 [ERROR] src/main/java/org/apache/beam/runners/dataflow/testing/TestDataflowRunner.java:[33,8]
(imports) UnusedImports: Unused import: java.util.concurrent.Future.
[JENKINS] Archiving disabled
[JENKINS] Archiving disabled
[JENKINS] Archiving disabled
[JENKINS] Archiving disabled
[JENKINS] Archiving disabled
[JENKINS] Archiving disabled
[JENKINS] Archiving disabled
[JENKINS] Archiving disabled
[JENKINS] Archiving disabled
[JENKINS] Archiving disabled
[JENKINS] Archiving disabled
[JENKINS] Archiving disabled
[JENKINS] Archiving disabled
[JENKINS] Archiving disabled
[JENKINS] Archiving disabled
[JENKINS] Archiving disabled
[JENKINS] Archiving disabled
[JENKINS] Archiving disabled
2017-05-05T00:55:44.162 [INFO] ------------------------------------------------------------------------
2017-05-05T00:55:44.162 [INFO] Reactor Summary:
2017-05-05T00:55:44.162 [INFO] 
2017-05-05T00:55:44.162 [INFO] Apache Beam :: Parent .............................. SUCCESS
[ 28.185 s]
[JENKINS] Archiving disabled2017-05-05T00:55:44.162 [INFO] Apache Beam :: SDKs :: Java ::
Build Tools ......... SUCCESS [ 17.107 s]
2017-05-05T00:55:44.162 [INFO] Apache Beam :: SDKs ................................ SUCCESS
[  3.089 s]
2017-05-05T00:55:44.162 [INFO] Apache Beam :: SDKs :: Common ...................... SUCCESS
[  3.620 s]
2017-05-05T00:55:44.162 [INFO] Apache Beam :: SDKs :: Common :: Fn API ............ SUCCESS
[ 17.198 s]
2017-05-05T00:55:44.162 [INFO] Apache Beam :: SDKs :: Common :: Runner API ........ SUCCESS
[  5.773 s]
2017-05-05T00:55:44.162 [INFO] Apache Beam :: SDKs :: Java ........................ SUCCESS
[  3.610 s]
2017-05-05T00:55:44.162 [INFO] Apache Beam :: SDKs :: Java :: Core ................ SUCCESS
[02:17 min]
2017-05-05T00:55:44.162 [INFO] Apache Beam :: SDKs :: Java :: IO .................. SUCCESS
[  1.298 s]
2017-05-05T00:55:44.162 [INFO] Apache Beam :: Runners ............................. SUCCESS
[  1.375 s]
2017-05-05T00:55:44.162 [INFO] Apache Beam :: Runners :: Core Construction Java ... SUCCESS
[ 15.397 s]
2017-05-05T00:55:44.162 [INFO] Apache Beam :: Runners :: Core Java ................ SUCCESS
[ 36.293 s]
2017-05-05T00:55:44.162 [INFO] Apache Beam :: Runners :: Direct Java .............. SUCCESS
[04:44 min]
2017-05-05T00:55:44.162 [INFO] Apache Beam :: SDKs :: Java :: Extensions .......... SUCCESS
[  1.983 s]
2017-05-05T00:55:44.162 [INFO] Apache Beam :: SDKs :: Java :: Extensions :: Google Cloud Platform
Core SUCCESS [ 31.597 s]
2017-05-05T00:55:44.162 [INFO] Apache Beam :: SDKs :: Java :: Extensions :: Protobuf SUCCESS
[ 25.230 s]
2017-05-05T00:55:44.162 [INFO] Apache Beam :: SDKs :: Java :: IO :: Google Cloud Platform
SUCCESS [01:59 min]
2017-05-05T00:55:44.162 [INFO] Apache Beam :: Runners :: Google Cloud Dataflow .... FAILURE
[ 21.020 s]
2017-05-05T00:55:44.162 [INFO] ------------------------------------------------------------------------
2017-05-05T00:55:44.162 [INFO] BUILD FAILURE
2017-05-05T00:55:44.162 [INFO] ------------------------------------------------------------------------
2017-05-05T00:55:44.162 [INFO] Total time: 13:50 min
2017-05-05T00:55:44.163 [INFO] Finished at: 2017-05-05T00:55:44+00:00

2017-05-05T00:55:45.770 [INFO] Final Memory: 185M/1716M
2017-05-05T00:55:45.770 [INFO] ------------------------------------------------------------------------
Waiting for Jenkins to finish collecting data
2017-05-05T00:55:48.536 [ERROR] Failed to execute goal org.apache.maven.plugins:maven-checkstyle-plugin:2.17:check
(default) on project beam-runners-google-cloud-dataflow-java: You have 1 Checkstyle violation.
-> [Help 1]
org.apache.maven.lifecycle.LifecycleExecutionException: Failed to execute goal org.apache.maven.plugins:maven-checkstyle-plugin:2.17:check
(default) on project beam-runners-google-cloud-dataflow-java: You have 1 Checkstyle violation.
	at org.apache.maven.lifecycle.internal.MojoExecutor.execute(MojoExecutor.java:212)
	at org.apache.maven.lifecycle.internal.MojoExecutor.execute(MojoExecutor.java:153)
	at org.apache.maven.lifecycle.internal.MojoExecutor.execute(MojoExecutor.java:145)
	at org.apache.maven.lifecycle.internal.LifecycleModuleBuilder.buildProject(LifecycleModuleBuilder.java:116)
	at org.apache.maven.lifecycle.internal.LifecycleModuleBuilder.buildProject(LifecycleModuleBuilder.java:80)
	at org.apache.maven.lifecycle.internal.builder.singlethreaded.SingleThreadedBuilder.build(SingleThreadedBuilder.java:51)
	at org.apache.maven.lifecycle.internal.LifecycleStarter.execute(LifecycleStarter.java:128)
	at org.apache.maven.DefaultMaven.doExecute(DefaultMaven.java:307)
	at org.apache.maven.DefaultMaven.doExecute(DefaultMaven.java:193)
	at org.apache.maven.DefaultMaven.execute(DefaultMaven.java:106)
	at org.jvnet.hudson.maven3.launcher.Maven33Launcher.main(Maven33Launcher.java:129)
	at sun.reflect.NativeMethodAccessorImpl.invoke0(Native Method)
	at sun.reflect.NativeMethodAccessorImpl.invoke(NativeMethodAccessorImpl.java:62)
	at sun.reflect.DelegatingMethodAccessorImpl.invoke(DelegatingMethodAccessorImpl.java:43)
	at java.lang.reflect.Method.invoke(Method.java:498)
	at org.codehaus.plexus.classworlds.launcher.Launcher.launchStandard(Launcher.java:330)
	at org.codehaus.plexus.classworlds.launcher.Launcher.launch(Launcher.java:238)
	at jenkins.maven3.agent.Maven33Main.launch(Maven33Main.java:176)
	at sun.reflect.NativeMethodAccessorImpl.invoke0(Native Method)
	at sun.reflect.NativeMethodAccessorImpl.invoke(NativeMethodAccessorImpl.java:62)
	at sun.reflect.DelegatingMethodAccessorImpl.invoke(DelegatingMethodAccessorImpl.java:43)
	at java.lang.reflect.Method.invoke(Method.java:498)
	at hudson.maven.Maven3Builder.call(Maven3Builder.java:139)
	at hudson.maven.Maven3Builder.call(Maven3Builder.java:70)
	at hudson.remoting.UserRequest.perform(UserRequest.java:153)
	at hudson.remoting.UserRequest.perform(UserRequest.java:50)
	at hudson.remoting.Request$2.run(Request.java:336)
	at hudson.remoting.InterceptingExecutorService$1.call(InterceptingExecutorService.java:68)
	at java.util.concurrent.FutureTask.run(FutureTask.java:266)
	at java.util.concurrent.ThreadPoolExecutor.runWorker(ThreadPoolExecutor.java:1142)
	at java.util.concurrent.ThreadPoolExecutor$Worker.run(ThreadPoolExecutor.java:617)
	at java.lang.Thread.run(Thread.java:745)
Caused by: org.apache.maven.plugin.MojoFailureException: You have 1 Checkstyle violation.
	at org.apache.maven.plugin.checkstyle.CheckstyleViolationCheckMojo.execute(CheckstyleViolationCheckMojo.java:588)
	at org.apache.maven.plugin.DefaultBuildPluginManager.executeMojo(DefaultBuildPluginManager.java:134)
	at org.apache.maven.lifecycle.internal.MojoExecutor.execute(MojoExecutor.java:208)
	... 31 more
2017-05-05T00:55:48.537 [ERROR] 
2017-05-05T00:55:48.537 [ERROR] Re-run Maven using the -X switch to enable full debug logging.
2017-05-05T00:55:48.537 [ERROR] 
2017-05-05T00:55:48.537 [ERROR] For more information about the errors and possible solutions,
please read the following articles:
2017-05-05T00:55:48.537 [ERROR] [Help 1] http://cwiki.apache.org/confluence/display/MAVEN/MojoFailureException
2017-05-05T00:55:48.538 [ERROR] 
2017-05-05T00:55:48.538 [ERROR] After correcting the problems, you can resume the build with
the command
2017-05-05T00:55:48.538 [ERROR]   mvn <goals> -rf :beam-runners-google-cloud-dataflow-java
channel stopped

Mime
View raw message