beam-commits mailing list archives

Site index · List index
Message view « Date » · « Thread »
Top « Date » · « Thread »
From Apache Jenkins Server <jenk...@builds.apache.org>
Subject Build failed in Jenkins: beam_PostCommit_Java_MavenInstall #3966
Date Wed, 31 May 2017 01:03:47 GMT
See <https://builds.apache.org/job/beam_PostCommit_Java_MavenInstall/3966/display/redirect?page=changes>

Changes:

[altay] Clean up pyc files before running tests

------------------------------------------
[...truncated 3.07 MB...]
2017-05-31T01:02:26.354 [INFO] Downloaded: https://repo.maven.apache.org/maven2/org/apache/sling/org.apache.sling.commons.json/2.0.6/org.apache.sling.commons.json-2.0.6.jar
(47 KB at 34.5 KB/sec)
2017-05-31T01:02:26.354 [INFO] Downloading: https://repo.maven.apache.org/maven2/org/apache/flink/flink-runtime_2.10/1.2.1/flink-runtime_2.10-1.2.1-tests.jar
2017-05-31T01:02:26.458 [INFO] Downloaded: https://repo.maven.apache.org/maven2/org/apache/flink/flink-core/1.2.1/flink-core-1.2.1-tests.jar
(716 KB at 490.3 KB/sec)
2017-05-31T01:02:26.458 [INFO] Downloading: https://repo.maven.apache.org/maven2/org/apache/flink/flink-streaming-java_2.10/1.2.1/flink-streaming-java_2.10-1.2.1-tests.jar
2017-05-31T01:02:26.641 [INFO] Downloaded: https://repo.maven.apache.org/maven2/org/apache/flink/flink-streaming-java_2.10/1.2.1/flink-streaming-java_2.10-1.2.1-tests.jar
(953 KB at 580.0 KB/sec)
2017-05-31T01:02:26.641 [INFO] Downloading: https://repo.maven.apache.org/maven2/org/apache/flink/flink-test-utils_2.10/1.2.1/flink-test-utils_2.10-1.2.1.jar
2017-05-31T01:02:26.714 [INFO] Downloaded: https://repo.maven.apache.org/maven2/org/scala-lang/scala-library/2.10.4/scala-library-2.10.4.jar
(6960 KB at 4055.6 KB/sec)
2017-05-31T01:02:26.714 [INFO] Downloading: https://repo.maven.apache.org/maven2/org/apache/flink/flink-test-utils-junit/1.2.1/flink-test-utils-junit-1.2.1.jar
2017-05-31T01:02:26.744 [INFO] Downloaded: https://repo.maven.apache.org/maven2/org/apache/flink/flink-test-utils-junit/1.2.1/flink-test-utils-junit-1.2.1.jar
(24 KB at 13.2 KB/sec)
2017-05-31T01:02:26.744 [INFO] Downloading: https://repo.maven.apache.org/maven2/org/apache/curator/curator-test/2.8.0/curator-test-2.8.0.jar
2017-05-31T01:02:26.747 [INFO] Downloaded: https://repo.maven.apache.org/maven2/org/apache/flink/flink-streaming-java_2.10/1.2.1/flink-streaming-java_2.10-1.2.1.jar
(3035 KB at 1734.8 KB/sec)
2017-05-31T01:02:26.777 [INFO] Downloaded: https://repo.maven.apache.org/maven2/org/apache/curator/curator-test/2.8.0/curator-test-2.8.0.jar
(39 KB at 21.9 KB/sec)
2017-05-31T01:02:26.832 [INFO] Downloaded: https://repo.maven.apache.org/maven2/org/apache/flink/flink-runtime_2.10/1.2.1/flink-runtime_2.10-1.2.1-tests.jar
(2432 KB at 1325.9 KB/sec)
2017-05-31T01:02:26.894 [INFO] Downloaded: https://repo.maven.apache.org/maven2/org/apache/flink/flink-test-utils_2.10/1.2.1/flink-test-utils_2.10-1.2.1.jar
(2366 KB at 1247.7 KB/sec)
2017-05-31T01:02:27.302 [INFO] Downloaded: https://repo.maven.apache.org/maven2/org/apache/flink/flink-shaded-hadoop2/1.2.1/flink-shaded-hadoop2-1.2.1.jar
(17860 KB at 7751.5 KB/sec)
2017-05-31T01:02:27.318 [INFO] 
2017-05-31T01:02:27.318 [INFO] --- maven-clean-plugin:3.0.0:clean (default-clean) @ beam-runners-flink_2.10
---
2017-05-31T01:02:27.319 [INFO] Deleting <https://builds.apache.org/job/beam_PostCommit_Java_MavenInstall/ws/runners/flink>
(includes = [**/*.pyc, **/*.egg-info/, **/sdks/python/LICENSE, **/sdks/python/NOTICE, **/sdks/python/README.md],
excludes = [])
2017-05-31T01:02:27.372 [INFO] 
2017-05-31T01:02:27.372 [INFO] --- maven-enforcer-plugin:1.4.1:enforce (enforce) @ beam-runners-flink_2.10
---
2017-05-31T01:02:29.653 [INFO] 
2017-05-31T01:02:29.653 [INFO] --- maven-enforcer-plugin:1.4.1:enforce (enforce-banned-dependencies)
@ beam-runners-flink_2.10 ---
2017-05-31T01:02:29.720 [INFO] 
2017-05-31T01:02:29.720 [INFO] --- maven-remote-resources-plugin:1.5:process (process-resource-bundles)
@ beam-runners-flink_2.10 ---
2017-05-31T01:02:30.295 [INFO] 
2017-05-31T01:02:30.295 [INFO] --- maven-resources-plugin:3.0.2:resources (default-resources)
@ beam-runners-flink_2.10 ---
2017-05-31T01:02:30.296 [INFO] Using 'UTF-8' encoding to copy filtered resources.
2017-05-31T01:02:30.296 [INFO] Copying 1 resource
2017-05-31T01:02:30.297 [INFO] Copying 3 resources
2017-05-31T01:02:30.413 [INFO] 
2017-05-31T01:02:30.413 [INFO] --- maven-compiler-plugin:3.6.1:compile (default-compile) @
beam-runners-flink_2.10 ---
2017-05-31T01:02:30.433 [INFO] Changes detected - recompiling the module!
2017-05-31T01:02:30.433 [INFO] Compiling 75 source files to <https://builds.apache.org/job/beam_PostCommit_Java_MavenInstall/ws/runners/flink/target/classes>
2017-05-31T01:02:31.364 [WARNING] bootstrap class path not set in conjunction with -source
1.7
2017-05-31T01:02:31.364 [INFO] <https://builds.apache.org/job/beam_PostCommit_Java_MavenInstall/ws/runners/flink/src/main/java/org/apache/beam/runners/flink/FlinkStreamingTransformTranslators.java>:
Some input files use or override a deprecated API.
2017-05-31T01:02:31.364 [INFO] <https://builds.apache.org/job/beam_PostCommit_Java_MavenInstall/ws/runners/flink/src/main/java/org/apache/beam/runners/flink/FlinkStreamingTransformTranslators.java>:
Recompile with -Xlint:deprecation for details.
2017-05-31T01:02:31.364 [INFO] <https://builds.apache.org/job/beam_PostCommit_Java_MavenInstall/ws/runners/flink/src/main/java/org/apache/beam/runners/flink/translation/wrappers/streaming/state/FlinkKeyGroupStateInternals.java>:
Some input files use unchecked or unsafe operations.
2017-05-31T01:02:31.364 [INFO] <https://builds.apache.org/job/beam_PostCommit_Java_MavenInstall/ws/runners/flink/src/main/java/org/apache/beam/runners/flink/translation/wrappers/streaming/state/FlinkKeyGroupStateInternals.java>:
Recompile with -Xlint:unchecked for details.
2017-05-31T01:02:31.415 [INFO] 
2017-05-31T01:02:31.416 [INFO] --- maven-resources-plugin:3.0.2:testResources (default-testResources)
@ beam-runners-flink_2.10 ---
2017-05-31T01:02:31.417 [INFO] Using 'UTF-8' encoding to copy filtered resources.
2017-05-31T01:02:31.417 [INFO] Copying 1 resource
2017-05-31T01:02:31.417 [INFO] Copying 3 resources
2017-05-31T01:02:31.506 [INFO] 
2017-05-31T01:02:31.506 [INFO] --- maven-compiler-plugin:3.6.1:testCompile (default-testCompile)
@ beam-runners-flink_2.10 ---
2017-05-31T01:02:31.515 [INFO] Changes detected - recompiling the module!
2017-05-31T01:02:31.516 [INFO] Compiling 17 source files to <https://builds.apache.org/job/beam_PostCommit_Java_MavenInstall/ws/runners/flink/target/test-classes>
2017-05-31T01:02:32.077 [INFO] <https://builds.apache.org/job/beam_PostCommit_Java_MavenInstall/ws/runners/flink/src/test/java/org/apache/beam/runners/flink/streaming/FlinkKeyGroupStateInternalsTest.java>:
Some input files use unchecked or unsafe operations.
2017-05-31T01:02:32.077 [INFO] <https://builds.apache.org/job/beam_PostCommit_Java_MavenInstall/ws/runners/flink/src/test/java/org/apache/beam/runners/flink/streaming/FlinkKeyGroupStateInternalsTest.java>:
Recompile with -Xlint:unchecked for details.
2017-05-31T01:02:32.129 [INFO] 
2017-05-31T01:02:32.129 [INFO] --- maven-checkstyle-plugin:2.17:check (default) @ beam-runners-flink_2.10
---
2017-05-31T01:02:33.595 [INFO] Starting audit...
Audit done.
2017-05-31T01:02:33.648 [INFO] 
2017-05-31T01:02:33.648 [INFO] >>> findbugs-maven-plugin:3.0.4:check (default) >
:findbugs @ beam-runners-flink_2.10 >>>
2017-05-31T01:02:33.665 [INFO] 
2017-05-31T01:02:33.665 [INFO] --- findbugs-maven-plugin:3.0.4:findbugs (findbugs) @ beam-runners-flink_2.10
---
2017-05-31T01:02:33.671 [INFO] Fork Value is true
     [java] Warnings generated: 2
2017-05-31T01:02:49.524 [INFO] Done FindBugs Analysis....
2017-05-31T01:02:49.675 [INFO] 
2017-05-31T01:02:49.675 [INFO] <<< findbugs-maven-plugin:3.0.4:check (default) <
:findbugs @ beam-runners-flink_2.10 <<<
2017-05-31T01:02:49.675 [INFO] 
2017-05-31T01:02:49.675 [INFO] --- findbugs-maven-plugin:3.0.4:check (default) @ beam-runners-flink_2.10
---
2017-05-31T01:02:49.684 [INFO] BugInstance size is 2
2017-05-31T01:02:49.685 [INFO] Error size is 0
2017-05-31T01:02:49.687 [INFO] Total bugs: 2
2017-05-31T01:02:49.693 [INFO] Possible null pointer dereference of FlinkDoFnFunction.outputMap
in org.apache.beam.runners.flink.translation.functions.FlinkDoFnFunction.mapPartition(Iterable,
Collector) [org.apache.beam.runners.flink.translation.functions.FlinkDoFnFunction, org.apache.beam.runners.flink.translation.functions.FlinkDoFnFunction,
org.apache.beam.runners.flink.translation.functions.FlinkDoFnFunction] Dereferenced at FlinkDoFnFunction.java:[line
101]Null value at FlinkDoFnFunction.java:[line 93]Known null at FlinkDoFnFunction.java:[line
94] NP_NULL_ON_SOME_PATH
2017-05-31T01:02:49.693 [INFO] Possible null pointer dereference of FlinkStatefulDoFnFunction.outputMap
in org.apache.beam.runners.flink.translation.functions.FlinkStatefulDoFnFunction.reduce(Iterable,
Collector) [org.apache.beam.runners.flink.translation.functions.FlinkStatefulDoFnFunction,
org.apache.beam.runners.flink.translation.functions.FlinkStatefulDoFnFunction, org.apache.beam.runners.flink.translation.functions.FlinkStatefulDoFnFunction]
Dereferenced at FlinkStatefulDoFnFunction.java:[line 118]Null value at FlinkStatefulDoFnFunction.java:[line
94]Known null at FlinkStatefulDoFnFunction.java:[line 95] NP_NULL_ON_SOME_PATH
2017-05-31T01:02:49.694 [INFO] 


To see bug detail using the Findbugs GUI, use the following command "mvn findbugs:gui"



[JENKINS] Archiving disabled
2017-05-31T01:02:50.309 [INFO]                                                           
             
2017-05-31T01:02:50.309 [INFO] ------------------------------------------------------------------------
2017-05-31T01:02:50.309 [INFO] Skipping Apache Beam :: Parent
2017-05-31T01:02:50.309 [INFO] This project has been banned from the build due to previous
failures.
2017-05-31T01:02:50.309 [INFO] ------------------------------------------------------------------------
[JENKINS] Archiving disabled
[JENKINS] Archiving disabled
[JENKINS] Archiving disabled
[JENKINS] Archiving disabled
[JENKINS] Archiving disabled
[JENKINS] Archiving disabled
[JENKINS] Archiving disabled
[JENKINS] Archiving disabled
[JENKINS] Archiving disabled
[JENKINS] Archiving disabled
[JENKINS] Archiving disabled
[JENKINS] Archiving disabled
[JENKINS] Archiving disabled
[JENKINS] Archiving disabled
[JENKINS] Archiving disabled
[JENKINS] Archiving disabled
[JENKINS] Archiving disabled
[JENKINS] Archiving disabled
[JENKINS] Archiving disabled
[JENKINS] Archiving disabled
[JENKINS] Archiving disabled
[JENKINS] Archiving disabled
[JENKINS] Archiving disabled
[JENKINS] Archiving disabled
[JENKINS] Archiving disabled
[JENKINS] Archiving disabled
[JENKINS] Archiving disabled
[JENKINS] Archiving disabled
[JENKINS] Archiving disabled
[JENKINS] Archiving disabled
[JENKINS] Archiving disabled
[JENKINS] Archiving disabled
[JENKINS] Archiving disabled
[JENKINS] Archiving disabled
[JENKINS] Archiving disabled
[JENKINS] Archiving disabled
[JENKINS] Archiving disabled
[JENKINS] Archiving disabled
[JENKINS] Archiving disabled
[JENKINS] Archiving disabled
[JENKINS] Archiving disabled
[JENKINS] Archiving disabled
[JENKINS] Archiving disabled
[JENKINS] Archiving disabled
[JENKINS] Archiving disabled
[JENKINS] Archiving disabled
2017-05-31T01:03:17.504 [INFO] ------------------------------------------------------------------------
2017-05-31T01:03:17.504 [INFO] Reactor Summary:
2017-05-31T01:03:17.504 [INFO] 
2017-05-31T01:03:17.504 [INFO] Apache Beam :: Parent .............................. SUCCESS
[ 41.804 s]
2017-05-31T01:03:17.504 [INFO] Apache Beam :: SDKs :: Java :: Build Tools ......... SUCCESS
[ 18.746 s]
2017-05-31T01:03:17.504 [INFO] Apache Beam :: SDKs ................................ SUCCESS
[  5.315 s]
2017-05-31T01:03:17.504 [INFO] Apache Beam :: SDKs :: Common ...................... SUCCESS
[  2.364 s]
2017-05-31T01:03:17.504 [INFO] Apache Beam :: SDKs :: Common :: Fn API ............ SUCCESS
[ 32.669 s]
2017-05-31T01:03:17.504 [INFO] Apache Beam :: SDKs :: Common :: Runner API ........ SUCCESS
[ 21.907 s]
2017-05-31T01:03:17.504 [INFO] Apache Beam :: SDKs :: Java ........................ SUCCESS
[  2.234 s]
2017-05-31T01:03:17.504 [INFO] Apache Beam :: SDKs :: Java :: Core ................ SUCCESS
[03:08 min]
2017-05-31T01:03:17.504 [INFO] Apache Beam :: SDKs :: Java :: IO .................. SUCCESS
[  2.660 s]
2017-05-31T01:03:17.504 [INFO] Apache Beam :: SDKs :: Java :: IO :: Common ........ SUCCESS
[  8.207 s]
2017-05-31T01:03:17.504 [INFO] Apache Beam :: Runners ............................. SUCCESS
[  2.605 s]
2017-05-31T01:03:17.504 [INFO] Apache Beam :: Runners :: Core Construction Java ... SUCCESS
[ 46.828 s]
2017-05-31T01:03:17.504 [INFO] Apache Beam :: Runners :: Core Java ................ SUCCESS
[ 52.891 s]
2017-05-31T01:03:17.504 [INFO] Apache Beam :: Runners :: Direct Java .............. SUCCESS
[03:33 min]
2017-05-31T01:03:17.504 [INFO] Apache Beam :: SDKs :: Java :: IO :: Elasticsearch . SUCCESS
[ 47.271 s]
2017-05-31T01:03:17.504 [INFO] Apache Beam :: SDKs :: Java :: Extensions .......... SUCCESS
[  2.683 s]
2017-05-31T01:03:17.504 [INFO] Apache Beam :: SDKs :: Java :: Extensions :: Google Cloud Platform
Core SUCCESS [ 41.459 s]
2017-05-31T01:03:17.504 [INFO] Apache Beam :: SDKs :: Java :: Extensions :: Protobuf SUCCESS
[ 23.964 s]
2017-05-31T01:03:17.504 [INFO] Apache Beam :: SDKs :: Java :: IO :: Google Cloud Platform
SUCCESS [01:29 min]
2017-05-31T01:03:17.505 [INFO] Apache Beam :: SDKs :: Java :: IO :: Hadoop Common . SUCCESS
[ 25.421 s]
2017-05-31T01:03:17.505 [INFO] Apache Beam :: SDKs :: Java :: IO :: Hadoop File System SUCCESS
[ 45.336 s]
2017-05-31T01:03:17.505 [INFO] Apache Beam :: SDKs :: Java :: IO :: Hadoop ........ SUCCESS
[  4.932 s]
2017-05-31T01:03:17.505 [INFO] Apache Beam :: SDKs :: Java :: IO :: Hadoop :: input-format
SUCCESS [ 26.810 s]
2017-05-31T01:03:17.505 [INFO] Apache Beam :: Runners :: Google Cloud Dataflow .... SUCCESS
[06:14 min]
2017-05-31T01:03:17.505 [INFO] Apache Beam :: SDKs :: Java :: IO :: Hadoop :: jdk1.8-tests
SUCCESS [01:31 min]
2017-05-31T01:03:17.505 [INFO] Apache Beam :: SDKs :: Java :: IO :: HBase ......... SUCCESS
[01:16 min]
2017-05-31T01:03:17.505 [INFO] Apache Beam :: SDKs :: Java :: IO :: JDBC .......... SUCCESS
[ 29.208 s]
2017-05-31T01:03:17.505 [INFO] Apache Beam :: SDKs :: Java :: IO :: JMS ........... SUCCESS
[ 25.463 s]
2017-05-31T01:03:17.505 [INFO] Apache Beam :: SDKs :: Java :: IO :: Kafka ......... SUCCESS
[ 29.170 s]
2017-05-31T01:03:17.505 [INFO] Apache Beam :: SDKs :: Java :: IO :: Kinesis ....... SUCCESS
[ 29.395 s]
2017-05-31T01:03:17.505 [INFO] Apache Beam :: SDKs :: Java :: IO :: MongoDB ....... SUCCESS
[ 42.425 s]
2017-05-31T01:03:17.505 [INFO] Apache Beam :: SDKs :: Java :: IO :: MQTT .......... SUCCESS
[ 27.380 s]
2017-05-31T01:03:17.505 [INFO] Apache Beam :: SDKs :: Java :: IO :: XML ........... SUCCESS
[ 32.912 s]
2017-05-31T01:03:17.505 [INFO] Apache Beam :: SDKs :: Java :: Maven Archetypes .... SUCCESS
[  1.968 s]
2017-05-31T01:03:17.505 [INFO] Apache Beam :: SDKs :: Java :: Maven Archetypes :: Starter
SUCCESS [ 17.542 s]
2017-05-31T01:03:17.505 [INFO] Apache Beam :: Examples ............................ SUCCESS
[  4.501 s]
2017-05-31T01:03:17.505 [INFO] Apache Beam :: Examples :: Java .................... SUCCESS
[08:28 min]
2017-05-31T01:03:17.505 [INFO] Apache Beam :: SDKs :: Java :: Maven Archetypes :: Examples
SUCCESS [ 45.467 s]
2017-05-31T01:03:17.505 [INFO] Apache Beam :: Examples :: Java 8 .................. SUCCESS
[ 25.044 s]
2017-05-31T01:03:17.505 [INFO] Apache Beam :: SDKs :: Java :: Maven Archetypes :: Examples
- Java 8 SUCCESS [ 43.342 s]
2017-05-31T01:03:17.505 [INFO] Apache Beam :: SDKs :: Java :: Extensions :: Jackson SUCCESS
[ 20.309 s]
2017-05-31T01:03:17.505 [INFO] Apache Beam :: SDKs :: Java :: Extensions :: Join library SUCCESS
[ 20.093 s]
2017-05-31T01:03:17.505 [INFO] Apache Beam :: SDKs :: Java :: Extensions :: Sorter  SUCCESS
[ 48.998 s]
2017-05-31T01:03:17.505 [INFO] Apache Beam :: SDKs :: Java :: Harness ............. SUCCESS
[ 41.619 s]
2017-05-31T01:03:17.505 [INFO] Apache Beam :: SDKs :: Java :: Java 8 Tests ........ SUCCESS
[ 13.094 s]
2017-05-31T01:03:17.505 [INFO] Apache Beam :: SDKs :: Python ...................... SUCCESS
[29:07 min]
2017-05-31T01:03:17.505 [INFO] Apache Beam :: Runners :: Flink .................... FAILURE
[ 26.546 s]
2017-05-31T01:03:17.505 [INFO] Apache Beam :: Runners :: Spark .................... SKIPPED
2017-05-31T01:03:17.505 [INFO] Apache Beam :: Runners :: Apex ..................... SKIPPED
2017-05-31T01:03:17.505 [INFO] Apache Beam :: SDKs :: Java :: Aggregated Javadoc .. SKIPPED
2017-05-31T01:03:17.505 [INFO] ------------------------------------------------------------------------
2017-05-31T01:03:17.505 [INFO] BUILD FAILURE
2017-05-31T01:03:17.505 [INFO] ------------------------------------------------------------------------
2017-05-31T01:03:17.505 [INFO] Total time: 01:12 h
2017-05-31T01:03:17.505 [INFO] Finished at: 2017-05-31T01:03:17+00:00
2017-05-31T01:03:18.194 [INFO] Final Memory: 258M/1995M
2017-05-31T01:03:18.194 [INFO] ------------------------------------------------------------------------
Waiting for Jenkins to finish collecting data
2017-05-31T01:03:41.076 [ERROR] Failed to execute goal org.codehaus.mojo:findbugs-maven-plugin:3.0.4:check
(default) on project beam-runners-flink_2.10: failed with 2 bugs and 0 errors -> [Help
1]
org.apache.maven.lifecycle.LifecycleExecutionException: Failed to execute goal org.codehaus.mojo:findbugs-maven-plugin:3.0.4:check
(default) on project beam-runners-flink_2.10: failed with 2 bugs and 0 errors 
	at org.apache.maven.lifecycle.internal.MojoExecutor.execute(MojoExecutor.java:216)
	at org.apache.maven.lifecycle.internal.MojoExecutor.execute(MojoExecutor.java:153)
	at org.apache.maven.lifecycle.internal.MojoExecutor.execute(MojoExecutor.java:145)
	at org.apache.maven.lifecycle.internal.LifecycleModuleBuilder.buildProject(LifecycleModuleBuilder.java:116)
	at org.apache.maven.lifecycle.internal.LifecycleModuleBuilder.buildProject(LifecycleModuleBuilder.java:80)
	at org.apache.maven.lifecycle.internal.builder.singlethreaded.SingleThreadedBuilder.build(SingleThreadedBuilder.java:51)
	at org.apache.maven.lifecycle.internal.LifecycleStarter.execute(LifecycleStarter.java:128)
	at org.apache.maven.DefaultMaven.doExecute(DefaultMaven.java:307)
	at org.apache.maven.DefaultMaven.doExecute(DefaultMaven.java:193)
	at org.apache.maven.DefaultMaven.execute(DefaultMaven.java:106)
	at org.jvnet.hudson.maven3.launcher.Maven33Launcher.main(Maven33Launcher.java:129)
	at sun.reflect.NativeMethodAccessorImpl.invoke0(Native Method)
	at sun.reflect.NativeMethodAccessorImpl.invoke(NativeMethodAccessorImpl.java:62)
	at sun.reflect.DelegatingMethodAccessorImpl.invoke(DelegatingMethodAccessorImpl.java:43)
	at java.lang.reflect.Method.invoke(Method.java:498)
	at org.codehaus.plexus.classworlds.launcher.Launcher.launchStandard(Launcher.java:330)
	at org.codehaus.plexus.classworlds.launcher.Launcher.launch(Launcher.java:238)
	at jenkins.maven3.agent.Maven33Main.launch(Maven33Main.java:176)
	at sun.reflect.NativeMethodAccessorImpl.invoke0(Native Method)
	at sun.reflect.NativeMethodAccessorImpl.invoke(NativeMethodAccessorImpl.java:62)
	at sun.reflect.DelegatingMethodAccessorImpl.invoke(DelegatingMethodAccessorImpl.java:43)
	at java.lang.reflect.Method.invoke(Method.java:498)
	at hudson.maven.Maven3Builder.call(Maven3Builder.java:139)
	at hudson.maven.Maven3Builder.call(Maven3Builder.java:70)
	at hudson.remoting.UserRequest.perform(UserRequest.java:153)
	at hudson.remoting.UserRequest.perform(UserRequest.java:50)
	at hudson.remoting.Request$2.run(Request.java:336)
	at hudson.remoting.InterceptingExecutorService$1.call(InterceptingExecutorService.java:68)
	at java.util.concurrent.FutureTask.run(FutureTask.java:266)
	at java.util.concurrent.ThreadPoolExecutor.runWorker(ThreadPoolExecutor.java:1142)
	at java.util.concurrent.ThreadPoolExecutor$Worker.run(ThreadPoolExecutor.java:617)
	at java.lang.Thread.run(Thread.java:745)
Caused by: org.apache.maven.plugin.MojoExecutionException: failed with 2 bugs and 0 errors

	at sun.reflect.NativeConstructorAccessorImpl.newInstance0(Native Method)
	at sun.reflect.NativeConstructorAccessorImpl.newInstance(NativeConstructorAccessorImpl.java:62)
	at sun.reflect.DelegatingConstructorAccessorImpl.newInstance(DelegatingConstructorAccessorImpl.java:45)
	at java.lang.reflect.Constructor.newInstance(Constructor.java:423)
	at org.codehaus.groovy.reflection.CachedConstructor.invoke(CachedConstructor.java:83)
	at org.codehaus.groovy.reflection.CachedConstructor.doConstructorInvoke(CachedConstructor.java:77)
	at org.codehaus.groovy.runtime.callsite.ConstructorSite$ConstructorSiteNoUnwrap.callConstructor(ConstructorSite.java:84)
	at org.codehaus.groovy.runtime.callsite.CallSiteArray.defaultCallConstructor(CallSiteArray.java:60)
	at org.codehaus.groovy.runtime.callsite.AbstractCallSite.callConstructor(AbstractCallSite.java:235)
	at org.codehaus.groovy.runtime.callsite.AbstractCallSite.callConstructor(AbstractCallSite.java:247)
	at org.codehaus.mojo.findbugs.FindbugsViolationCheckMojo.execute(FindbugsViolationCheckMojo.groovy:529)
	at org.apache.maven.plugin.DefaultBuildPluginManager.executeMojo(DefaultBuildPluginManager.java:134)
	at org.apache.maven.lifecycle.internal.MojoExecutor.execute(MojoExecutor.java:208)
	... 31 more
2017-05-31T01:03:41.077 [ERROR] 
2017-05-31T01:03:41.077 [ERROR] Re-run Maven using the -X switch to enable full debug logging.
2017-05-31T01:03:41.077 [ERROR] 
2017-05-31T01:03:41.077 [ERROR] For more information about the errors and possible solutions,
please read the following articles:
2017-05-31T01:03:41.077 [ERROR] [Help 1] http://cwiki.apache.org/confluence/display/MAVEN/MojoExecutionException
2017-05-31T01:03:41.077 [ERROR] 
2017-05-31T01:03:41.077 [ERROR] After correcting the problems, you can resume the build with
the command
2017-05-31T01:03:41.077 [ERROR]   mvn <goals> -rf :beam-runners-flink_2.10
channel stopped
Not sending mail to unregistered user kirpichov@google.com
Not sending mail to unregistered user aljoscha.krettek@gmail.com

Mime
View raw message