beam-commits mailing list archives

Site index · List index
Message view « Date » · « Thread »
Top « Date » · « Thread »
From Apache Jenkins Server <jenk...@builds.apache.org>
Subject Build failed in Jenkins: beam_PostCommit_Java_MavenInstall_Windows #31
Date Sat, 20 May 2017 01:36:49 GMT
See <https://builds.apache.org/job/beam_PostCommit_Java_MavenInstall_Windows/31/display/redirect?page=changes>

Changes:

[kirpichov] Comply with byte limit for Datastore Commit.

[kirpichov] Make the large entities test neater.

[kirpichov] End-to-end test for large entity writes.

[lcwik] [BEAM-1345] Remove FileSystems.setDefaultConfigInWorkers since Dataflow

[lcwik] [BEAM-2293] Rename Top.{Largest,Smallest=>Natural,Reversed}

[lcwik] [BEAM-2253] Use resource transformer plugin to use versions defined in

[lcwik] [BEAM-2334] Fix OutOfMemoryError

------------------------------------------
[...truncated 355.26 KB...]
2017-05-20T01:35:56.078 [INFO] Downloading: https://repo.maven.apache.org/maven2/com/google/protobuf/protobuf-parent/3.2.0/protobuf-parent-3.2.0.pom
2017-05-20T01:35:56.086 [INFO] Downloaded: https://repo.maven.apache.org/maven2/com/google/protobuf/protobuf-parent/3.2.0/protobuf-parent-3.2.0.pom
(7 KB at 835.6 KB/sec)
2017-05-20T01:35:56.091 [INFO] Downloading: https://repo.maven.apache.org/maven2/io/grpc/grpc-core/1.2.0/grpc-core-1.2.0.pom
2017-05-20T01:35:56.103 [INFO] Downloaded: https://repo.maven.apache.org/maven2/io/grpc/grpc-core/1.2.0/grpc-core-1.2.0.pom
(3 KB at 216.7 KB/sec)
2017-05-20T01:35:56.106 [INFO] Downloading: https://repo.maven.apache.org/maven2/com/google/errorprone/error_prone_annotations/2.0.15/error_prone_annotations-2.0.15.pom
2017-05-20T01:35:56.117 [INFO] Downloaded: https://repo.maven.apache.org/maven2/com/google/errorprone/error_prone_annotations/2.0.15/error_prone_annotations-2.0.15.pom
(2 KB at 145.1 KB/sec)
2017-05-20T01:35:56.121 [INFO] Downloading: https://repo.maven.apache.org/maven2/com/google/errorprone/error_prone_parent/2.0.15/error_prone_parent-2.0.15.pom
2017-05-20T01:35:56.156 [INFO] Downloaded: https://repo.maven.apache.org/maven2/com/google/errorprone/error_prone_parent/2.0.15/error_prone_parent-2.0.15.pom
(6 KB at 143.0 KB/sec)
2017-05-20T01:35:56.161 [INFO] Downloading: https://repo.maven.apache.org/maven2/com/google/code/findbugs/jsr305/3.0.1/jsr305-3.0.1.pom
2017-05-20T01:35:56.172 [INFO] Downloaded: https://repo.maven.apache.org/maven2/com/google/code/findbugs/jsr305/3.0.1/jsr305-3.0.1.pom
(5 KB at 380.5 KB/sec)
2017-05-20T01:35:56.176 [INFO] Downloading: https://repo.maven.apache.org/maven2/io/grpc/grpc-context/1.2.0/grpc-context-1.2.0.pom
2017-05-20T01:35:56.188 [INFO] Downloaded: https://repo.maven.apache.org/maven2/io/grpc/grpc-context/1.2.0/grpc-context-1.2.0.pom
(2 KB at 142.3 KB/sec)
2017-05-20T01:35:56.191 [INFO] Downloading: https://repo.maven.apache.org/maven2/com/google/instrumentation/instrumentation-api/0.3.0/instrumentation-api-0.3.0.pom
2017-05-20T01:35:56.212 [INFO] Downloaded: https://repo.maven.apache.org/maven2/com/google/instrumentation/instrumentation-api/0.3.0/instrumentation-api-0.3.0.pom
(2 KB at 69.7 KB/sec)
2017-05-20T01:35:56.216 [INFO] Downloading: https://repo.maven.apache.org/maven2/io/grpc/grpc-protobuf/1.2.0/grpc-protobuf-1.2.0.pom
2017-05-20T01:35:56.226 [INFO] Downloaded: https://repo.maven.apache.org/maven2/io/grpc/grpc-protobuf/1.2.0/grpc-protobuf-1.2.0.pom
(3 KB at 259.3 KB/sec)
2017-05-20T01:35:56.231 [INFO] Downloading: https://repo.maven.apache.org/maven2/com/google/protobuf/protobuf-java-util/3.2.0/protobuf-java-util-3.2.0.pom
2017-05-20T01:35:56.244 [INFO] Downloaded: https://repo.maven.apache.org/maven2/com/google/protobuf/protobuf-java-util/3.2.0/protobuf-java-util-3.2.0.pom
(5 KB at 345.8 KB/sec)
2017-05-20T01:35:56.249 [INFO] Downloading: https://repo.maven.apache.org/maven2/com/google/code/gson/gson/2.7/gson-2.7.pom
2017-05-20T01:35:56.259 [INFO] Downloaded: https://repo.maven.apache.org/maven2/com/google/code/gson/gson/2.7/gson-2.7.pom
(2 KB at 141.1 KB/sec)
2017-05-20T01:35:56.263 [INFO] Downloading: https://repo.maven.apache.org/maven2/com/google/code/gson/gson-parent/2.7/gson-parent-2.7.pom
2017-05-20T01:35:56.274 [INFO] Downloaded: https://repo.maven.apache.org/maven2/com/google/code/gson/gson-parent/2.7/gson-parent-2.7.pom
(4 KB at 317.8 KB/sec)
2017-05-20T01:35:56.284 [INFO] Downloading: https://repo.maven.apache.org/maven2/io/grpc/grpc-protobuf-lite/1.2.0/grpc-protobuf-lite-1.2.0.pom
2017-05-20T01:35:56.295 [INFO] Downloaded: https://repo.maven.apache.org/maven2/io/grpc/grpc-protobuf-lite/1.2.0/grpc-protobuf-lite-1.2.0.pom
(3 KB at 188.6 KB/sec)
2017-05-20T01:35:56.300 [INFO] Downloading: https://repo.maven.apache.org/maven2/io/grpc/grpc-stub/1.2.0/grpc-stub-1.2.0.pom
2017-05-20T01:35:56.313 [INFO] Downloaded: https://repo.maven.apache.org/maven2/io/grpc/grpc-stub/1.2.0/grpc-stub-1.2.0.pom
(3 KB at 156.1 KB/sec)
2017-05-20T01:35:56.325 [INFO] Downloading: https://repo.maven.apache.org/maven2/com/google/protobuf/protobuf-java/3.2.0/protobuf-java-3.2.0.jar
2017-05-20T01:35:56.327 [INFO] Downloading: https://repo.maven.apache.org/maven2/io/grpc/grpc-core/1.2.0/grpc-core-1.2.0.jar
2017-05-20T01:35:56.327 [INFO] Downloading: https://repo.maven.apache.org/maven2/com/google/errorprone/error_prone_annotations/2.0.15/error_prone_annotations-2.0.15.jar
2017-05-20T01:35:56.328 [INFO] Downloading: https://repo.maven.apache.org/maven2/com/google/code/findbugs/jsr305/3.0.1/jsr305-3.0.1.jar
2017-05-20T01:35:56.330 [INFO] Downloading: https://repo.maven.apache.org/maven2/io/grpc/grpc-context/1.2.0/grpc-context-1.2.0.jar
2017-05-20T01:35:56.346 [INFO] Downloaded: https://repo.maven.apache.org/maven2/com/google/code/findbugs/jsr305/3.0.1/jsr305-3.0.1.jar
(20 KB at 927.4 KB/sec)
2017-05-20T01:35:56.346 [INFO] Downloading: https://repo.maven.apache.org/maven2/com/google/instrumentation/instrumentation-api/0.3.0/instrumentation-api-0.3.0.jar
2017-05-20T01:35:56.368 [INFO] Downloaded: https://repo.maven.apache.org/maven2/com/google/instrumentation/instrumentation-api/0.3.0/instrumentation-api-0.3.0.jar
(30 KB at 704.1 KB/sec)
2017-05-20T01:35:56.368 [INFO] Downloading: https://repo.maven.apache.org/maven2/io/grpc/grpc-protobuf/1.2.0/grpc-protobuf-1.2.0.jar
2017-05-20T01:35:56.380 [INFO] Downloaded: https://repo.maven.apache.org/maven2/io/grpc/grpc-protobuf/1.2.0/grpc-protobuf-1.2.0.jar
(4 KB at 73.4 KB/sec)
2017-05-20T01:35:56.380 [INFO] Downloading: https://repo.maven.apache.org/maven2/com/google/protobuf/protobuf-java-util/3.2.0/protobuf-java-util-3.2.0.jar
2017-05-20T01:35:56.397 [INFO] Downloaded: https://repo.maven.apache.org/maven2/com/google/errorprone/error_prone_annotations/2.0.15/error_prone_annotations-2.0.15.jar
(11 KB at 149.5 KB/sec)
2017-05-20T01:35:56.397 [INFO] Downloaded: https://repo.maven.apache.org/maven2/com/google/protobuf/protobuf-java-util/3.2.0/protobuf-java-util-3.2.0.jar
(66 KB at 929.2 KB/sec)
2017-05-20T01:35:56.397 [INFO] Downloading: https://repo.maven.apache.org/maven2/com/google/code/gson/gson/2.7/gson-2.7.jar
2017-05-20T01:35:56.397 [INFO] Downloading: https://repo.maven.apache.org/maven2/io/grpc/grpc-protobuf-lite/1.2.0/grpc-protobuf-lite-1.2.0.jar
2017-05-20T01:35:56.403 [INFO] Downloaded: https://repo.maven.apache.org/maven2/io/grpc/grpc-core/1.2.0/grpc-core-1.2.0.jar
(414 KB at 5305.2 KB/sec)
2017-05-20T01:35:56.403 [INFO] Downloading: https://repo.maven.apache.org/maven2/io/grpc/grpc-stub/1.2.0/grpc-stub-1.2.0.jar
2017-05-20T01:35:56.416 [INFO] Downloaded: https://repo.maven.apache.org/maven2/io/grpc/grpc-stub/1.2.0/grpc-stub-1.2.0.jar
(36 KB at 399.4 KB/sec)
2017-05-20T01:35:56.426 [INFO] Downloaded: https://repo.maven.apache.org/maven2/io/grpc/grpc-protobuf-lite/1.2.0/grpc-protobuf-lite-1.2.0.jar
(8 KB at 75.2 KB/sec)
2017-05-20T01:35:56.427 [INFO] Downloaded: https://repo.maven.apache.org/maven2/io/grpc/grpc-context/1.2.0/grpc-context-1.2.0.jar
(20 KB at 195.5 KB/sec)
2017-05-20T01:35:56.433 [INFO] Downloaded: https://repo.maven.apache.org/maven2/com/google/code/gson/gson/2.7/gson-2.7.jar
(227 KB at 2136.9 KB/sec)
2017-05-20T01:35:56.476 [INFO] Downloaded: https://repo.maven.apache.org/maven2/com/google/protobuf/protobuf-java/3.2.0/protobuf-java-3.2.0.jar
(1316 KB at 8654.9 KB/sec)
2017-05-20T01:35:56.493 [INFO] 
2017-05-20T01:35:56.493 [INFO] --- maven-clean-plugin:3.0.0:clean (default-clean) @ beam-sdks-common-fn-api
---
2017-05-20T01:35:56.499 [INFO] Deleting F:\jenkins\jenkins-slave\workspace\beam_PostCommit_Java_MavenInstall_Windows\sdks\common\fn-api
(includes = [**/*.pyc, **/*.egg-info/, **/sdks/python/LICENSE, **/sdks/python/NOTICE, **/sdks/python/README.md],
excludes = [])
2017-05-20T01:35:56.678 [INFO] 
2017-05-20T01:35:56.678 [INFO] --- maven-enforcer-plugin:1.4.1:enforce (enforce) @ beam-sdks-common-fn-api
---
2017-05-20T01:35:57.077 [INFO] 
2017-05-20T01:35:57.077 [INFO] --- maven-enforcer-plugin:1.4.1:enforce (enforce-banned-dependencies)
@ beam-sdks-common-fn-api ---
2017-05-20T01:35:57.262 [INFO] 
2017-05-20T01:35:57.262 [INFO] --- protobuf-maven-plugin:0.5.0:compile (default) @ beam-sdks-common-fn-api
---
2017-05-20T01:35:57.268 [INFO] Downloading: https://repo.maven.apache.org/maven2/com/google/guava/guava/18.0/guava-18.0.pom
2017-05-20T01:35:57.281 [INFO] Downloaded: https://repo.maven.apache.org/maven2/com/google/guava/guava/18.0/guava-18.0.pom
(6 KB at 425.6 KB/sec)
2017-05-20T01:35:57.285 [INFO] Downloading: https://repo.maven.apache.org/maven2/com/google/guava/guava-parent/18.0/guava-parent-18.0.pom
2017-05-20T01:35:57.294 [INFO] Downloaded: https://repo.maven.apache.org/maven2/com/google/guava/guava-parent/18.0/guava-parent-18.0.pom
(8 KB at 834.0 KB/sec)
2017-05-20T01:35:57.301 [INFO] Downloading: https://repo.maven.apache.org/maven2/org/apache/maven/plugin-tools/maven-plugin-annotations/3.4/maven-plugin-annotations-3.4.pom
2017-05-20T01:35:57.311 [INFO] Downloaded: https://repo.maven.apache.org/maven2/org/apache/maven/plugin-tools/maven-plugin-annotations/3.4/maven-plugin-annotations-3.4.pom
(2 KB at 159.1 KB/sec)
2017-05-20T01:35:57.336 [INFO] Downloading: https://repo.maven.apache.org/maven2/com/google/guava/guava/18.0/guava-18.0.jar
2017-05-20T01:35:57.337 [INFO] Downloading: https://repo.maven.apache.org/maven2/org/apache/maven/plugin-tools/maven-plugin-annotations/3.4/maven-plugin-annotations-3.4.jar
2017-05-20T01:35:57.358 [INFO] Downloaded: https://repo.maven.apache.org/maven2/org/apache/maven/plugin-tools/maven-plugin-annotations/3.4/maven-plugin-annotations-3.4.jar
(14 KB at 632.4 KB/sec)
2017-05-20T01:35:57.561 [INFO] Downloaded: https://repo.maven.apache.org/maven2/com/google/guava/guava/18.0/guava-18.0.jar
(2204 KB at 9749.3 KB/sec)
2017-05-20T01:35:57.768 [INFO] Downloading: https://repo.maven.apache.org/maven2/com/google/protobuf/protoc/3.2.0/protoc-3.2.0.pom
2017-05-20T01:35:57.776 [INFO] Downloaded: https://repo.maven.apache.org/maven2/com/google/protobuf/protoc/3.2.0/protoc-3.2.0.pom
(5 KB at 554.3 KB/sec)
2017-05-20T01:35:57.788 [INFO] Downloading: https://repo.maven.apache.org/maven2/com/google/protobuf/protoc/3.2.0/protoc-3.2.0-windows-x86_64.exe
2017-05-20T01:35:58.189 [INFO] Downloaded: https://repo.maven.apache.org/maven2/com/google/protobuf/protoc/3.2.0/protoc-3.2.0-windows-x86_64.exe
(4025 KB at 10037.4 KB/sec)
2017-05-20T01:35:58.212 [INFO] Compiling 1 proto file(s) to F:\jenkins\jenkins-slave\workspace\beam_PostCommit_Java_MavenInstall_Windows\sdks\common\fn-api\target\generated-sources\protobuf\java
2017-05-20T01:35:58.565 [INFO] 
2017-05-20T01:35:58.565 [INFO] --- protobuf-maven-plugin:0.5.0:compile-custom (default) @
beam-sdks-common-fn-api ---
[JENKINS] Archiving disabled
2017-05-20T01:36:00.119 [INFO]                                                           
             
2017-05-20T01:36:00.120 [INFO] ------------------------------------------------------------------------
2017-05-20T01:36:00.120 [INFO] Skipping Apache Beam :: Parent
2017-05-20T01:36:00.120 [INFO] This project has been banned from the build due to previous
failures.
2017-05-20T01:36:00.120 [INFO] ------------------------------------------------------------------------
[JENKINS] Archiving disabled
[JENKINS] Archiving disabled
[JENKINS] Archiving disabled
[JENKINS] Archiving disabled
[JENKINS] Archiving disabled
[JENKINS] Archiving disabled
[JENKINS] Archiving disabled
[JENKINS] Archiving disabled
[JENKINS] Archiving disabled
[JENKINS] Archiving disabled
[JENKINS] Archiving disabled
[JENKINS] Archiving disabled
[JENKINS] Archiving disabled
[JENKINS] Archiving disabled
[JENKINS] Archiving disabled
[JENKINS] Archiving disabled
[JENKINS] Archiving disabled
[JENKINS] Archiving disabled
[JENKINS] Archiving disabled
[JENKINS] Archiving disabled
[JENKINS] Archiving disabled
[JENKINS] Archiving disabled
[JENKINS] Archiving disabled
[JENKINS] Archiving disabled
[JENKINS] Archiving disabled
[JENKINS] Archiving disabled
[JENKINS] Archiving disabled
[JENKINS] Archiving disabled
[JENKINS] Archiving disabled
[JENKINS] Archiving disabled
[JENKINS] Archiving disabled
[JENKINS] Archiving disabled
[JENKINS] Archiving disabled
[JENKINS] Archiving disabled
[JENKINS] Archiving disabled
[JENKINS] Archiving disabled
[JENKINS] Archiving disabled
[JENKINS] Archiving disabled
[JENKINS] Archiving disabled
[JENKINS] Archiving disabled
[JENKINS] Archiving disabled
[JENKINS] Archiving disabled
[JENKINS] Archiving disabled
[JENKINS] Archiving disabled
[JENKINS] Archiving disabled
[JENKINS] Archiving disabled
[JENKINS] Archiving disabled
2017-05-20T01:36:26.233 [INFO] ------------------------------------------------------------------------
2017-05-20T01:36:26.233 [INFO] Reactor Summary:
2017-05-20T01:36:26.233 [INFO] 
2017-05-20T01:36:26.234 [INFO] Apache Beam :: Parent .............................. SUCCESS
[ 32.674 s]
2017-05-20T01:36:26.234 [INFO] Apache Beam :: SDKs :: Java :: Build Tools ......... SUCCESS
[ 17.829 s]
2017-05-20T01:36:26.234 [INFO] Apache Beam :: SDKs ................................ SUCCESS
[ 12.111 s]
2017-05-20T01:36:26.234 [INFO] Apache Beam :: SDKs :: Common ...................... SUCCESS
[  6.369 s]
2017-05-20T01:36:26.234 [INFO] Apache Beam :: SDKs :: Common :: Fn API ............ FAILURE
[  3.089 s]
2017-05-20T01:36:26.234 [INFO] Apache Beam :: SDKs :: Common :: Runner API ........ SKIPPED
2017-05-20T01:36:26.234 [INFO] Apache Beam :: SDKs :: Java ........................ SKIPPED
2017-05-20T01:36:26.234 [INFO] Apache Beam :: SDKs :: Java :: Core ................ SKIPPED
2017-05-20T01:36:26.234 [INFO] Apache Beam :: SDKs :: Java :: IO .................. SKIPPED
2017-05-20T01:36:26.234 [INFO] Apache Beam :: SDKs :: Java :: IO :: Common ........ SKIPPED
2017-05-20T01:36:26.234 [INFO] Apache Beam :: Runners ............................. SKIPPED
2017-05-20T01:36:26.235 [INFO] Apache Beam :: Runners :: Core Construction Java ... SKIPPED
2017-05-20T01:36:26.235 [INFO] Apache Beam :: Runners :: Core Java ................ SKIPPED
2017-05-20T01:36:26.235 [INFO] Apache Beam :: Runners :: Direct Java .............. SKIPPED
2017-05-20T01:36:26.235 [INFO] Apache Beam :: SDKs :: Java :: IO :: Elasticsearch . SKIPPED
2017-05-20T01:36:26.235 [INFO] Apache Beam :: SDKs :: Java :: Extensions .......... SKIPPED
2017-05-20T01:36:26.235 [INFO] Apache Beam :: SDKs :: Java :: Extensions :: Google Cloud Platform
Core SKIPPED
2017-05-20T01:36:26.235 [INFO] Apache Beam :: SDKs :: Java :: Extensions :: Protobuf SKIPPED
2017-05-20T01:36:26.235 [INFO] Apache Beam :: SDKs :: Java :: IO :: Google Cloud Platform
SKIPPED
2017-05-20T01:36:26.235 [INFO] Apache Beam :: SDKs :: Java :: IO :: Hadoop Common . SKIPPED
2017-05-20T01:36:26.235 [INFO] Apache Beam :: SDKs :: Java :: IO :: Hadoop File System SKIPPED
2017-05-20T01:36:26.235 [INFO] Apache Beam :: SDKs :: Java :: IO :: Hadoop ........ SKIPPED
2017-05-20T01:36:26.235 [INFO] Apache Beam :: SDKs :: Java :: IO :: Hadoop :: input-format
SKIPPED
2017-05-20T01:36:26.235 [INFO] Apache Beam :: SDKs :: Java :: IO :: Hadoop :: jdk1.8-tests
SKIPPED
2017-05-20T01:36:26.235 [INFO] Apache Beam :: SDKs :: Java :: IO :: HBase ......... SKIPPED
2017-05-20T01:36:26.235 [INFO] Apache Beam :: SDKs :: Java :: IO :: JDBC .......... SKIPPED
2017-05-20T01:36:26.235 [INFO] Apache Beam :: SDKs :: Java :: IO :: JMS ........... SKIPPED
2017-05-20T01:36:26.235 [INFO] Apache Beam :: SDKs :: Java :: IO :: Kafka ......... SKIPPED
2017-05-20T01:36:26.235 [INFO] Apache Beam :: SDKs :: Java :: IO :: Kinesis ....... SKIPPED
2017-05-20T01:36:26.235 [INFO] Apache Beam :: SDKs :: Java :: IO :: MongoDB ....... SKIPPED
2017-05-20T01:36:26.235 [INFO] Apache Beam :: SDKs :: Java :: IO :: MQTT .......... SKIPPED
2017-05-20T01:36:26.235 [INFO] Apache Beam :: SDKs :: Java :: IO :: XML ........... SKIPPED
2017-05-20T01:36:26.235 [INFO] Apache Beam :: SDKs :: Java :: Maven Archetypes .... SKIPPED
2017-05-20T01:36:26.235 [INFO] Apache Beam :: SDKs :: Java :: Maven Archetypes :: Starter
SKIPPED
2017-05-20T01:36:26.235 [INFO] Apache Beam :: SDKs :: Java :: Extensions :: Jackson SKIPPED
2017-05-20T01:36:26.235 [INFO] Apache Beam :: SDKs :: Java :: Extensions :: Join library SKIPPED
2017-05-20T01:36:26.235 [INFO] Apache Beam :: SDKs :: Java :: Extensions :: Sorter  SKIPPED
2017-05-20T01:36:26.235 [INFO] Apache Beam :: Runners :: Google Cloud Dataflow .... SKIPPED
2017-05-20T01:36:26.235 [INFO] Apache Beam :: SDKs :: Java :: Harness ............. SKIPPED
2017-05-20T01:36:26.235 [INFO] Apache Beam :: SDKs :: Java :: Java 8 Tests ........ SKIPPED
2017-05-20T01:36:26.235 [INFO] Apache Beam :: SDKs :: Python ...................... SKIPPED
2017-05-20T01:36:26.235 [INFO] Apache Beam :: Runners :: Flink .................... SKIPPED
2017-05-20T01:36:26.235 [INFO] Apache Beam :: Runners :: Spark .................... SKIPPED
2017-05-20T01:36:26.236 [INFO] Apache Beam :: Runners :: Apex ..................... SKIPPED
2017-05-20T01:36:26.236 [INFO] Apache Beam :: Examples ............................ SKIPPED
2017-05-20T01:36:26.236 [INFO] Apache Beam :: Examples :: Java .................... SKIPPED
2017-05-20T01:36:26.236 [INFO] Apache Beam :: Examples :: Java 8 .................. SKIPPED
2017-05-20T01:36:26.236 [INFO] Apache Beam :: SDKs :: Java :: Aggregated Javadoc .. SKIPPED
2017-05-20T01:36:26.236 [INFO] ------------------------------------------------------------------------
2017-05-20T01:36:26.236 [INFO] BUILD FAILURE
2017-05-20T01:36:26.236 [INFO] ------------------------------------------------------------------------
2017-05-20T01:36:26.236 [INFO] Total time: 02:06 min
2017-05-20T01:36:26.237 [INFO] Finished at: 2017-05-20T01:36:26+00:00
[JENKINS] Archiving disabled
2017-05-20T01:36:26.783 [INFO] Final Memory: 97M/1110M
2017-05-20T01:36:26.783 [INFO] ------------------------------------------------------------------------
2017-05-20T01:36:26.800 [ERROR] Failed to execute goal org.xolstice.maven.plugins:protobuf-maven-plugin:0.5.0:compile-custom
(default) on project beam-sdks-common-fn-api: Unable to copy the file to F:\jenkins\jenkins-slave\workspace\beam_PostCommit_Java_MavenInstall_Windows\sdks\common\fn-api\target\protoc-plugins:
F:\jenkins\jenkins-slave\workspace\beam_PostCommit_Java_MavenInstall_Windows\sdks\common\fn-api\target\protoc-plugins\protoc-3.2.0-windows-x86_64.exe
(The process cannot access the file because it is being used by another process) -> [Help
1]
org.apache.maven.lifecycle.LifecycleExecutionException: Failed to execute goal org.xolstice.maven.plugins:protobuf-maven-plugin:0.5.0:compile-custom
(default) on project beam-sdks-common-fn-api: Unable to copy the file to F:\jenkins\jenkins-slave\workspace\beam_PostCommit_Java_MavenInstall_Windows\sdks\common\fn-api\target\protoc-plugins
	at org.apache.maven.lifecycle.internal.MojoExecutor.execute(MojoExecutor.java:216)
	at org.apache.maven.lifecycle.internal.MojoExecutor.execute(MojoExecutor.java:153)
	at org.apache.maven.lifecycle.internal.MojoExecutor.execute(MojoExecutor.java:145)
	at org.apache.maven.lifecycle.internal.LifecycleModuleBuilder.buildProject(LifecycleModuleBuilder.java:116)
	at org.apache.maven.lifecycle.internal.LifecycleModuleBuilder.buildProject(LifecycleModuleBuilder.java:80)
	at org.apache.maven.lifecycle.internal.builder.singlethreaded.SingleThreadedBuilder.build(SingleThreadedBuilder.java:51)
	at org.apache.maven.lifecycle.internal.LifecycleStarter.execute(LifecycleStarter.java:128)
	at org.apache.maven.DefaultMaven.doExecute(DefaultMaven.java:307)
	at org.apache.maven.DefaultMaven.doExecute(DefaultMaven.java:193)
	at org.apache.maven.DefaultMaven.execute(DefaultMaven.java:106)
	at org.jvnet.hudson.maven3.launcher.Maven33Launcher.main(Maven33Launcher.java:129)
	at sun.reflect.NativeMethodAccessorImpl.invoke0(Native Method)
	at sun.reflect.NativeMethodAccessorImpl.invoke(NativeMethodAccessorImpl.java:62)
	at sun.reflect.DelegatingMethodAccessorImpl.invoke(DelegatingMethodAccessorImpl.java:43)
	at java.lang.reflect.Method.invoke(Method.java:498)
	at org.codehaus.plexus.classworlds.launcher.Launcher.launchStandard(Launcher.java:330)
	at org.codehaus.plexus.classworlds.launcher.Launcher.launch(Launcher.java:238)
	at jenkins.maven3.agent.Maven33Main.launch(Maven33Main.java:176)
	at sun.reflect.NativeMethodAccessorImpl.invoke0(Native Method)
	at sun.reflect.NativeMethodAccessorImpl.invoke(NativeMethodAccessorImpl.java:62)
	at sun.reflect.DelegatingMethodAccessorImpl.invoke(DelegatingMethodAccessorImpl.java:43)
	at java.lang.reflect.Method.invoke(Method.java:498)
	at hudson.maven.Maven3Builder.call(Maven3Builder.java:139)
	at hudson.maven.Maven3Builder.call(Maven3Builder.java:70)
	at hudson.remoting.UserRequest.perform(UserRequest.java:120)
	at hudson.remoting.UserRequest.perform(UserRequest.java:48)
	at hudson.remoting.Request$2.run(Request.java:326)
	at hudson.remoting.InterceptingExecutorService$1.call(InterceptingExecutorService.java:68)
	at java.util.concurrent.FutureTask.run(FutureTask.java:266)
	at java.util.concurrent.ThreadPoolExecutor.runWorker(ThreadPoolExecutor.java:1142)
	at java.util.concurrent.ThreadPoolExecutor$Worker.run(ThreadPoolExecutor.java:617)
	at java.lang.Thread.run(Thread.java:745)
Caused by: org.apache.maven.plugin.MojoExecutionException: Unable to copy the file to F:\jenkins\jenkins-slave\workspace\beam_PostCommit_Java_MavenInstall_Windows\sdks\common\fn-api\target\protoc-plugins
	at org.xolstice.maven.plugin.protobuf.AbstractProtocMojo.resolveBinaryArtifact(AbstractProtocMojo.java:994)
	at org.xolstice.maven.plugin.protobuf.AbstractProtocMojo.execute(AbstractProtocMojo.java:489)
	at org.xolstice.maven.plugin.protobuf.AbstractProtocCompileMojo.execute(AbstractProtocCompileMojo.java:31)
	at org.apache.maven.plugin.DefaultBuildPluginManager.executeMojo(DefaultBuildPluginManager.java:134)
	at org.apache.maven.lifecycle.internal.MojoExecutor.execute(MojoExecutor.java:208)
	... 31 more
Caused by: java.io.FileNotFoundException: F:\jenkins\jenkins-slave\workspace\beam_PostCommit_Java_MavenInstall_Windows\sdks\common\fn-api\target\protoc-plugins\protoc-3.2.0-windows-x86_64.exe
(The process cannot access the file because it is being used by another process)
	at java.io.FileOutputStream.open0(Native Method)
	at java.io.FileOutputStream.open(FileOutputStream.java:270)
	at java.io.FileOutputStream.<init>(FileOutputStream.java:213)
	at java.io.FileOutputStream.<init>(FileOutputStream.java:162)
	at org.codehaus.plexus.util.FileUtils.doCopyFile(FileUtils.java:1104)
	at org.codehaus.plexus.util.FileUtils.copyFile(FileUtils.java:1085)
	at org.xolstice.maven.plugin.protobuf.AbstractProtocMojo.resolveBinaryArtifact(AbstractProtocMojo.java:992)
	... 35 more
2017-05-20T01:36:26.801 [ERROR] 
2017-05-20T01:36:26.802 [ERROR] Re-run Maven using the -X switch to enable full debug logging.
2017-05-20T01:36:26.802 [ERROR] 
2017-05-20T01:36:26.802 [ERROR] For more information about the errors and possible solutions,
please read the following articles:
2017-05-20T01:36:26.802 [ERROR] [Help 1] http://cwiki.apache.org/confluence/display/MAVEN/MojoExecutionException
2017-05-20T01:36:26.802 [ERROR] 
2017-05-20T01:36:26.802 [ERROR] After correcting the problems, you can resume the build with
the command
2017-05-20T01:36:26.802 [ERROR]   mvn <goals> -rf :beam-sdks-common-fn-api
channel stopped
Not sending mail to unregistered user sourabhbajaj@google.com
Not sending mail to unregistered user klk@google.com
Not sending mail to unregistered user kirpichov@google.com
Not sending mail to unregistered user github@nakomis.com

Mime
View raw message