beam-commits mailing list archives

Site index · List index
Message view « Date » · « Thread »
Top « Date » · « Thread »
From Apache Jenkins Server <jenk...@builds.apache.org>
Subject Build failed in Jenkins: beam_PostCommit_Java_MavenInstall #3681
Date Sat, 06 May 2017 00:14:42 GMT
See <https://builds.apache.org/job/beam_PostCommit_Java_MavenInstall/3681/display/redirect?page=changes>

Changes:

[davor] Update archetype reference after changing version identifier

------------------------------------------
[...truncated 2.53 MB...]
2017-05-06T00:13:14.669 [INFO] Changes detected - recompiling the module!
2017-05-06T00:13:14.669 [INFO] Compiling 33 source files to <https://builds.apache.org/job/beam_PostCommit_Java_MavenInstall/ws/runners/apex/target/classes>
2017-05-06T00:13:15.793 [WARNING] bootstrap class path not set in conjunction with -source
1.7
2017-05-06T00:13:15.793 [INFO] <https://builds.apache.org/job/beam_PostCommit_Java_MavenInstall/ws/runners/apex/src/main/java/org/apache/beam/runners/apex/translation/utils/ValueAndCoderKryoSerializable.java>:
Some input files use or override a deprecated API.
2017-05-06T00:13:15.793 [INFO] <https://builds.apache.org/job/beam_PostCommit_Java_MavenInstall/ws/runners/apex/src/main/java/org/apache/beam/runners/apex/translation/utils/ValueAndCoderKryoSerializable.java>:
Recompile with -Xlint:deprecation for details.
2017-05-06T00:13:15.793 [INFO] <https://builds.apache.org/job/beam_PostCommit_Java_MavenInstall/ws/runners/apex/src/main/java/org/apache/beam/runners/apex/translation/CreateValuesTranslator.java>:
Some input files use unchecked or unsafe operations.
2017-05-06T00:13:15.793 [INFO] <https://builds.apache.org/job/beam_PostCommit_Java_MavenInstall/ws/runners/apex/src/main/java/org/apache/beam/runners/apex/translation/CreateValuesTranslator.java>:
Recompile with -Xlint:unchecked for details.
[WARNING] Cannot calculate digest of mojo class, because mojo wasn't loaded from a jar, but
from: <https://builds.apache.org/job/beam_PostCommit_Java_MavenInstall/ws/.repository/org/apache/maven/plugins/maven-compiler-plugin/3.6.1/maven-compiler-plugin-3.6.1.jar>
2017-05-06T00:13:15.884 [INFO] 
2017-05-06T00:13:15.884 [INFO] --- maven-dependency-plugin:3.0.0:tree (dependency-tree) @
beam-runners-apex ---
2017-05-06T00:13:15.930 [INFO] Wrote dependency tree to: <https://builds.apache.org/job/beam_PostCommit_Java_MavenInstall/ws/runners/apex/target/classes/org/apache/beam/runners/apex/dependency-tree>
[WARNING] Cannot calculate digest of mojo class, because mojo wasn't loaded from a jar, but
from: <https://builds.apache.org/job/beam_PostCommit_Java_MavenInstall/ws/.repository/org/apache/maven/plugins/maven-dependency-plugin/3.0.0/maven-dependency-plugin-3.0.0.jar>
2017-05-06T00:13:16.021 [INFO] 
2017-05-06T00:13:16.021 [INFO] --- maven-resources-plugin:3.0.2:testResources (default-testResources)
@ beam-runners-apex ---
2017-05-06T00:13:16.023 [INFO] Using 'UTF-8' encoding to copy filtered resources.
2017-05-06T00:13:16.023 [INFO] Copying 3 resources
2017-05-06T00:13:16.036 [INFO] Copying 3 resources
[WARNING] Cannot calculate digest of mojo class, because mojo wasn't loaded from a jar, but
from: <https://builds.apache.org/job/beam_PostCommit_Java_MavenInstall/ws/.repository/org/apache/maven/plugins/maven-resources-plugin/3.0.2/maven-resources-plugin-3.0.2.jar>
2017-05-06T00:13:16.112 [INFO] 
2017-05-06T00:13:16.112 [INFO] --- maven-compiler-plugin:3.6.1:testCompile (default-testCompile)
@ beam-runners-apex ---
2017-05-06T00:13:16.128 [INFO] Changes detected - recompiling the module!
2017-05-06T00:13:16.129 [INFO] Compiling 15 source files to <https://builds.apache.org/job/beam_PostCommit_Java_MavenInstall/ws/runners/apex/target/test-classes>
[WARNING] Cannot calculate digest of mojo class, because mojo wasn't loaded from a jar, but
from: <https://builds.apache.org/job/beam_PostCommit_Java_MavenInstall/ws/.repository/org/apache/maven/plugins/maven-compiler-plugin/3.6.1/maven-compiler-plugin-3.6.1.jar>
2017-05-06T00:13:17.393 [INFO] 
2017-05-06T00:13:17.393 [INFO] --- maven-checkstyle-plugin:2.17:check (default) @ beam-runners-apex
---
2017-05-06T00:13:18.265 [INFO] Starting audit...
Audit done.
[WARNING] Cannot calculate digest of mojo class, because mojo wasn't loaded from a jar, but
from: <https://builds.apache.org/job/beam_PostCommit_Java_MavenInstall/ws/.repository/org/apache/maven/plugins/maven-checkstyle-plugin/2.17/maven-checkstyle-plugin-2.17.jar>
2017-05-06T00:13:18.357 [INFO] 
2017-05-06T00:13:18.357 [INFO] >>> findbugs-maven-plugin:3.0.4:check (default) >
:findbugs @ beam-runners-apex >>>
2017-05-06T00:13:18.421 [INFO] 
2017-05-06T00:13:18.425 [INFO] --- findbugs-maven-plugin:3.0.4:findbugs (findbugs) @ beam-runners-apex
---
2017-05-06T00:13:18.429 [INFO] Fork Value is true
[WARNING] Cannot calculate digest of mojo class, because mojo wasn't loaded from a jar, but
from: <https://builds.apache.org/job/beam_PostCommit_Java_MavenInstall/ws/.repository/org/codehaus/mojo/findbugs-maven-plugin/3.0.4/findbugs-maven-plugin-3.0.4.jar>
[WARNING] Cannot calculate digest of mojo class, because mojo wasn't loaded from a jar, but
from: <https://builds.apache.org/job/beam_PostCommit_Java_MavenInstall/ws/.repository/org/codehaus/mojo/findbugs-maven-plugin/3.0.4/findbugs-maven-plugin-3.0.4.jar>
[WARNING] Cannot calculate digest of mojo class, because mojo wasn't loaded from a jar, but
from: <https://builds.apache.org/job/beam_PostCommit_Java_MavenInstall/ws/.repository/org/codehaus/mojo/findbugs-maven-plugin/3.0.4/findbugs-maven-plugin-3.0.4.jar>
[JENKINS] Archiving disabled
2017-05-06T00:13:19.132 [INFO]                                                           
             
2017-05-06T00:13:19.133 [INFO] ------------------------------------------------------------------------
2017-05-06T00:13:19.133 [INFO] Skipping Apache Beam :: Parent
2017-05-06T00:13:19.133 [INFO] This project has been banned from the build due to previous
failures.
2017-05-06T00:13:19.133 [INFO] ------------------------------------------------------------------------
[JENKINS] Archiving disabled
[JENKINS] Archiving disabled
[JENKINS] Archiving disabled
[JENKINS] Archiving disabled
[JENKINS] Archiving disabled
[JENKINS] Archiving disabled
[JENKINS] Archiving disabled
[JENKINS] Archiving disabled
[JENKINS] Archiving disabled
[JENKINS] Archiving disabled
[JENKINS] Archiving disabled
[JENKINS] Archiving disabled
[JENKINS] Archiving disabled
[JENKINS] Archiving disabled
[JENKINS] Archiving disabled
[JENKINS] Archiving disabled
[JENKINS] Archiving disabled
[JENKINS] Archiving disabled
[JENKINS] Archiving disabled
[JENKINS] Archiving disabled
[JENKINS] Archiving disabled
[JENKINS] Archiving disabled
[JENKINS] Archiving disabled
[JENKINS] Archiving disabled
[JENKINS] Archiving disabled
[JENKINS] Archiving disabled
[JENKINS] Archiving disabled
[JENKINS] Archiving disabled
[JENKINS] Archiving disabled
[JENKINS] Archiving disabled
[JENKINS] Archiving disabled
[JENKINS] Archiving disabled
[JENKINS] Archiving disabled
[JENKINS] Archiving disabled
[JENKINS] Archiving disabled
[JENKINS] Archiving disabled
[JENKINS] Archiving disabled
[JENKINS] Archiving disabled
[JENKINS] Archiving disabled
[JENKINS] Archiving disabled
[JENKINS] Archiving disabled
[JENKINS] Archiving disabled
[JENKINS] Archiving disabled
[JENKINS] Archiving disabled
[JENKINS] Archiving disabled
[JENKINS] Archiving disabled2017-05-06T00:13:45.657 [INFO] ------------------------------------------------------------------------
2017-05-06T00:13:45.657 [INFO] Reactor Summary:
2017-05-06T00:13:45.657 [INFO] 
2017-05-06T00:13:45.657 [INFO] Apache Beam :: Parent .............................. SUCCESS
[ 36.935 s]
2017-05-06T00:13:45.657 [INFO] Apache Beam :: SDKs :: Java :: Build Tools ......... SUCCESS
[ 15.975 s]
2017-05-06T00:13:45.657 [INFO] Apache Beam :: SDKs ................................ SUCCESS
[ 10.462 s]
2017-05-06T00:13:45.657 [INFO] Apache Beam :: SDKs :: Common ...................... SUCCESS
[  4.379 s]
2017-05-06T00:13:45.657 [INFO] Apache Beam :: SDKs :: Common :: Fn API ............ SUCCESS
[ 37.906 s]

2017-05-06T00:13:45.657 [INFO] Apache Beam :: SDKs :: Common :: Runner API ........ SUCCESS
[ 18.508 s]
2017-05-06T00:13:45.657 [INFO] Apache Beam :: SDKs :: Java ........................ SUCCESS
[  6.878 s]
2017-05-06T00:13:45.657 [INFO] Apache Beam :: SDKs :: Java :: Core ................ SUCCESS
[03:13 min]
2017-05-06T00:13:45.657 [INFO] Apache Beam :: SDKs :: Java :: IO .................. SUCCESS
[  1.698 s]
2017-05-06T00:13:45.657 [INFO] Apache Beam :: SDKs :: Java :: IO :: Common ........ SUCCESS
[  3.846 s]
2017-05-06T00:13:45.657 [INFO] Apache Beam :: Runners ............................. SUCCESS
[  1.701 s]
2017-05-06T00:13:45.657 [INFO] Apache Beam :: Runners :: Core Construction Java ... SUCCESS
[ 24.523 s]
2017-05-06T00:13:45.657 [INFO] Apache Beam :: Runners :: Core Java ................ SUCCESS
[ 50.848 s]
2017-05-06T00:13:45.657 [INFO] Apache Beam :: Runners :: Direct Java .............. SUCCESS
[03:09 min]
2017-05-06T00:13:45.657 [INFO] Apache Beam :: SDKs :: Java :: IO :: Elasticsearch . SUCCESS
[ 55.576 s]
2017-05-06T00:13:45.657 [INFO] Apache Beam :: SDKs :: Java :: Extensions .......... SUCCESS
[  1.667 s]
2017-05-06T00:13:45.657 [INFO] Apache Beam :: SDKs :: Java :: Extensions :: Google Cloud Platform
Core SUCCESS [ 51.491 s]
2017-05-06T00:13:45.657 [INFO] Apache Beam :: SDKs :: Java :: Extensions :: Protobuf SUCCESS
[ 33.542 s]
2017-05-06T00:13:45.657 [INFO] Apache Beam :: SDKs :: Java :: IO :: Google Cloud Platform
SUCCESS [02:09 min]
2017-05-06T00:13:45.657 [INFO] Apache Beam :: SDKs :: Java :: IO :: Hadoop Common . SUCCESS
[ 39.485 s]
2017-05-06T00:13:45.657 [INFO] Apache Beam :: SDKs :: Java :: IO :: Hadoop File System SUCCESS
[ 53.334 s]
2017-05-06T00:13:45.657 [INFO] Apache Beam :: SDKs :: Java :: IO :: Hadoop ........ SUCCESS
[  6.264 s]
2017-05-06T00:13:45.657 [INFO] Apache Beam :: SDKs :: Java :: IO :: Hadoop :: input-format
SUCCESS [ 34.964 s]
2017-05-06T00:13:45.658 [INFO] Apache Beam :: Runners :: Google Cloud Dataflow .... SUCCESS
[08:26 min]
2017-05-06T00:13:45.658 [INFO] Apache Beam :: SDKs :: Java :: IO :: Hadoop :: jdk1.8-tests
SUCCESS [01:53 min]
2017-05-06T00:13:45.658 [INFO] Apache Beam :: SDKs :: Java :: IO :: HBase ......... SUCCESS
[02:01 min]
2017-05-06T00:13:45.658 [INFO] Apache Beam :: SDKs :: Java :: IO :: JDBC .......... SUCCESS
[ 33.823 s]
2017-05-06T00:13:45.658 [INFO] Apache Beam :: SDKs :: Java :: IO :: JMS ........... SUCCESS
[ 31.747 s]
2017-05-06T00:13:45.658 [INFO] Apache Beam :: SDKs :: Java :: IO :: Kafka ......... SUCCESS
[ 32.602 s]
2017-05-06T00:13:45.658 [INFO] Apache Beam :: SDKs :: Java :: IO :: Kinesis ....... SUCCESS
[ 35.578 s]
2017-05-06T00:13:45.658 [INFO] Apache Beam :: SDKs :: Java :: IO :: MongoDB ....... SUCCESS
[ 55.943 s]
2017-05-06T00:13:45.658 [INFO] Apache Beam :: SDKs :: Java :: IO :: MQTT .......... SUCCESS
[ 30.064 s]
2017-05-06T00:13:45.658 [INFO] Apache Beam :: SDKs :: Java :: IO :: XML ........... SUCCESS
[ 52.471 s]
2017-05-06T00:13:45.658 [INFO] Apache Beam :: SDKs :: Java :: Maven Archetypes .... SUCCESS
[  2.471 s]
2017-05-06T00:13:45.658 [INFO] Apache Beam :: SDKs :: Java :: Maven Archetypes :: Starter
SUCCESS [ 32.763 s]
2017-05-06T00:13:45.658 [INFO] Apache Beam :: Examples ............................ SUCCESS
[  3.162 s]
2017-05-06T00:13:45.658 [INFO] Apache Beam :: Examples :: Java .................... SUCCESS
[08:15 min]
2017-05-06T00:13:45.658 [INFO] Apache Beam :: SDKs :: Java :: Maven Archetypes :: Examples
SUCCESS [ 38.098 s]
2017-05-06T00:13:45.658 [INFO] Apache Beam :: Runners :: Flink .................... SUCCESS
[ 50.815 s]
2017-05-06T00:13:45.658 [INFO] Apache Beam :: Runners :: Spark .................... SUCCESS
[04:19 min]
2017-05-06T00:13:45.658 [INFO] Apache Beam :: Examples :: Java 8 .................. SUCCESS
[01:03 min]
2017-05-06T00:13:45.658 [INFO] Apache Beam :: SDKs :: Java :: Maven Archetypes :: Examples
- Java 8 SUCCESS [ 46.878 s]
2017-05-06T00:13:45.658 [INFO] Apache Beam :: SDKs :: Java :: Extensions :: Jackson SUCCESS
[ 22.754 s]
2017-05-06T00:13:45.658 [INFO] Apache Beam :: SDKs :: Java :: Extensions :: Join library SUCCESS
[ 27.573 s]
2017-05-06T00:13:45.658 [INFO] Apache Beam :: SDKs :: Java :: Extensions :: Sorter  SUCCESS
[ 47.561 s]
2017-05-06T00:13:45.658 [INFO] Apache Beam :: SDKs :: Java :: Harness ............. SUCCESS
[ 49.611 s]
2017-05-06T00:13:45.658 [INFO] Apache Beam :: SDKs :: Java :: Java 8 Tests ........ SUCCESS
[ 16.544 s]
2017-05-06T00:13:45.658 [INFO] Apache Beam :: SDKs :: Python ...................... SUCCESS
[22:05 min]
2017-05-06T00:13:45.658 [INFO] Apache Beam :: Runners :: Apex ..................... FAILURE
[ 24.688 s]
2017-05-06T00:13:45.658 [INFO] Apache Beam :: SDKs :: Java :: Aggregated Javadoc .. SKIPPED
2017-05-06T00:13:45.658 [INFO] ------------------------------------------------------------------------
2017-05-06T00:13:45.658 [INFO] BUILD FAILURE
2017-05-06T00:13:45.658 [INFO] ------------------------------------------------------------------------
2017-05-06T00:13:45.658 [INFO] Total time: 01:17 h
2017-05-06T00:13:45.658 [INFO] Finished at: 2017-05-06T00:13:45+00:00
2017-05-06T00:13:48.820 [INFO] Final Memory: 291M/1993M
2017-05-06T00:13:48.820 [INFO] ------------------------------------------------------------------------
Waiting for Jenkins to finish collecting data
2017-05-06T00:14:32.417 [ERROR] Failed to execute goal org.codehaus.mojo:findbugs-maven-plugin:3.0.4:findbugs
(findbugs) on project beam-runners-apex: Execution findbugs of goal org.codehaus.mojo:findbugs-maven-plugin:3.0.4:findbugs
failed: The following error occurred while executing this line:
2017-05-06T00:14:32.417 [ERROR] Unable to find jar:<https://builds.apache.org/job/beam_PostCommit_Java_MavenInstall/ws/.repository/org/apache/ant/ant/1.9.4/ant-1.9.4.jar!/org/apache/tools/ant/antlib.xml>:
<https://builds.apache.org/job/beam_PostCommit_Java_MavenInstall/ws/.repository/org/apache/ant/ant/1.9.4/ant-1.9.4.jar>
(No such file or directory)
2017-05-06T00:14:32.417 [ERROR] -> [Help 1]
org.apache.maven.lifecycle.LifecycleExecutionException: Failed to execute goal org.codehaus.mojo:findbugs-maven-plugin:3.0.4:findbugs
(findbugs) on project beam-runners-apex: Execution findbugs of goal org.codehaus.mojo:findbugs-maven-plugin:3.0.4:findbugs
failed: The following error occurred while executing this line:
Unable to find jar:<https://builds.apache.org/job/beam_PostCommit_Java_MavenInstall/ws/.repository/org/apache/ant/ant/1.9.4/ant-1.9.4.jar!/org/apache/tools/ant/antlib.xml>
	at org.apache.maven.lifecycle.internal.MojoExecutor.execute(MojoExecutor.java:224)
	at org.apache.maven.lifecycle.internal.MojoExecutor.execute(MojoExecutor.java:153)
	at org.apache.maven.lifecycle.internal.MojoExecutor.execute(MojoExecutor.java:145)
	at org.apache.maven.lifecycle.internal.MojoExecutor.executeForkedExecutions(MojoExecutor.java:364)
	at org.apache.maven.lifecycle.internal.MojoExecutor.execute(MojoExecutor.java:198)
	at org.apache.maven.lifecycle.internal.MojoExecutor.execute(MojoExecutor.java:153)
	at org.apache.maven.lifecycle.internal.MojoExecutor.execute(MojoExecutor.java:145)
	at org.apache.maven.lifecycle.internal.LifecycleModuleBuilder.buildProject(LifecycleModuleBuilder.java:116)
	at org.apache.maven.lifecycle.internal.LifecycleModuleBuilder.buildProject(LifecycleModuleBuilder.java:80)
	at org.apache.maven.lifecycle.internal.builder.singlethreaded.SingleThreadedBuilder.build(SingleThreadedBuilder.java:51)
	at org.apache.maven.lifecycle.internal.LifecycleStarter.execute(LifecycleStarter.java:128)
	at org.apache.maven.DefaultMaven.doExecute(DefaultMaven.java:307)
	at org.apache.maven.DefaultMaven.doExecute(DefaultMaven.java:193)
	at org.apache.maven.DefaultMaven.execute(DefaultMaven.java:106)
	at org.jvnet.hudson.maven3.launcher.Maven33Launcher.main(Maven33Launcher.java:129)
	at sun.reflect.NativeMethodAccessorImpl.invoke0(Native Method)
	at sun.reflect.NativeMethodAccessorImpl.invoke(NativeMethodAccessorImpl.java:62)
	at sun.reflect.DelegatingMethodAccessorImpl.invoke(DelegatingMethodAccessorImpl.java:43)
	at java.lang.reflect.Method.invoke(Method.java:498)
	at org.codehaus.plexus.classworlds.launcher.Launcher.launchStandard(Launcher.java:330)
	at org.codehaus.plexus.classworlds.launcher.Launcher.launch(Launcher.java:238)
	at jenkins.maven3.agent.Maven33Main.launch(Maven33Main.java:176)
	at sun.reflect.NativeMethodAccessorImpl.invoke0(Native Method)
	at sun.reflect.NativeMethodAccessorImpl.invoke(NativeMethodAccessorImpl.java:62)
	at sun.reflect.DelegatingMethodAccessorImpl.invoke(DelegatingMethodAccessorImpl.java:43)
	at java.lang.reflect.Method.invoke(Method.java:498)
	at hudson.maven.Maven3Builder.call(Maven3Builder.java:139)
	at hudson.maven.Maven3Builder.call(Maven3Builder.java:70)
	at hudson.remoting.UserRequest.perform(UserRequest.java:153)
	at hudson.remoting.UserRequest.perform(UserRequest.java:50)
	at hudson.remoting.Request$2.run(Request.java:336)
	at hudson.remoting.InterceptingExecutorService$1.call(InterceptingExecutorService.java:68)
	at java.util.concurrent.FutureTask.run(FutureTask.java:266)
	at java.util.concurrent.ThreadPoolExecutor.runWorker(ThreadPoolExecutor.java:1142)
	at java.util.concurrent.ThreadPoolExecutor$Worker.run(ThreadPoolExecutor.java:617)
	at java.lang.Thread.run(Thread.java:745)
Caused by: org.apache.maven.plugin.PluginExecutionException: Execution findbugs of goal org.codehaus.mojo:findbugs-maven-plugin:3.0.4:findbugs
failed: The following error occurred while executing this line:
Unable to find jar:<https://builds.apache.org/job/beam_PostCommit_Java_MavenInstall/ws/.repository/org/apache/ant/ant/1.9.4/ant-1.9.4.jar!/org/apache/tools/ant/antlib.xml>
	at org.apache.maven.plugin.DefaultBuildPluginManager.executeMojo(DefaultBuildPluginManager.java:145)
	at org.apache.maven.lifecycle.internal.MojoExecutor.execute(MojoExecutor.java:208)
	... 35 more
Caused by: : The following error occurred while executing this line:
Unable to find jar:<https://builds.apache.org/job/beam_PostCommit_Java_MavenInstall/ws/.repository/org/apache/ant/ant/1.9.4/ant-1.9.4.jar!/org/apache/tools/ant/antlib.xml>
	at org.apache.tools.ant.ProjectHelper.addLocationToBuildException(ProjectHelper.java:568)
	at org.apache.tools.ant.taskdefs.Definer.loadAntlib(Definer.java:430)
	at org.apache.tools.ant.taskdefs.Definer.execute(Definer.java:277)
	at org.apache.tools.ant.ComponentHelper.checkNamespace(ComponentHelper.java:874)
	at org.apache.tools.ant.ComponentHelper.getDefinition(ComponentHelper.java:307)
	at org.apache.tools.ant.ComponentHelper.createComponent(ComponentHelper.java:284)
	at org.apache.tools.ant.ComponentHelper.createComponent(ComponentHelper.java:263)
	at org.apache.tools.ant.UnknownElement.makeObject(UnknownElement.java:429)
	at org.apache.tools.ant.UnknownElement.maybeConfigure(UnknownElement.java:163)
	at groovy.util.AntBuilder.performTask(AntBuilder.java:322)
	at groovy.util.AntBuilder.nodeCompleted(AntBuilder.java:272)
	at groovy.util.BuilderSupport.doInvokeMethod(BuilderSupport.java:154)
	at groovy.util.AntBuilder.doInvokeMethod(AntBuilder.java:207)
	at groovy.util.BuilderSupport.invokeMethod(BuilderSupport.java:67)
	at org.codehaus.groovy.runtime.callsite.PogoMetaClassSite.call(PogoMetaClassSite.java:48)
	at org.codehaus.groovy.runtime.callsite.AbstractCallSite.call(AbstractCallSite.java:133)
	at org.codehaus.mojo.findbugs.FindBugsMojo.executeFindbugs(FindBugsMojo.groovy:1049)
	at sun.reflect.GeneratedMethodAccessor486.invoke(Unknown Source)
	at sun.reflect.DelegatingMethodAccessorImpl.invoke(DelegatingMethodAccessorImpl.java:43)
	at java.lang.reflect.Method.invoke(Method.java:498)
	at org.codehaus.groovy.runtime.callsite.PogoMetaMethodSite$PogoCachedMethodSiteNoUnwrapNoCoerce.invoke(PogoMetaMethodSite.java:210)
	at org.codehaus.groovy.runtime.callsite.PogoMetaMethodSite.callCurrent(PogoMetaMethodSite.java:59)
	at org.codehaus.groovy.runtime.callsite.AbstractCallSite.callCurrent(AbstractCallSite.java:166)
	at org.codehaus.mojo.findbugs.FindBugsMojo.canGenerateReport(FindBugsMojo.groovy:562)
	at org.codehaus.mojo.findbugs.FindBugsMojo.execute(FindBugsMojo.groovy:701)
	at org.apache.maven.plugin.DefaultBuildPluginManager.executeMojo(DefaultBuildPluginManager.java:134)
	... 36 more
Caused by: Unable to find jar:<https://builds.apache.org/job/beam_PostCommit_Java_MavenInstall/ws/.repository/org/apache/ant/ant/1.9.4/ant-1.9.4.jar!/org/apache/tools/ant/antlib.xml>
	at org.apache.tools.ant.taskdefs.Antlib.createAntlib(Antlib.java:71)
	at org.apache.tools.ant.taskdefs.Definer.loadAntlib(Definer.java:425)
	... 60 more
Caused by: java.io.FileNotFoundException: <https://builds.apache.org/job/beam_PostCommit_Java_MavenInstall/ws/.repository/org/apache/ant/ant/1.9.4/ant-1.9.4.jar>
(No such file or directory)
	at java.util.zip.ZipFile.open(Native Method)
	at java.util.zip.ZipFile.<init>(ZipFile.java:219)
	at java.util.zip.ZipFile.<init>(ZipFile.java:149)
	at java.util.jar.JarFile.<init>(JarFile.java:166)
	at java.util.jar.JarFile.<init>(JarFile.java:103)
	at sun.net.www.protocol.jar.URLJarFile.<init>(URLJarFile.java:93)
	at sun.net.www.protocol.jar.URLJarFile.getJarFile(URLJarFile.java:69)
	at sun.net.www.protocol.jar.JarFileFactory.get(JarFileFactory.java:99)
	at sun.net.www.protocol.jar.JarURLConnection.connect(JarURLConnection.java:122)
	at org.apache.tools.ant.taskdefs.Antlib.createAntlib(Antlib.java:69)
	... 61 more
2017-05-06T00:14:32.427 [ERROR] 
2017-05-06T00:14:32.427 [ERROR] Re-run Maven using the -X switch to enable full debug logging.
2017-05-06T00:14:32.428 [ERROR] 
2017-05-06T00:14:32.428 [ERROR] For more information about the errors and possible solutions,
please read the following articles:
2017-05-06T00:14:32.428 [ERROR] [Help 1] http://cwiki.apache.org/confluence/display/MAVEN/PluginExecutionException
2017-05-06T00:14:32.428 [ERROR] 
2017-05-06T00:14:32.428 [ERROR] After correcting the problems, you can resume the build with
the command
2017-05-06T00:14:32.428 [ERROR]   mvn <goals> -rf :beam-runners-apex
channel stopped

Mime
View raw message