beam-commits mailing list archives

Site index · List index
Message view « Date » · « Thread »
Top « Date » · « Thread »
From Apache Jenkins Server <jenk...@builds.apache.org>
Subject Build failed in Jenkins: beam_PostCommit_Java_MavenInstall #3573
Date Tue, 02 May 2017 01:29:27 GMT
See <https://builds.apache.org/job/beam_PostCommit_Java_MavenInstall/3573/display/redirect?page=changes>

Changes:

[robertwb] Rename OutputValue to TaggedOutput.

------------------------------------------
[...truncated 2.12 MB...]
    for result in results:
  File "<https://builds.apache.org/job/beam_PostCommit_Java_MavenInstall/ws/sdks/python/apache_beam/runners/portability/maptask_executor_runner_test.py",>
line 105, in tee
    yield beam.pvalue.OutputValue(tag, elem)
AttributeError: 'module' object has no attribute 'OutputValue' [while running 'FlatMap(tee)/FlatMap(tee)']
-------------------- >> begin captured logging << --------------------
root: INFO: Running [(u'Create/Read', WorkerRead(source=SourceBundle(weight=1.0, source=<apache_beam.transforms.core._CreateSource
object at 0x7fa02c7d8110>, start_position=None, stop_position=None))), (u'FlatMap(tee)/FlatMap(tee)',
WorkerDoFn(output_tags=['out', 'out_x', 'out_y'], input=(0, 0))), (u'x/WindowInto(WindowIntoFn)',
WorkerDoFn(output_tags=['out'], input=(1, 1))), (u'x/ToVoidKey', WorkerDoFn(output_tags=['out'],
input=(2, 0))), (u'x/Group/pair_with_1', WorkerDoFn(output_tags=['out'], input=(3, 0))), (u'x/Group/Flatten/Write',
WorkerInMemoryWrite(output_buffer=GroupingOutput[0], write_windowed_values=True, input=(4,
0))), (u'y/WindowInto(WindowIntoFn)', WorkerDoFn(output_tags=['out'], input=(1, 2))), (u'y/ToVoidKey',
WorkerDoFn(output_tags=['out'], input=(6, 0))), (u'y/Group/pair_with_1', WorkerDoFn(output_tags=['out'],
input=(7, 0))), (u'y/Group/Flatten/Write', WorkerInMemoryWrite(output_buffer=GroupingOutput[0],
write_windowed_values=True, input=(8, 0)))]
root: DEBUG: Starting op 9 <InMemoryWriteOperation y/Group/Flatten/Write output_buffer=GroupingOutput[0],
write_windowed_values=True, input=(8, 0)>
root: DEBUG: Starting op 8 <DoOperation y/Group/pair_with_1 output_tags=['out'], input=(7,
0)>
root: DEBUG: Starting op 7 <DoOperation y/ToVoidKey output_tags=['out'], input=(6, 0)>
root: DEBUG: Starting op 6 <DoOperation y/WindowInto(WindowIntoFn) output_tags=['out'],
input=(1, 2)>
root: DEBUG: Starting op 5 <InMemoryWriteOperation x/Group/Flatten/Write output_buffer=GroupingOutput[0],
write_windowed_values=True, input=(4, 0)>
root: DEBUG: Starting op 4 <DoOperation x/Group/pair_with_1 output_tags=['out'], input=(3,
0)>
root: DEBUG: Starting op 3 <DoOperation x/ToVoidKey output_tags=['out'], input=(2, 0)>
root: DEBUG: Starting op 2 <DoOperation x/WindowInto(WindowIntoFn) output_tags=['out'],
input=(1, 1)>
root: DEBUG: Starting op 1 <DoOperation FlatMap(tee)/FlatMap(tee) output_tags=['out', 'out_x',
'out_y'], input=(0, 0)>
root: DEBUG: Starting op 0 <ReadOperation Create/Read source=SourceBundle(weight=1.0, source=<apache_beam.transforms.core._CreateSource
object at 0x7fa02c7d8110>, start_position=None, stop_position=None)>
--------------------- >> end captured logging << ---------------------

======================================================================
FAIL: test_using_slow_impl (apache_beam.coders.slow_coders_test.SlowCoders)
----------------------------------------------------------------------
Traceback (most recent call last):
  File "<https://builds.apache.org/job/beam_PostCommit_Java_MavenInstall/ws/sdks/python/apache_beam/coders/slow_coders_test.py",>
line 41, in test_using_slow_impl
    import apache_beam.coders.stream
AssertionError: ImportError not raised

----------------------------------------------------------------------
Ran 1198 tests in 132.858s

FAILED (failures=1, errors=2, skipped=15)
Test failed: <unittest.runner.TextTestResult run=1198 errors=2 failures=1>
error: Test failed: <unittest.runner.TextTestResult run=1198 errors=2 failures=1>
ERROR: InvocationError: '<https://builds.apache.org/job/beam_PostCommit_Java_MavenInstall/ws/sdks/python/target/.tox/py27gcp/bin/python>
setup.py test'
___________________________________ summary ____________________________________
  docs: commands succeeded
  lint: commands succeeded
ERROR:   py27: commands failed
ERROR:   py27cython: commands failed
ERROR:   py27gcp: commands failed
2017-05-02T01:28:29.954 [ERROR] Command execution failed.
org.apache.commons.exec.ExecuteException: Process exited with an error: 1 (Exit value: 1)
	at org.apache.commons.exec.DefaultExecutor.executeInternal(DefaultExecutor.java:404)
	at org.apache.commons.exec.DefaultExecutor.execute(DefaultExecutor.java:166)
	at org.codehaus.mojo.exec.ExecMojo.executeCommandLine(ExecMojo.java:764)
	at org.codehaus.mojo.exec.ExecMojo.executeCommandLine(ExecMojo.java:711)
	at org.codehaus.mojo.exec.ExecMojo.execute(ExecMojo.java:289)
	at org.apache.maven.plugin.DefaultBuildPluginManager.executeMojo(DefaultBuildPluginManager.java:134)
	at org.apache.maven.lifecycle.internal.MojoExecutor.execute(MojoExecutor.java:208)
	at org.apache.maven.lifecycle.internal.MojoExecutor.execute(MojoExecutor.java:153)
	at org.apache.maven.lifecycle.internal.MojoExecutor.execute(MojoExecutor.java:145)
	at org.apache.maven.lifecycle.internal.LifecycleModuleBuilder.buildProject(LifecycleModuleBuilder.java:116)
	at org.apache.maven.lifecycle.internal.LifecycleModuleBuilder.buildProject(LifecycleModuleBuilder.java:80)
	at org.apache.maven.lifecycle.internal.builder.singlethreaded.SingleThreadedBuilder.build(SingleThreadedBuilder.java:51)
	at org.apache.maven.lifecycle.internal.LifecycleStarter.execute(LifecycleStarter.java:128)
	at org.apache.maven.DefaultMaven.doExecute(DefaultMaven.java:307)
	at org.apache.maven.DefaultMaven.doExecute(DefaultMaven.java:193)
	at org.apache.maven.DefaultMaven.execute(DefaultMaven.java:106)
	at org.jvnet.hudson.maven3.launcher.Maven33Launcher.main(Maven33Launcher.java:129)
	at sun.reflect.NativeMethodAccessorImpl.invoke0(Native Method)
	at sun.reflect.NativeMethodAccessorImpl.invoke(NativeMethodAccessorImpl.java:62)
	at sun.reflect.DelegatingMethodAccessorImpl.invoke(DelegatingMethodAccessorImpl.java:43)
	at java.lang.reflect.Method.invoke(Method.java:498)
	at org.codehaus.plexus.classworlds.launcher.Launcher.launchStandard(Launcher.java:330)
	at org.codehaus.plexus.classworlds.launcher.Launcher.launch(Launcher.java:238)
	at jenkins.maven3.agent.Maven33Main.launch(Maven33Main.java:176)
	at sun.reflect.NativeMethodAccessorImpl.invoke0(Native Method)
	at sun.reflect.NativeMethodAccessorImpl.invoke(NativeMethodAccessorImpl.java:62)
	at sun.reflect.DelegatingMethodAccessorImpl.invoke(DelegatingMethodAccessorImpl.java:43)
	at java.lang.reflect.Method.invoke(Method.java:498)
	at hudson.maven.Maven3Builder.call(Maven3Builder.java:139)
	at hudson.maven.Maven3Builder.call(Maven3Builder.java:70)
	at hudson.remoting.UserRequest.perform(UserRequest.java:153)
	at hudson.remoting.UserRequest.perform(UserRequest.java:50)
	at hudson.remoting.Request$2.run(Request.java:336)
	at hudson.remoting.InterceptingExecutorService$1.call(InterceptingExecutorService.java:68)
	at java.util.concurrent.FutureTask.run(FutureTask.java:266)
	at java.util.concurrent.ThreadPoolExecutor.runWorker(ThreadPoolExecutor.java:1142)
	at java.util.concurrent.ThreadPoolExecutor$Worker.run(ThreadPoolExecutor.java:617)
	at java.lang.Thread.run(Thread.java:745)
[JENKINS] Archiving disabled
2017-05-02T01:28:31.110 [INFO]                                                           
             
2017-05-02T01:28:31.110 [INFO] ------------------------------------------------------------------------
2017-05-02T01:28:31.110 [INFO] Skipping Apache Beam :: Parent
2017-05-02T01:28:31.110 [INFO] This project has been banned from the build due to previous
failures.
2017-05-02T01:28:31.110 [INFO] ------------------------------------------------------------------------
[JENKINS] Archiving disabled
[JENKINS] Archiving disabled
[JENKINS] Archiving disabled
[JENKINS] Archiving disabled
[JENKINS] Archiving disabled
[JENKINS] Archiving disabled
[JENKINS] Archiving disabled
[JENKINS] Archiving disabled
[JENKINS] Archiving disabled
[JENKINS] Archiving disabled
[JENKINS] Archiving disabled
[JENKINS] Archiving disabled
[JENKINS] Archiving disabled
[JENKINS] Archiving disabled
[JENKINS] Archiving disabled
[JENKINS] Archiving disabled
[JENKINS] Archiving disabled
[JENKINS] Archiving disabled
[JENKINS] Archiving disabled
[JENKINS] Archiving disabled
[JENKINS] Archiving disabled
[JENKINS] Archiving disabled
[JENKINS] Archiving disabled
[JENKINS] Archiving disabled
[JENKINS] Archiving disabled
[JENKINS] Archiving disabled
[JENKINS] Archiving disabled
[JENKINS] Archiving disabled
[JENKINS] Archiving disabled
[JENKINS] Archiving disabled
[JENKINS] Archiving disabled
[JENKINS] Archiving disabled
[JENKINS] Archiving disabled
[JENKINS] Archiving disabled
[JENKINS] Archiving disabled
[JENKINS] Archiving disabled
[JENKINS] Archiving disabled
[JENKINS] Archiving disabled
[JENKINS] Archiving disabled
[JENKINS] Archiving disabled
[JENKINS] Archiving disabled
[JENKINS] Archiving disabled
[JENKINS] Archiving disabled
[JENKINS] Archiving disabled
[JENKINS] Archiving disabled
[JENKINS] Archiving disabled
2017-05-02T01:28:50.195 [INFO] ------------------------------------------------------------------------
2017-05-02T01:28:50.195 [INFO] Reactor Summary:
2017-05-02T01:28:50.195 [INFO] 
2017-05-02T01:28:50.195 [INFO] Apache Beam :: Parent .............................. SUCCESS
[ 39.569 s]
2017-05-02T01:28:50.195 [INFO] Apache Beam :: SDKs :: Java :: Build Tools ......... SUCCESS
[ 17.835 s]
2017-05-02T01:28:50.195 [INFO] Apache Beam :: SDKs ................................ SUCCESS
[  9.121 s]
2017-05-02T01:28:50.195 [INFO] Apache Beam :: SDKs :: Common ...................... SUCCESS
[  1.889 s]
2017-05-02T01:28:50.196 [INFO] Apache Beam :: SDKs :: Common :: Fn API ............ SUCCESS
[ 25.605 s]
2017-05-02T01:28:50.196 [INFO] Apache Beam :: SDKs :: Common :: Runner API ........ SUCCESS
[ 28.528 s]
2017-05-02T01:28:50.196 [INFO] Apache Beam :: SDKs :: Java ........................ SUCCESS
[  2.444 s]
2017-05-02T01:28:50.196 [INFO] Apache Beam :: SDKs :: Java :: Core ................ SUCCESS
[04:30 min]
2017-05-02T01:28:50.196 [INFO] Apache Beam :: SDKs :: Java :: IO .................. SUCCESS
[ 10.301 s]
2017-05-02T01:28:50.196 [INFO] Apache Beam :: SDKs :: Java :: IO :: Common ........ SUCCESS
[  8.849 s]
2017-05-02T01:28:50.196 [INFO] Apache Beam :: Runners ............................. SUCCESS
[  7.718 s]
2017-05-02T01:28:50.196 [INFO] Apache Beam :: Runners :: Core Construction Java ... SUCCESS
[ 34.175 s]
2017-05-02T01:28:50.196 [INFO] Apache Beam :: Runners :: Core Java ................ SUCCESS
[01:12 min]
2017-05-02T01:28:50.196 [INFO] Apache Beam :: Runners :: Direct Java .............. SUCCESS
[03:36 min]
2017-05-02T01:28:50.197 [INFO] Apache Beam :: SDKs :: Java :: IO :: Elasticsearch . SUCCESS
[ 39.369 s]
2017-05-02T01:28:50.197 [INFO] Apache Beam :: SDKs :: Java :: Extensions .......... SUCCESS
[  3.243 s]
2017-05-02T01:28:50.197 [INFO] Apache Beam :: SDKs :: Java :: Extensions :: Google Cloud Platform
Core SUCCESS [ 47.430 s]
2017-05-02T01:28:50.197 [INFO] Apache Beam :: SDKs :: Java :: Extensions :: Protobuf SUCCESS
[ 28.929 s]
2017-05-02T01:28:50.197 [INFO] Apache Beam :: SDKs :: Java :: IO :: Google Cloud Platform
SUCCESS [02:02 min]
2017-05-02T01:28:50.197 [INFO] Apache Beam :: SDKs :: Java :: IO :: Hadoop Common . SUCCESS
[ 23.557 s]
2017-05-02T01:28:50.197 [INFO] Apache Beam :: SDKs :: Java :: IO :: Hadoop ........ SUCCESS
[  4.250 s]
2017-05-02T01:28:50.197 [INFO] Apache Beam :: SDKs :: Java :: IO :: Hadoop :: input-format
SUCCESS [ 23.532 s]
2017-05-02T01:28:50.197 [INFO] Apache Beam :: Runners :: Google Cloud Dataflow .... SUCCESS
[ 40.058 s]
2017-05-02T01:28:50.197 [INFO] Apache Beam :: SDKs :: Java :: IO :: Hadoop :: jdk1.8-tests
SUCCESS [01:22 min]
2017-05-02T01:28:50.197 [INFO] Apache Beam :: SDKs :: Java :: IO :: HBase ......... SUCCESS
[01:09 min]
2017-05-02T01:28:50.197 [INFO] Apache Beam :: SDKs :: Java :: IO :: HDFS .......... SUCCESS
[ 23.369 s]
2017-05-02T01:28:50.197 [INFO] Apache Beam :: SDKs :: Java :: IO :: JDBC .......... SUCCESS
[ 26.477 s]
2017-05-02T01:28:50.198 [INFO] Apache Beam :: SDKs :: Java :: IO :: JMS ........... SUCCESS
[ 20.155 s]
2017-05-02T01:28:50.198 [INFO] Apache Beam :: SDKs :: Java :: IO :: Kafka ......... SUCCESS
[ 27.458 s]
2017-05-02T01:28:50.198 [INFO] Apache Beam :: SDKs :: Java :: IO :: Kinesis ....... SUCCESS
[ 24.069 s]
2017-05-02T01:28:50.198 [INFO] Apache Beam :: SDKs :: Java :: IO :: MongoDB ....... SUCCESS
[ 34.420 s]
2017-05-02T01:28:50.198 [INFO] Apache Beam :: SDKs :: Java :: IO :: MQTT .......... SUCCESS
[ 20.246 s]
2017-05-02T01:28:50.198 [INFO] Apache Beam :: SDKs :: Java :: IO :: XML ........... SUCCESS
[ 26.767 s]
2017-05-02T01:28:50.198 [INFO] Apache Beam :: SDKs :: Java :: Maven Archetypes .... SUCCESS
[  1.893 s]
2017-05-02T01:28:50.198 [INFO] Apache Beam :: SDKs :: Java :: Maven Archetypes :: Starter
SUCCESS [ 17.343 s]
2017-05-02T01:28:50.198 [INFO] Apache Beam :: SDKs :: Java :: Maven Archetypes :: Examples
SUCCESS [ 28.080 s]
2017-05-02T01:28:50.198 [INFO] Apache Beam :: SDKs :: Java :: Maven Archetypes :: Examples
- Java 8 SUCCESS [ 27.175 s]
2017-05-02T01:28:50.198 [INFO] Apache Beam :: SDKs :: Java :: Extensions :: Jackson SUCCESS
[ 15.366 s]
2017-05-02T01:28:50.199 [INFO] Apache Beam :: SDKs :: Java :: Extensions :: Join library SUCCESS
[ 16.718 s]
2017-05-02T01:28:50.199 [INFO] Apache Beam :: SDKs :: Java :: Extensions :: Sorter  SUCCESS
[ 30.676 s]
2017-05-02T01:28:50.199 [INFO] Apache Beam :: SDKs :: Java :: Harness ............. SUCCESS
[ 36.375 s]
2017-05-02T01:28:50.199 [INFO] Apache Beam :: SDKs :: Java :: Java 8 Tests ........ SUCCESS
[ 12.019 s]
2017-05-02T01:28:50.199 [INFO] Apache Beam :: SDKs :: Python ...................... FAILURE
[11:38 min]
2017-05-02T01:28:50.199 [INFO] Apache Beam :: Runners :: Flink .................... SKIPPED
2017-05-02T01:28:50.199 [INFO] Apache Beam :: Runners :: Spark .................... SKIPPED
2017-05-02T01:28:50.199 [INFO] Apache Beam :: Runners :: Apex ..................... SKIPPED
2017-05-02T01:28:50.199 [INFO] Apache Beam :: Examples ............................ SKIPPED
2017-05-02T01:28:50.199 [INFO] Apache Beam :: Examples :: Java .................... SKIPPED
2017-05-02T01:28:50.199 [INFO] Apache Beam :: Examples :: Java 8 .................. SKIPPED
2017-05-02T01:28:50.199 [INFO] Apache Beam :: SDKs :: Java :: Aggregated Javadoc .. SKIPPED
2017-05-02T01:28:50.199 [INFO] ------------------------------------------------------------------------
2017-05-02T01:28:50.200 [INFO] BUILD FAILURE
2017-05-02T01:28:50.200 [INFO] ------------------------------------------------------------------------
2017-05-02T01:28:50.200 [INFO] Total time: 39:58 min
2017-05-02T01:28:50.200 [INFO] Finished at: 2017-05-02T01:28:50+00:00
2017-05-02T01:28:51.154 [INFO] Final Memory: 277M/2026M
2017-05-02T01:28:51.154 [INFO] ------------------------------------------------------------------------
Waiting for Jenkins to finish collecting data
2017-05-02T01:29:08.815 [ERROR] Failed to execute goal org.codehaus.mojo:exec-maven-plugin:1.5.0:exec
(setuptools-test) on project beam-sdks-python: Command execution failed. Process exited with
an error: 1 (Exit value: 1) -> [Help 1]
org.apache.maven.lifecycle.LifecycleExecutionException: Failed to execute goal org.codehaus.mojo:exec-maven-plugin:1.5.0:exec
(setuptools-test) on project beam-sdks-python: Command execution failed.
	at org.apache.maven.lifecycle.internal.MojoExecutor.execute(MojoExecutor.java:216)
	at org.apache.maven.lifecycle.internal.MojoExecutor.execute(MojoExecutor.java:153)
	at org.apache.maven.lifecycle.internal.MojoExecutor.execute(MojoExecutor.java:145)
	at org.apache.maven.lifecycle.internal.LifecycleModuleBuilder.buildProject(LifecycleModuleBuilder.java:116)
	at org.apache.maven.lifecycle.internal.LifecycleModuleBuilder.buildProject(LifecycleModuleBuilder.java:80)
	at org.apache.maven.lifecycle.internal.builder.singlethreaded.SingleThreadedBuilder.build(SingleThreadedBuilder.java:51)
	at org.apache.maven.lifecycle.internal.LifecycleStarter.execute(LifecycleStarter.java:128)
	at org.apache.maven.DefaultMaven.doExecute(DefaultMaven.java:307)
	at org.apache.maven.DefaultMaven.doExecute(DefaultMaven.java:193)
	at org.apache.maven.DefaultMaven.execute(DefaultMaven.java:106)
	at org.jvnet.hudson.maven3.launcher.Maven33Launcher.main(Maven33Launcher.java:129)
	at sun.reflect.NativeMethodAccessorImpl.invoke0(Native Method)
	at sun.reflect.NativeMethodAccessorImpl.invoke(NativeMethodAccessorImpl.java:62)
	at sun.reflect.DelegatingMethodAccessorImpl.invoke(DelegatingMethodAccessorImpl.java:43)
	at java.lang.reflect.Method.invoke(Method.java:498)
	at org.codehaus.plexus.classworlds.launcher.Launcher.launchStandard(Launcher.java:330)
	at org.codehaus.plexus.classworlds.launcher.Launcher.launch(Launcher.java:238)
	at jenkins.maven3.agent.Maven33Main.launch(Maven33Main.java:176)
	at sun.reflect.NativeMethodAccessorImpl.invoke0(Native Method)
	at sun.reflect.NativeMethodAccessorImpl.invoke(NativeMethodAccessorImpl.java:62)
	at sun.reflect.DelegatingMethodAccessorImpl.invoke(DelegatingMethodAccessorImpl.java:43)
	at java.lang.reflect.Method.invoke(Method.java:498)
	at hudson.maven.Maven3Builder.call(Maven3Builder.java:139)
	at hudson.maven.Maven3Builder.call(Maven3Builder.java:70)
	at hudson.remoting.UserRequest.perform(UserRequest.java:153)
	at hudson.remoting.UserRequest.perform(UserRequest.java:50)
	at hudson.remoting.Request$2.run(Request.java:336)
	at hudson.remoting.InterceptingExecutorService$1.call(InterceptingExecutorService.java:68)
	at java.util.concurrent.FutureTask.run(FutureTask.java:266)
	at java.util.concurrent.ThreadPoolExecutor.runWorker(ThreadPoolExecutor.java:1142)
	at java.util.concurrent.ThreadPoolExecutor$Worker.run(ThreadPoolExecutor.java:617)
	at java.lang.Thread.run(Thread.java:745)
Caused by: org.apache.maven.plugin.MojoExecutionException: Command execution failed.
	at org.codehaus.mojo.exec.ExecMojo.execute(ExecMojo.java:302)
	at org.apache.maven.plugin.DefaultBuildPluginManager.executeMojo(DefaultBuildPluginManager.java:134)
	at org.apache.maven.lifecycle.internal.MojoExecutor.execute(MojoExecutor.java:208)
	... 31 more
Caused by: org.apache.commons.exec.ExecuteException: Process exited with an error: 1 (Exit
value: 1)
	at org.apache.commons.exec.DefaultExecutor.executeInternal(DefaultExecutor.java:404)
	at org.apache.commons.exec.DefaultExecutor.execute(DefaultExecutor.java:166)
	at org.codehaus.mojo.exec.ExecMojo.executeCommandLine(ExecMojo.java:764)
	at org.codehaus.mojo.exec.ExecMojo.executeCommandLine(ExecMojo.java:711)
	at org.codehaus.mojo.exec.ExecMojo.execute(ExecMojo.java:289)
	... 33 more
2017-05-02T01:29:08.816 [ERROR] 
2017-05-02T01:29:08.816 [ERROR] Re-run Maven using the -X switch to enable full debug logging.
2017-05-02T01:29:08.816 [ERROR] 
2017-05-02T01:29:08.816 [ERROR] For more information about the errors and possible solutions,
please read the following articles:
2017-05-02T01:29:08.816 [ERROR] [Help 1] http://cwiki.apache.org/confluence/display/MAVEN/MojoExecutionException
2017-05-02T01:29:08.816 [ERROR] 
2017-05-02T01:29:08.816 [ERROR] After correcting the problems, you can resume the build with
the command
2017-05-02T01:29:08.816 [ERROR]   mvn <goals> -rf :beam-sdks-python
channel stopped
Not sending mail to unregistered user klk@google.com
Not sending mail to unregistered user kirpichov@google.com

Mime
View raw message