beam-commits mailing list archives

Site index · List index
Message view « Date » · « Thread »
Top « Date » · « Thread »
From Apache Jenkins Server <jenk...@builds.apache.org>
Subject Build failed in Jenkins: beam_PostCommit_Java_ValidatesRunner_Spark #1962
Date Fri, 05 May 2017 21:54:16 GMT
See <https://builds.apache.org/job/beam_PostCommit_Java_ValidatesRunner_Spark/1962/display/redirect?page=changes>

Changes:

[tgroh] Re-add AtomicCoder

[tgroh] Add default implementations of Coder methods to Coder

[tgroh] Reparent many Coders to Atomic or StructuredCoder

[tgroh] Make CustomCoder extend Coder directly

[altay] Metrics are queriable from Python SDK

[dhalperi] Archetypes: fix build order

[dhalperi] Examples: allow java8 bytecode since the examples are java8

[chamikara] [BEAM-1585] Filesystems should be picked using the provided scheme

[davor] [BEAM-2165] Update Spark to support serializing/deserializing custom

------------------------------------------
[...truncated 580.70 KB...]
2017-05-05T21:49:34.821 [INFO] Downloaded: https://repo.maven.apache.org/maven2/org/apache/commons/commons-math/2.1/commons-math-2.1.jar
(813 KB at 483.6 KB/sec)
2017-05-05T21:49:34.821 [INFO] Downloading: https://repo.maven.apache.org/maven2/xmlenc/xmlenc/0.52/xmlenc-0.52.jar
2017-05-05T21:49:34.848 [INFO] Downloaded: https://repo.maven.apache.org/maven2/xmlenc/xmlenc/0.52/xmlenc-0.52.jar
(15 KB at 8.6 KB/sec)
2017-05-05T21:49:34.848 [INFO] Downloading: https://repo.maven.apache.org/maven2/commons-codec/commons-codec/1.4/commons-codec-1.4.jar
2017-05-05T21:49:34.859 [INFO] Downloaded: https://repo.maven.apache.org/maven2/org/apache/spark/spark-network-common_2.10/1.6.3/spark-network-common_2.10-1.6.3.jar
(2298 KB at 1336.5 KB/sec)
2017-05-05T21:49:34.859 [INFO] Downloading: https://repo.maven.apache.org/maven2/org/mortbay/jetty/jetty/6.1.26/jetty-6.1.26.jar
2017-05-05T21:49:34.878 [INFO] Downloaded: https://repo.maven.apache.org/maven2/commons-codec/commons-codec/1.4/commons-codec-1.4.jar
(57 KB at 32.7 KB/sec)
2017-05-05T21:49:34.878 [INFO] Downloading: https://repo.maven.apache.org/maven2/org/mortbay/jetty/jetty-util/6.1.26/jetty-util-6.1.26.jar
2017-05-05T21:49:34.934 [INFO] Downloaded: https://repo.maven.apache.org/maven2/org/mortbay/jetty/jetty-util/6.1.26/jetty-util-6.1.26.jar
(173 KB at 96.4 KB/sec)
2017-05-05T21:49:34.934 [INFO] Downloading: https://repo.maven.apache.org/maven2/com/sun/jersey/jersey-json/1.9/jersey-json-1.9.jar
2017-05-05T21:49:34.939 [INFO] Downloaded: https://repo.maven.apache.org/maven2/org/apache/spark/spark-streaming_2.10/1.6.3/spark-streaming_2.10-1.6.3.jar
(2005 KB at 1114.2 KB/sec)
2017-05-05T21:49:34.940 [INFO] Downloading: https://repo.maven.apache.org/maven2/org/codehaus/jettison/jettison/1.1/jettison-1.1.jar
2017-05-05T21:49:34.943 [INFO] Downloaded: https://repo.maven.apache.org/maven2/org/mortbay/jetty/jetty/6.1.26/jetty-6.1.26.jar
(528 KB at 292.4 KB/sec)
2017-05-05T21:49:34.943 [INFO] Downloading: https://repo.maven.apache.org/maven2/stax/stax-api/1.0.1/stax-api-1.0.1.jar
2017-05-05T21:49:34.972 [INFO] Downloaded: https://repo.maven.apache.org/maven2/com/sun/jersey/jersey-json/1.9/jersey-json-1.9.jar
(145 KB at 78.9 KB/sec)
2017-05-05T21:49:34.972 [INFO] Downloading: https://repo.maven.apache.org/maven2/com/sun/xml/bind/jaxb-impl/2.2.3-1/jaxb-impl-2.2.3-1.jar
2017-05-05T21:49:34.972 [INFO] Downloaded: https://repo.maven.apache.org/maven2/org/codehaus/jettison/jettison/1.1/jettison-1.1.jar
(67 KB at 36.1 KB/sec)
2017-05-05T21:49:34.972 [INFO] Downloading: https://repo.maven.apache.org/maven2/javax/xml/bind/jaxb-api/2.2.2/jaxb-api-2.2.2.jar
2017-05-05T21:49:34.975 [INFO] Downloaded: https://repo.maven.apache.org/maven2/stax/stax-api/1.0.1/stax-api-1.0.1.jar
(26 KB at 14.1 KB/sec)
2017-05-05T21:49:34.975 [INFO] Downloading: https://repo.maven.apache.org/maven2/javax/activation/activation/1.1/activation-1.1.jar
2017-05-05T21:49:35.004 [INFO] Downloaded: https://repo.maven.apache.org/maven2/javax/activation/activation/1.1/activation-1.1.jar
(62 KB at 33.0 KB/sec)
2017-05-05T21:49:35.005 [INFO] Downloading: https://repo.maven.apache.org/maven2/org/codehaus/jackson/jackson-jaxrs/1.8.3/jackson-jaxrs-1.8.3.jar
2017-05-05T21:49:35.022 [INFO] Downloaded: https://repo.maven.apache.org/maven2/javax/xml/bind/jaxb-api/2.2.2/jaxb-api-2.2.2.jar
(103 KB at 54.6 KB/sec)
2017-05-05T21:49:35.022 [INFO] Downloading: https://repo.maven.apache.org/maven2/org/codehaus/jackson/jackson-xc/1.8.3/jackson-xc-1.8.3.jar
2017-05-05T21:49:35.032 [INFO] Downloaded: https://repo.maven.apache.org/maven2/org/codehaus/jackson/jackson-jaxrs/1.8.3/jackson-jaxrs-1.8.3.jar
(18 KB at 9.2 KB/sec)
2017-05-05T21:49:35.032 [INFO] Downloading: https://repo.maven.apache.org/maven2/tomcat/jasper-compiler/5.5.23/jasper-compiler-5.5.23.jar
2017-05-05T21:49:35.049 [INFO] Downloaded: https://repo.maven.apache.org/maven2/org/codehaus/jackson/jackson-xc/1.8.3/jackson-xc-1.8.3.jar
(32 KB at 16.5 KB/sec)
2017-05-05T21:49:35.050 [INFO] Downloading: https://repo.maven.apache.org/maven2/tomcat/jasper-runtime/5.5.23/jasper-runtime-5.5.23.jar
2017-05-05T21:49:35.081 [INFO] Downloaded: https://repo.maven.apache.org/maven2/tomcat/jasper-runtime/5.5.23/jasper-runtime-5.5.23.jar
(76 KB at 38.7 KB/sec)
2017-05-05T21:49:35.081 [INFO] Downloading: https://repo.maven.apache.org/maven2/javax/servlet/jsp/jsp-api/2.1/jsp-api-2.1.jar
2017-05-05T21:49:35.090 [INFO] Downloaded: https://repo.maven.apache.org/maven2/org/apache/hadoop/hadoop-common/2.2.0/hadoop-common-2.2.0.jar
(2672 KB at 1370.0 KB/sec)
2017-05-05T21:49:35.090 [INFO] Downloading: https://repo.maven.apache.org/maven2/commons-el/commons-el/1.0/commons-el-1.0.jar
2017-05-05T21:49:35.097 [INFO] Downloaded: https://repo.maven.apache.org/maven2/org/scala-lang/scala-compiler/2.10.0/scala-compiler-2.10.0.jar
(13818 KB at 7060.7 KB/sec)
2017-05-05T21:49:35.097 [INFO] Downloading: https://repo.maven.apache.org/maven2/commons-lang/commons-lang/2.5/commons-lang-2.5.jar
2017-05-05T21:49:35.110 [INFO] Downloaded: https://repo.maven.apache.org/maven2/tomcat/jasper-compiler/5.5.23/jasper-compiler-5.5.23.jar
(399 KB at 202.3 KB/sec)
2017-05-05T21:49:35.110 [INFO] Downloading: https://repo.maven.apache.org/maven2/commons-configuration/commons-configuration/1.6/commons-configuration-1.6.jar
2017-05-05T21:49:35.121 [INFO] Downloaded: https://repo.maven.apache.org/maven2/javax/servlet/jsp/jsp-api/2.1/jsp-api-2.1.jar
(99 KB at 49.6 KB/sec)
2017-05-05T21:49:35.121 [INFO] Downloading: https://repo.maven.apache.org/maven2/commons-beanutils/commons-beanutils-core/1.8.0/commons-beanutils-core-1.8.0.jar
2017-05-05T21:49:35.126 [INFO] Downloaded: https://repo.maven.apache.org/maven2/commons-el/commons-el/1.0/commons-el-1.0.jar
(110 KB at 55.2 KB/sec)
2017-05-05T21:49:35.126 [INFO] Downloading: https://repo.maven.apache.org/maven2/org/codehaus/jackson/jackson-core-asl/1.8.8/jackson-core-asl-1.8.8.jar
2017-05-05T21:49:35.135 [INFO] Downloaded: https://repo.maven.apache.org/maven2/com/sun/xml/bind/jaxb-impl/2.2.3-1/jaxb-impl-2.2.3-1.jar
(870 KB at 435.7 KB/sec)
2017-05-05T21:49:35.135 [INFO] Downloading: https://repo.maven.apache.org/maven2/org/codehaus/jackson/jackson-mapper-asl/1.8.8/jackson-mapper-asl-1.8.8.jar
2017-05-05T21:49:35.146 [INFO] Downloaded: https://repo.maven.apache.org/maven2/commons-lang/commons-lang/2.5/commons-lang-2.5.jar
(273 KB at 135.9 KB/sec)
2017-05-05T21:49:35.146 [INFO] Downloading: https://repo.maven.apache.org/maven2/org/apache/hadoop/hadoop-auth/2.2.0/hadoop-auth-2.2.0.jar
2017-05-05T21:49:35.162 [INFO] Downloaded: https://repo.maven.apache.org/maven2/commons-configuration/commons-configuration/1.6/commons-configuration-1.6.jar
(292 KB at 144.3 KB/sec)
2017-05-05T21:49:35.162 [INFO] Downloading: https://repo.maven.apache.org/maven2/com/jcraft/jsch/0.1.42/jsch-0.1.42.jar
2017-05-05T21:49:35.171 [INFO] Downloaded: https://repo.maven.apache.org/maven2/org/codehaus/jackson/jackson-core-asl/1.8.8/jackson-core-asl-1.8.8.jar
(223 KB at 109.4 KB/sec)
2017-05-05T21:49:35.171 [INFO] Downloading: https://repo.maven.apache.org/maven2/org/apache/hadoop/hadoop-mapreduce-client-core/2.2.0/hadoop-mapreduce-client-core-2.2.0.jar
2017-05-05T21:49:35.176 [INFO] Downloaded: https://repo.maven.apache.org/maven2/org/apache/hadoop/hadoop-auth/2.2.0/hadoop-auth-2.2.0.jar
(49 KB at 23.9 KB/sec)
2017-05-05T21:49:35.176 [INFO] Downloading: https://repo.maven.apache.org/maven2/org/apache/hadoop/hadoop-yarn-common/2.2.0/hadoop-yarn-common-2.2.0.jar
2017-05-05T21:49:35.178 [INFO] Downloaded: https://repo.maven.apache.org/maven2/commons-beanutils/commons-beanutils-core/1.8.0/commons-beanutils-core-1.8.0.jar
(202 KB at 98.7 KB/sec)
2017-05-05T21:49:35.178 [INFO] Downloading: https://repo.maven.apache.org/maven2/com/google/inject/guice/3.0/guice-3.0.jar
2017-05-05T21:49:35.214 [INFO] Downloaded: https://repo.maven.apache.org/maven2/com/jcraft/jsch/0.1.42/jsch-0.1.42.jar
(182 KB at 87.5 KB/sec)
2017-05-05T21:49:35.214 [INFO] Downloading: https://repo.maven.apache.org/maven2/com/sun/jersey/jersey-test-framework/jersey-test-framework-grizzly2/1.9/jersey-test-framework-grizzly2-1.9.jar
2017-05-05T21:49:35.239 [INFO] Downloaded: https://repo.maven.apache.org/maven2/org/codehaus/jackson/jackson-mapper-asl/1.8.8/jackson-mapper-asl-1.8.8.jar
(653 KB at 311.1 KB/sec)
2017-05-05T21:49:35.239 [INFO] Downloading: https://repo.maven.apache.org/maven2/com/sun/jersey/jersey-test-framework/jersey-test-framework-core/1.9/jersey-test-framework-core-1.9.jar
2017-05-05T21:49:35.240 [INFO] Downloaded: https://repo.maven.apache.org/maven2/com/sun/jersey/jersey-test-framework/jersey-test-framework-grizzly2/1.9/jersey-test-framework-grizzly2-1.9.jar
(13 KB at 6.0 KB/sec)
2017-05-05T21:49:35.240 [INFO] Downloading: https://repo.maven.apache.org/maven2/javax/servlet/javax.servlet-api/3.0.1/javax.servlet-api-3.0.1.jar
2017-05-05T21:49:35.268 [INFO] Downloaded: https://repo.maven.apache.org/maven2/com/sun/jersey/jersey-test-framework/jersey-test-framework-core/1.9/jersey-test-framework-core-1.9.jar
(28 KB at 12.9 KB/sec)
2017-05-05T21:49:35.268 [INFO] Downloading: https://repo.maven.apache.org/maven2/com/sun/jersey/jersey-client/1.9/jersey-client-1.9.jar
2017-05-05T21:49:35.278 [INFO] Downloaded: https://repo.maven.apache.org/maven2/javax/servlet/javax.servlet-api/3.0.1/javax.servlet-api-3.0.1.jar
(84 KB at 39.0 KB/sec)
2017-05-05T21:49:35.278 [INFO] Downloading: https://repo.maven.apache.org/maven2/com/sun/jersey/jersey-grizzly2/1.9/jersey-grizzly2-1.9.jar
2017-05-05T21:49:35.280 [INFO] Downloaded: https://repo.maven.apache.org/maven2/com/google/inject/guice/3.0/guice-3.0.jar
(694 KB at 324.2 KB/sec)
2017-05-05T21:49:35.280 [INFO] Downloading: https://repo.maven.apache.org/maven2/org/glassfish/grizzly/grizzly-http/2.1.2/grizzly-http-2.1.2.jar
2017-05-05T21:49:35.305 [INFO] Downloaded: https://repo.maven.apache.org/maven2/com/sun/jersey/jersey-grizzly2/1.9/jersey-grizzly2-1.9.jar
(18 KB at 7.9 KB/sec)
2017-05-05T21:49:35.305 [INFO] Downloading: https://repo.maven.apache.org/maven2/org/glassfish/grizzly/grizzly-framework/2.1.2/grizzly-framework-2.1.2.jar
2017-05-05T21:49:35.311 [INFO] Downloaded: https://repo.maven.apache.org/maven2/com/sun/jersey/jersey-client/1.9/jersey-client-1.9.jar
(128 KB at 58.7 KB/sec)
2017-05-05T21:49:35.311 [INFO] Downloading: https://repo.maven.apache.org/maven2/org/glassfish/gmbal/gmbal-api-only/3.0.0-b023/gmbal-api-only-3.0.0-b023.jar
2017-05-05T21:49:35.327 [INFO] Downloaded: https://repo.maven.apache.org/maven2/org/apache/hadoop/hadoop-yarn-common/2.2.0/hadoop-yarn-common-2.2.0.jar
(1272 KB at 581.2 KB/sec)
2017-05-05T21:49:35.327 [INFO] Downloading: https://repo.maven.apache.org/maven2/org/glassfish/external/management-api/3.0.0-b012/management-api-3.0.0-b012.jar
2017-05-05T21:49:35.329 [INFO] Downloaded: https://repo.maven.apache.org/maven2/org/glassfish/grizzly/grizzly-http/2.1.2/grizzly-http-2.1.2.jar
(248 KB at 112.9 KB/sec)
2017-05-05T21:49:35.329 [INFO] Downloading: https://repo.maven.apache.org/maven2/org/glassfish/grizzly/grizzly-http-server/2.1.2/grizzly-http-server-2.1.2.jar
2017-05-05T21:49:35.340 [INFO] Downloaded: https://repo.maven.apache.org/maven2/org/glassfish/gmbal/gmbal-api-only/3.0.0-b023/gmbal-api-only-3.0.0-b023.jar
(22 KB at 9.7 KB/sec)
2017-05-05T21:49:35.340 [INFO] Downloading: https://repo.maven.apache.org/maven2/org/glassfish/grizzly/grizzly-rcm/2.1.2/grizzly-rcm-2.1.2.jar
2017-05-05T21:49:35.356 [INFO] Downloaded: https://repo.maven.apache.org/maven2/org/glassfish/external/management-api/3.0.0-b012/management-api-3.0.0-b012.jar
(42 KB at 18.6 KB/sec)
2017-05-05T21:49:35.356 [INFO] Downloading: https://repo.maven.apache.org/maven2/org/glassfish/grizzly/grizzly-http-servlet/2.1.2/grizzly-http-servlet-2.1.2.jar
2017-05-05T21:49:35.370 [INFO] Downloaded: https://repo.maven.apache.org/maven2/org/apache/hadoop/hadoop-mapreduce-client-core/2.2.0/hadoop-mapreduce-client-core-2.2.0.jar
(1421 KB at 637.2 KB/sec)
2017-05-05T21:49:35.370 [INFO] Downloading: https://repo.maven.apache.org/maven2/org/glassfish/javax.servlet/3.1/javax.servlet-3.1.jar
2017-05-05T21:49:35.371 [INFO] Downloaded: https://repo.maven.apache.org/maven2/org/glassfish/grizzly/grizzly-http-server/2.1.2/grizzly-http-server-2.1.2.jar
(194 KB at 86.8 KB/sec)
2017-05-05T21:49:35.371 [INFO] Downloading: https://repo.maven.apache.org/maven2/com/sun/jersey/contribs/jersey-guice/1.9/jersey-guice-1.9.jar
2017-05-05T21:49:35.378 [INFO] Downloaded: https://repo.maven.apache.org/maven2/org/glassfish/grizzly/grizzly-rcm/2.1.2/grizzly-rcm-2.1.2.jar
(8 KB at 3.5 KB/sec)
2017-05-05T21:49:35.378 [INFO] Downloading: https://repo.maven.apache.org/maven2/com/google/inject/extensions/guice-servlet/3.0/guice-servlet-3.0.jar
2017-05-05T21:49:35.402 [INFO] Downloaded: https://repo.maven.apache.org/maven2/com/sun/jersey/contribs/jersey-guice/1.9/jersey-guice-1.9.jar
(15 KB at 6.4 KB/sec)
2017-05-05T21:49:35.402 [INFO] Downloading: https://repo.maven.apache.org/maven2/io/netty/netty/3.6.2.Final/netty-3.6.2.Final.jar
2017-05-05T21:49:35.404 [INFO] Downloaded: https://repo.maven.apache.org/maven2/org/glassfish/javax.servlet/3.1/javax.servlet-3.1.jar
(82 KB at 36.2 KB/sec)
2017-05-05T21:49:35.404 [INFO] Downloading: https://repo.maven.apache.org/maven2/com/fasterxml/jackson/core/jackson-core/2.4.4/jackson-core-2.4.4.jar
2017-05-05T21:49:35.407 [INFO] Downloaded: https://repo.maven.apache.org/maven2/com/google/inject/extensions/guice-servlet/3.0/guice-servlet-3.0.jar
(64 KB at 28.0 KB/sec)
2017-05-05T21:49:35.407 [INFO] Downloading: https://repo.maven.apache.org/maven2/com/fasterxml/jackson/core/jackson-annotations/2.4.4/jackson-annotations-2.4.4.jar
2017-05-05T21:49:35.418 [INFO] Downloaded: https://repo.maven.apache.org/maven2/org/glassfish/grizzly/grizzly-framework/2.1.2/grizzly-framework-2.1.2.jar
(675 KB at 296.0 KB/sec)
2017-05-05T21:49:35.418 [INFO] Downloading: https://repo.maven.apache.org/maven2/com/fasterxml/jackson/core/jackson-databind/2.4.4/jackson-databind-2.4.4.jar
2017-05-05T21:49:35.428 [INFO] Downloaded: https://repo.maven.apache.org/maven2/org/glassfish/grizzly/grizzly-http-servlet/2.1.2/grizzly-http-servlet-2.1.2.jar
(330 KB at 143.8 KB/sec)
2017-05-05T21:49:35.428 [INFO] Downloading: https://repo.maven.apache.org/maven2/org/apache/zookeeper/zookeeper/3.4.6/zookeeper-3.4.6.jar
2017-05-05T21:49:35.436 [INFO] Downloaded: https://repo.maven.apache.org/maven2/com/fasterxml/jackson/core/jackson-annotations/2.4.4/jackson-annotations-2.4.4.jar
(38 KB at 16.4 KB/sec)
2017-05-05T21:49:35.436 [INFO] Downloading: https://repo.maven.apache.org/maven2/jline/jline/0.9.94/jline-0.9.94.jar
2017-05-05T21:49:35.481 [INFO] Downloaded: https://repo.maven.apache.org/maven2/com/fasterxml/jackson/core/jackson-core/2.4.4/jackson-core-2.4.4.jar
(221 KB at 94.0 KB/sec)
2017-05-05T21:49:35.482 [INFO] Downloading: https://repo.maven.apache.org/maven2/org/scala-lang/scala-library/2.10.5/scala-library-2.10.5.jar
2017-05-05T21:49:35.495 [INFO] Downloaded: https://repo.maven.apache.org/maven2/jline/jline/0.9.94/jline-0.9.94.jar
(86 KB at 36.2 KB/sec)
2017-05-05T21:49:35.495 [INFO] Downloading: https://repo.maven.apache.org/maven2/io/dropwizard/metrics/metrics-core/3.1.2/metrics-core-3.1.2.jar
2017-05-05T21:49:35.552 [INFO] Downloaded: https://repo.maven.apache.org/maven2/io/dropwizard/metrics/metrics-core/3.1.2/metrics-core-3.1.2.jar
(110 KB at 45.6 KB/sec)
2017-05-05T21:49:35.552 [INFO] Downloading: https://repo.maven.apache.org/maven2/org/apache/kafka/kafka_2.10/0.9.0.1/kafka_2.10-0.9.0.1.jar
2017-05-05T21:49:35.657 [INFO] Downloaded: https://repo.maven.apache.org/maven2/org/apache/zookeeper/zookeeper/3.4.6/zookeeper-3.4.6.jar
(775 KB at 307.7 KB/sec)
2017-05-05T21:49:35.657 [INFO] Downloading: https://repo.maven.apache.org/maven2/com/101tec/zkclient/0.7/zkclient-0.7.jar
2017-05-05T21:49:35.693 [INFO] Downloaded: https://repo.maven.apache.org/maven2/com/101tec/zkclient/0.7/zkclient-0.7.jar
(73 KB at 28.2 KB/sec)
2017-05-05T21:49:35.694 [INFO] Downloading: https://repo.maven.apache.org/maven2/com/yammer/metrics/metrics-core/2.2.0/metrics-core-2.2.0.jar
2017-05-05T21:49:35.736 [INFO] Downloaded: https://repo.maven.apache.org/maven2/com/yammer/metrics/metrics-core/2.2.0/metrics-core-2.2.0.jar
(81 KB at 30.9 KB/sec)
2017-05-05T21:49:35.737 [INFO] Downloading: https://repo.maven.apache.org/maven2/net/sf/jopt-simple/jopt-simple/3.2/jopt-simple-3.2.jar
2017-05-05T21:49:35.749 [INFO] Downloaded: https://repo.maven.apache.org/maven2/io/netty/netty/3.6.2.Final/netty-3.6.2.Final.jar
(1172 KB at 449.0 KB/sec)
2017-05-05T21:49:35.749 [INFO] Downloading: https://repo.maven.apache.org/maven2/com/fasterxml/jackson/dataformat/jackson-dataformat-yaml/2.4.4/jackson-dataformat-yaml-2.4.4.jar
2017-05-05T21:49:35.755 [INFO] Downloaded: https://repo.maven.apache.org/maven2/com/fasterxml/jackson/core/jackson-databind/2.4.4/jackson-databind-2.4.4.jar
(1052 KB at 402.2 KB/sec)
2017-05-05T21:49:35.755 [INFO] Downloading: https://repo.maven.apache.org/maven2/org/yaml/snakeyaml/1.12/snakeyaml-1.12.jar
2017-05-05T21:49:35.791 [INFO] Downloaded: https://repo.maven.apache.org/maven2/net/sf/jopt-simple/jopt-simple/3.2/jopt-simple-3.2.jar
(52 KB at 19.6 KB/sec)
2017-05-05T21:49:35.849 [INFO] Downloaded: https://repo.maven.apache.org/maven2/org/yaml/snakeyaml/1.12/snakeyaml-1.12.jar
(265 KB at 97.6 KB/sec)
2017-05-05T21:49:35.866 [INFO] Downloaded: https://repo.maven.apache.org/maven2/com/fasterxml/jackson/dataformat/jackson-dataformat-yaml/2.4.4/jackson-dataformat-yaml-2.4.4.jar
(314 KB at 114.9 KB/sec)
2017-05-05T21:49:36.341 [INFO] Downloaded: https://repo.maven.apache.org/maven2/org/apache/kafka/kafka_2.10/0.9.0.1/kafka_2.10-0.9.0.1.jar
(4859 KB at 1517.7 KB/sec)
2017-05-05T21:49:36.597 [INFO] Downloaded: https://repo.maven.apache.org/maven2/org/scala-lang/scala-library/2.10.5/scala-library-2.10.5.jar
(6964 KB at 2014.4 KB/sec)
2017-05-05T21:49:36.642 [INFO] 
2017-05-05T21:49:36.642 [INFO] --- maven-clean-plugin:3.0.0:clean (default-clean) @ beam-runners-spark
---
2017-05-05T21:49:36.644 [INFO] Deleting <https://builds.apache.org/job/beam_PostCommit_Java_ValidatesRunner_Spark/ws/runners/spark>
(includes = [**/*.pyc, **/*.egg-info/, **/sdks/python/LICENSE, **/sdks/python/NOTICE], excludes
= [])
2017-05-05T21:49:37.752 [INFO] 
2017-05-05T21:49:37.752 [INFO] --- maven-enforcer-plugin:1.4.1:enforce (enforce) @ beam-runners-spark
---
2017-05-05T21:49:43.465 [INFO] 
2017-05-05T21:49:43.465 [INFO] --- maven-remote-resources-plugin:1.5:process (process-resource-bundles)
@ beam-runners-spark ---
2017-05-05T21:49:43.856 [INFO] 
2017-05-05T21:49:43.857 [INFO] --- maven-resources-plugin:3.0.2:resources (default-resources)
@ beam-runners-spark ---
2017-05-05T21:49:43.864 [INFO] Using 'UTF-8' encoding to copy filtered resources.
2017-05-05T21:49:43.865 [INFO] skip non existing resourceDirectory <https://builds.apache.org/job/beam_PostCommit_Java_ValidatesRunner_Spark/ws/runners/spark/src/main/resources>
2017-05-05T21:49:43.866 [INFO] Copying 3 resources
2017-05-05T21:49:43.957 [INFO] 
2017-05-05T21:49:43.957 [INFO] --- maven-compiler-plugin:3.6.1:compile (default-compile) @
beam-runners-spark ---
2017-05-05T21:49:43.972 [INFO] Changes detected - recompiling the module!
2017-05-05T21:49:43.973 [INFO] Compiling 81 source files to <https://builds.apache.org/job/beam_PostCommit_Java_ValidatesRunner_Spark/ws/runners/spark/target/classes>
2017-05-05T21:49:44.570 [INFO] -------------------------------------------------------------
2017-05-05T21:49:44.571 [WARNING] COMPILATION WARNING : 
2017-05-05T21:49:44.571 [INFO] -------------------------------------------------------------
2017-05-05T21:49:44.571 [WARNING] bootstrap class path not set in conjunction with -source
1.7
2017-05-05T21:49:44.571 [INFO] 1 warning
2017-05-05T21:49:44.571 [INFO] -------------------------------------------------------------
2017-05-05T21:49:44.571 [INFO] -------------------------------------------------------------
2017-05-05T21:49:44.571 [ERROR] COMPILATION ERROR : 
2017-05-05T21:49:44.571 [INFO] -------------------------------------------------------------
2017-05-05T21:49:44.571 [ERROR] <https://builds.apache.org/job/beam_PostCommit_Java_ValidatesRunner_Spark/ws/runners/spark/src/main/java/org/apache/beam/runners/spark/translation/SparkRuntimeContext.java>:[30,32]
cannot find symbol
  symbol:   class IOChannelUtils
  location: package org.apache.beam.sdk.util
2017-05-05T21:49:44.571 [INFO] 1 error
2017-05-05T21:49:44.571 [INFO] -------------------------------------------------------------
[JENKINS] Archiving disabled
[JENKINS] Archiving disabled
[JENKINS] Archiving disabled
[JENKINS] Archiving disabled
[JENKINS] Archiving disabled
[JENKINS] Archiving disabled
[JENKINS] Archiving disabled
[JENKINS] Archiving disabled
[JENKINS] Archiving disabled
[JENKINS] Archiving disabled
[JENKINS] Archiving disabled
[JENKINS] Archiving disabled
[JENKINS] Archiving disabled
[JENKINS] Archiving disabled
[JENKINS] Archiving disabled
[JENKINS] Archiving disabled
2017-05-05T21:50:10.689 [INFO] ------------------------------------------------------------------------
2017-05-05T21:50:10.689 [INFO] Reactor Summary:
2017-05-05T21:50:10.689 [INFO] 
2017-05-05T21:50:10.689 [INFO] Apache Beam :: Parent .............................. SUCCESS
[ 22.684 s]
2017-05-05T21:50:10.689 [INFO] Apache Beam :: SDKs :: Java :: Build Tools ......... SUCCESS
[ 10.426 s]
2017-05-05T21:50:10.689 [INFO] Apache Beam :: SDKs ................................ SUCCESS
[  2.159 s]
2017-05-05T21:50:10.689 [INFO] Apache Beam :: SDKs :: Common ...................... SUCCESS
[  2.411 s]
2017-05-05T21:50:10.689 [INFO] Apache Beam :: SDKs :: Common :: Fn API ............ SUCCESS
[ 11.521 s]
2017-05-05T21:50:10.689 [INFO] Apache Beam :: SDKs :: Common :: Runner API ........ SUCCESS
[  5.505 s]
2017-05-05T21:50:10.689 [INFO] Apache Beam :: SDKs :: Java ........................ SUCCESS
[  1.739 s]
2017-05-05T21:50:10.689 [INFO] Apache Beam :: SDKs :: Java :: Core ................ SUCCESS
[02:03 min]
2017-05-05T21:50:10.690 [INFO] Apache Beam :: SDKs :: Java :: IO .................. SUCCESS
[  3.189 s]
2017-05-05T21:50:10.690 [INFO] Apache Beam :: Runners ............................. SUCCESS
[  4.462 s]
2017-05-05T21:50:10.690 [INFO] Apache Beam :: Runners :: Core Construction Java ... SUCCESS
[ 14.482 s]
2017-05-05T21:50:10.690 [INFO] Apache Beam :: Runners :: Core Java ................ SUCCESS
[ 41.015 s]
2017-05-05T21:50:10.690 [INFO] Apache Beam :: Runners :: Direct Java .............. SUCCESS
[02:40 min]
2017-05-05T21:50:10.690 [INFO] Apache Beam :: SDKs :: Java :: IO :: Kafka ......... SUCCESS
[ 47.011 s]
2017-05-05T21:50:10.690 [INFO] Apache Beam :: Runners :: Spark .................... FAILURE
[ 29.240 s]
2017-05-05T21:50:10.690 [INFO] ------------------------------------------------------------------------
2017-05-05T21:50:10.690 [INFO] BUILD FAILURE
2017-05-05T21:50:10.690 [INFO] ------------------------------------------------------------------------
2017-05-05T21:50:10.690 [INFO] Total time: 12:40 min
2017-05-05T21:50:10.690 [INFO] Finished at: 2017-05-05T21:50:10+00:00
2017-05-05T21:50:13.690 [INFO] Final Memory: 130M/1771M
2017-05-05T21:50:13.690 [INFO] ------------------------------------------------------------------------
2017-05-05T21:50:13.690 [WARNING] The requested profile "validates-runner-tests" could not
be activated because it does not exist.
Waiting for Jenkins to finish collecting data
2017-05-05T21:53:43.040 [ERROR] Failed to execute goal org.apache.maven.plugins:maven-compiler-plugin:3.6.1:compile
(default-compile) on project beam-runners-spark: Compilation failure
2017-05-05T21:53:43.040 [ERROR] <https://builds.apache.org/job/beam_PostCommit_Java_ValidatesRunner_Spark/ws/runners/spark/src/main/java/org/apache/beam/runners/spark/translation/SparkRuntimeContext.java>:[30,32]
cannot find symbol
2017-05-05T21:53:43.040 [ERROR] symbol:   class IOChannelUtils
2017-05-05T21:53:43.040 [ERROR] location: package org.apache.beam.sdk.util
2017-05-05T21:53:43.040 [ERROR] -> [Help 1]
org.apache.maven.lifecycle.LifecycleExecutionException: Failed to execute goal org.apache.maven.plugins:maven-compiler-plugin:3.6.1:compile
(default-compile) on project beam-runners-spark: Compilation failure
<https://builds.apache.org/job/beam_PostCommit_Java_ValidatesRunner_Spark/ws/runners/spark/src/main/java/org/apache/beam/runners/spark/translation/SparkRuntimeContext.java>:[30,32]
cannot find symbol
  symbol:   class IOChannelUtils
  location: package org.apache.beam.sdk.util

	at org.apache.maven.lifecycle.internal.MojoExecutor.execute(MojoExecutor.java:212)
	at org.apache.maven.lifecycle.internal.MojoExecutor.execute(MojoExecutor.java:153)
	at org.apache.maven.lifecycle.internal.MojoExecutor.execute(MojoExecutor.java:145)
	at org.apache.maven.lifecycle.internal.LifecycleModuleBuilder.buildProject(LifecycleModuleBuilder.java:116)
	at org.apache.maven.lifecycle.internal.LifecycleModuleBuilder.buildProject(LifecycleModuleBuilder.java:80)
	at org.apache.maven.lifecycle.internal.builder.singlethreaded.SingleThreadedBuilder.build(SingleThreadedBuilder.java:51)
	at org.apache.maven.lifecycle.internal.LifecycleStarter.execute(LifecycleStarter.java:128)
	at org.apache.maven.DefaultMaven.doExecute(DefaultMaven.java:307)
	at org.apache.maven.DefaultMaven.doExecute(DefaultMaven.java:193)
	at org.apache.maven.DefaultMaven.execute(DefaultMaven.java:106)
	at org.jvnet.hudson.maven3.launcher.Maven33Launcher.main(Maven33Launcher.java:129)
	at sun.reflect.NativeMethodAccessorImpl.invoke0(Native Method)
	at sun.reflect.NativeMethodAccessorImpl.invoke(NativeMethodAccessorImpl.java:62)
	at sun.reflect.DelegatingMethodAccessorImpl.invoke(DelegatingMethodAccessorImpl.java:43)
	at java.lang.reflect.Method.invoke(Method.java:498)
	at org.codehaus.plexus.classworlds.launcher.Launcher.launchStandard(Launcher.java:330)
	at org.codehaus.plexus.classworlds.launcher.Launcher.launch(Launcher.java:238)
	at jenkins.maven3.agent.Maven33Main.launch(Maven33Main.java:176)
	at sun.reflect.NativeMethodAccessorImpl.invoke0(Native Method)
	at sun.reflect.NativeMethodAccessorImpl.invoke(NativeMethodAccessorImpl.java:62)
	at sun.reflect.DelegatingMethodAccessorImpl.invoke(DelegatingMethodAccessorImpl.java:43)
	at java.lang.reflect.Method.invoke(Method.java:498)
	at hudson.maven.Maven3Builder.call(Maven3Builder.java:139)
	at hudson.maven.Maven3Builder.call(Maven3Builder.java:70)
	at hudson.remoting.UserRequest.perform(UserRequest.java:153)
	at hudson.remoting.UserRequest.perform(UserRequest.java:50)
	at hudson.remoting.Request$2.run(Request.java:336)
	at hudson.remoting.InterceptingExecutorService$1.call(InterceptingExecutorService.java:68)
	at java.util.concurrent.FutureTask.run(FutureTask.java:266)
	at java.util.concurrent.ThreadPoolExecutor.runWorker(ThreadPoolExecutor.java:1142)
	at java.util.concurrent.ThreadPoolExecutor$Worker.run(ThreadPoolExecutor.java:617)
	at java.lang.Thread.run(Thread.java:745)
Caused by: org.apache.maven.plugin.compiler.CompilationFailureException: Compilation failure
<https://builds.apache.org/job/beam_PostCommit_Java_ValidatesRunner_Spark/ws/runners/spark/src/main/java/org/apache/beam/runners/spark/translation/SparkRuntimeContext.java>:[30,32]
cannot find symbol
  symbol:   class IOChannelUtils
  location: package org.apache.beam.sdk.util

	at org.apache.maven.plugin.compiler.AbstractCompilerMojo.execute(AbstractCompilerMojo.java:1029)
	at org.apache.maven.plugin.compiler.CompilerMojo.execute(CompilerMojo.java:137)
	at org.apache.maven.plugin.DefaultBuildPluginManager.executeMojo(DefaultBuildPluginManager.java:134)
	at org.apache.maven.lifecycle.internal.MojoExecutor.execute(MojoExecutor.java:208)
	... 31 more
2017-05-05T21:53:43.040 [ERROR] 
2017-05-05T21:53:43.041 [ERROR] Re-run Maven using the -X switch to enable full debug logging.
2017-05-05T21:53:43.041 [ERROR] 
2017-05-05T21:53:43.041 [ERROR] For more information about the errors and possible solutions,
please read the following articles:
2017-05-05T21:53:43.041 [ERROR] [Help 1] http://cwiki.apache.org/confluence/display/MAVEN/MojoFailureException
2017-05-05T21:53:43.041 [ERROR] 
2017-05-05T21:53:43.041 [ERROR] After correcting the problems, you can resume the build with
the command
2017-05-05T21:53:43.041 [ERROR]   mvn <goals> -rf :beam-runners-spark
channel stopped

Mime
View raw message