beam-commits mailing list archives

Site index · List index
Message view « Date » · « Thread »
Top « Date » · « Thread »
From Apache Jenkins Server <jenk...@builds.apache.org>
Subject Build failed in Jenkins: beam_PostCommit_Java_MavenInstall_Windows #54
Date Fri, 26 May 2017 01:32:40 GMT
See <https://builds.apache.org/job/beam_PostCommit_Java_MavenInstall_Windows/54/display/redirect?page=changes>

Changes:

[tgroh] Add CombineTranslation

[robertwb] More robust gen_protos on jenkins.

[tgroh] Clarify that PTransform#expand shouldn't be called

[klk] Fixup CombineTranslation

[kirpichov] Cleanups in SimpleDoFnRunner and ParDoEvaluator

[kirpichov] Fixes pb2.py path in gitignore

[robertwb] Additional explicit file cleanup in gen_protos.

------------------------------------------
[...truncated 254.28 KB...]
2017-05-26T01:31:19.251 [INFO] Downloading: https://repo.maven.apache.org/maven2/org/apache/maven/shared/maven-shared-utils/3.1.0/maven-shared-utils-3.1.0.pom
2017-05-26T01:31:19.259 [INFO] Downloaded: https://repo.maven.apache.org/maven2/org/apache/maven/shared/maven-shared-utils/3.1.0/maven-shared-utils-3.1.0.pom
(5 KB at 607.8 KB/sec)
2017-05-26T01:31:19.264 [INFO] Downloading: https://repo.maven.apache.org/maven2/org/apache/maven/shared/maven-artifact-transfer/0.9.1/maven-artifact-transfer-0.9.1.pom
2017-05-26T01:31:19.273 [INFO] Downloaded: https://repo.maven.apache.org/maven2/org/apache/maven/shared/maven-artifact-transfer/0.9.1/maven-artifact-transfer-0.9.1.pom
(8 KB at 825.6 KB/sec)
2017-05-26T01:31:19.278 [INFO] Downloading: https://repo.maven.apache.org/maven2/commons-lang/commons-lang/2.6/commons-lang-2.6.pom
2017-05-26T01:31:19.286 [INFO] Downloaded: https://repo.maven.apache.org/maven2/commons-lang/commons-lang/2.6/commons-lang-2.6.pom
(18 KB at 2135.5 KB/sec)
2017-05-26T01:31:19.290 [INFO] Downloading: https://repo.maven.apache.org/maven2/org/apache/commons/commons-parent/17/commons-parent-17.pom
2017-05-26T01:31:19.300 [INFO] Downloaded: https://repo.maven.apache.org/maven2/org/apache/commons/commons-parent/17/commons-parent-17.pom
(31 KB at 3045.4 KB/sec)
2017-05-26T01:31:19.305 [INFO] Downloading: https://repo.maven.apache.org/maven2/commons-collections/commons-collections/3.2.2/commons-collections-3.2.2.pom
2017-05-26T01:31:19.313 [INFO] Downloaded: https://repo.maven.apache.org/maven2/commons-collections/commons-collections/3.2.2/commons-collections-3.2.2.pom
(13 KB at 1514.0 KB/sec)
[WARNING] Failed to getClass for org.apache.maven.plugins.dependency.analyze.AnalyzeOnlyMojo
[JENKINS] Archiving disabled
2017-05-26T01:31:21.586 [INFO]                                                           
             
2017-05-26T01:31:21.587 [INFO] ------------------------------------------------------------------------
2017-05-26T01:31:21.587 [INFO] Skipping Apache Beam :: Parent
2017-05-26T01:31:21.587 [INFO] This project has been banned from the build due to previous
failures.
2017-05-26T01:31:21.587 [INFO] ------------------------------------------------------------------------
[JENKINS] Archiving disabled
[JENKINS] Archiving disabled
[JENKINS] Archiving disabled
[JENKINS] Archiving disabled
[JENKINS] Archiving disabled
[JENKINS] Archiving disabled
[JENKINS] Archiving disabled
[JENKINS] Archiving disabled
[JENKINS] Archiving disabled
[JENKINS] Archiving disabled
[JENKINS] Archiving disabled
[JENKINS] Archiving disabled
[JENKINS] Archiving disabled
[JENKINS] Archiving disabled
[JENKINS] Archiving disabled
[JENKINS] Archiving disabled
[JENKINS] Archiving disabled
[JENKINS] Archiving disabled
[JENKINS] Archiving disabled
[JENKINS] Archiving disabled
[JENKINS] Archiving disabled
[JENKINS] Archiving disabled
[JENKINS] Archiving disabled
[JENKINS] Archiving disabled
[JENKINS] Archiving disabled
[JENKINS] Archiving disabled
[JENKINS] Archiving disabled
[JENKINS] Archiving disabled
[JENKINS] Archiving disabled
[JENKINS] Archiving disabled
[JENKINS] Archiving disabled
[JENKINS] Archiving disabled
[JENKINS] Archiving disabled
[JENKINS] Archiving disabled
[JENKINS] Archiving disabled
[JENKINS] Archiving disabled
[JENKINS] Archiving disabled
[JENKINS] Archiving disabled
[JENKINS] Archiving disabled
[JENKINS] Archiving disabled
[JENKINS] Archiving disabled
[JENKINS] Archiving disabled
[JENKINS] Archiving disabled
[JENKINS] Archiving disabled
[JENKINS] Archiving disabled
[JENKINS] Archiving disabled
[JENKINS] Archiving disabled
[JENKINS] Archiving disabled
2017-05-26T01:31:50.407 [INFO] ------------------------------------------------------------------------
2017-05-26T01:31:50.407 [INFO] Reactor Summary:
2017-05-26T01:31:50.407 [INFO] 
2017-05-26T01:31:50.407 [INFO] Apache Beam :: Parent .............................. FAILURE
[ 19.518 s]
2017-05-26T01:31:50.407 [INFO] Apache Beam :: SDKs :: Java :: Build Tools ......... SKIPPED
2017-05-26T01:31:50.407 [INFO] Apache Beam :: SDKs ................................ SKIPPED
2017-05-26T01:31:50.407 [INFO] Apache Beam :: SDKs :: Common ...................... SKIPPED
2017-05-26T01:31:50.407 [INFO] Apache Beam :: SDKs :: Common :: Fn API ............ SKIPPED
2017-05-26T01:31:50.407 [INFO] Apache Beam :: SDKs :: Common :: Runner API ........ SKIPPED
2017-05-26T01:31:50.407 [INFO] Apache Beam :: SDKs :: Java ........................ SKIPPED
2017-05-26T01:31:50.407 [INFO] Apache Beam :: SDKs :: Java :: Core ................ SKIPPED
2017-05-26T01:31:50.407 [INFO] Apache Beam :: SDKs :: Java :: IO .................. SKIPPED
2017-05-26T01:31:50.407 [INFO] Apache Beam :: SDKs :: Java :: IO :: Common ........ SKIPPED
2017-05-26T01:31:50.408 [INFO] Apache Beam :: Runners ............................. SKIPPED
2017-05-26T01:31:50.408 [INFO] Apache Beam :: Runners :: Core Construction Java ... SKIPPED
2017-05-26T01:31:50.408 [INFO] Apache Beam :: Runners :: Core Java ................ SKIPPED
2017-05-26T01:31:50.408 [INFO] Apache Beam :: Runners :: Direct Java .............. SKIPPED
2017-05-26T01:31:50.408 [INFO] Apache Beam :: SDKs :: Java :: IO :: Elasticsearch . SKIPPED
2017-05-26T01:31:50.408 [INFO] Apache Beam :: SDKs :: Java :: Extensions .......... SKIPPED
2017-05-26T01:31:50.408 [INFO] Apache Beam :: SDKs :: Java :: Extensions :: Google Cloud Platform
Core SKIPPED
2017-05-26T01:31:50.408 [INFO] Apache Beam :: SDKs :: Java :: Extensions :: Protobuf SKIPPED
2017-05-26T01:31:50.408 [INFO] Apache Beam :: SDKs :: Java :: IO :: Google Cloud Platform
SKIPPED
2017-05-26T01:31:50.408 [INFO] Apache Beam :: SDKs :: Java :: IO :: Hadoop Common . SKIPPED
2017-05-26T01:31:50.408 [INFO] Apache Beam :: SDKs :: Java :: IO :: Hadoop File System SKIPPED
2017-05-26T01:31:50.408 [INFO] Apache Beam :: SDKs :: Java :: IO :: Hadoop ........ SKIPPED
2017-05-26T01:31:50.408 [INFO] Apache Beam :: SDKs :: Java :: IO :: Hadoop :: input-format
SKIPPED
2017-05-26T01:31:50.408 [INFO] Apache Beam :: SDKs :: Java :: IO :: Hadoop :: jdk1.8-tests
SKIPPED
2017-05-26T01:31:50.408 [INFO] Apache Beam :: SDKs :: Java :: IO :: HBase ......... SKIPPED
2017-05-26T01:31:50.408 [INFO] Apache Beam :: SDKs :: Java :: IO :: JDBC .......... SKIPPED
2017-05-26T01:31:50.408 [INFO] Apache Beam :: SDKs :: Java :: IO :: JMS ........... SKIPPED
2017-05-26T01:31:50.408 [INFO] Apache Beam :: SDKs :: Java :: IO :: Kafka ......... SKIPPED
2017-05-26T01:31:50.408 [INFO] Apache Beam :: SDKs :: Java :: IO :: Kinesis ....... SKIPPED
2017-05-26T01:31:50.408 [INFO] Apache Beam :: SDKs :: Java :: IO :: MongoDB ....... SKIPPED
2017-05-26T01:31:50.408 [INFO] Apache Beam :: SDKs :: Java :: IO :: MQTT .......... SKIPPED
2017-05-26T01:31:50.408 [INFO] Apache Beam :: SDKs :: Java :: IO :: XML ........... SKIPPED
2017-05-26T01:31:50.408 [INFO] Apache Beam :: SDKs :: Java :: Maven Archetypes .... SKIPPED
2017-05-26T01:31:50.408 [INFO] Apache Beam :: SDKs :: Java :: Maven Archetypes :: Starter
SKIPPED
2017-05-26T01:31:50.408 [INFO] Apache Beam :: SDKs :: Java :: Extensions :: Jackson SKIPPED
2017-05-26T01:31:50.408 [INFO] Apache Beam :: SDKs :: Java :: Extensions :: Join library SKIPPED
2017-05-26T01:31:50.408 [INFO] Apache Beam :: SDKs :: Java :: Extensions :: Sorter  SKIPPED
2017-05-26T01:31:50.408 [INFO] Apache Beam :: Runners :: Google Cloud Dataflow .... SKIPPED
2017-05-26T01:31:50.408 [INFO] Apache Beam :: SDKs :: Java :: Harness ............. SKIPPED
2017-05-26T01:31:50.408 [INFO] Apache Beam :: SDKs :: Java :: Java 8 Tests ........ SKIPPED
2017-05-26T01:31:50.408 [INFO] Apache Beam :: SDKs :: Python ...................... SKIPPED
2017-05-26T01:31:50.408 [INFO] Apache Beam :: Runners :: Flink .................... SKIPPED
2017-05-26T01:31:50.408 [INFO] Apache Beam :: Runners :: Spark .................... SKIPPED
2017-05-26T01:31:50.408 [INFO] Apache Beam :: Runners :: Apex ..................... SKIPPED
2017-05-26T01:31:50.408 [INFO] Apache Beam :: Examples ............................ SKIPPED
2017-05-26T01:31:50.408 [INFO] Apache Beam :: Examples :: Java .................... SKIPPED
2017-05-26T01:31:50.408 [INFO] Apache Beam :: Examples :: Java 8 .................. SKIPPED
2017-05-26T01:31:50.408 [INFO] Apache Beam :: SDKs :: Java :: Aggregated Javadoc .. SKIPPED
2017-05-26T01:31:50.408 [INFO] ------------------------------------------------------------------------
2017-05-26T01:31:50.409 [INFO] BUILD FAILURE
2017-05-26T01:31:50.409 [INFO] ------------------------------------------------------------------------
2017-05-26T01:31:50.409 [INFO] Total time: 01:11 min
2017-05-26T01:31:50.409 [INFO] Finished at: 2017-05-26T01:31:50+00:00
2017-05-26T01:31:50.671 [INFO] Final Memory: 62M/621M
2017-05-26T01:31:50.671 [INFO] ------------------------------------------------------------------------
2017-05-26T01:31:50.681 [ERROR] Failed to execute goal org.apache.maven.plugins:maven-dependency-plugin:3.0.1:analyze-only
(default) on project beam-parent: Execution default of goal org.apache.maven.plugins:maven-dependency-plugin:3.0.1:analyze-only
failed: Plugin org.apache.maven.plugins:maven-dependency-plugin:3.0.1 or one of its dependencies
could not be resolved: Failed to collect dependencies at org.apache.maven.plugins:maven-dependency-plugin:jar:3.0.1
-> org.apache.maven.reporting:maven-reporting-impl:jar:2.3: Failed to read artifact descriptor
for org.apache.maven.reporting:maven-reporting-impl:jar:2.3: Could not transfer artifact org.apache.maven.reporting:maven-reporting-impl:pom:2.3
from/to central (https://repo.maven.apache.org/maven2): Connection reset -> [Help 1]
org.apache.maven.lifecycle.LifecycleExecutionException: Failed to execute goal org.apache.maven.plugins:maven-dependency-plugin:3.0.1:analyze-only
(default) on project beam-parent: Execution default of goal org.apache.maven.plugins:maven-dependency-plugin:3.0.1:analyze-only
failed: Plugin org.apache.maven.plugins:maven-dependency-plugin:3.0.1 or one of its dependencies
could not be resolved: Failed to collect dependencies at org.apache.maven.plugins:maven-dependency-plugin:jar:3.0.1
-> org.apache.maven.reporting:maven-reporting-impl:jar:2.3
	at org.apache.maven.lifecycle.internal.MojoExecutor.execute(MojoExecutor.java:224)
	at org.apache.maven.lifecycle.internal.MojoExecutor.execute(MojoExecutor.java:153)
	at org.apache.maven.lifecycle.internal.MojoExecutor.execute(MojoExecutor.java:145)
	at org.apache.maven.lifecycle.internal.LifecycleModuleBuilder.buildProject(LifecycleModuleBuilder.java:116)
	at org.apache.maven.lifecycle.internal.LifecycleModuleBuilder.buildProject(LifecycleModuleBuilder.java:80)
	at org.apache.maven.lifecycle.internal.builder.singlethreaded.SingleThreadedBuilder.build(SingleThreadedBuilder.java:51)
	at org.apache.maven.lifecycle.internal.LifecycleStarter.execute(LifecycleStarter.java:128)
	at org.apache.maven.DefaultMaven.doExecute(DefaultMaven.java:307)
	at org.apache.maven.DefaultMaven.doExecute(DefaultMaven.java:193)
	at org.apache.maven.DefaultMaven.execute(DefaultMaven.java:106)
	at org.jvnet.hudson.maven3.launcher.Maven33Launcher.main(Maven33Launcher.java:129)
	at sun.reflect.NativeMethodAccessorImpl.invoke0(Native Method)
	at sun.reflect.NativeMethodAccessorImpl.invoke(NativeMethodAccessorImpl.java:62)
	at sun.reflect.DelegatingMethodAccessorImpl.invoke(DelegatingMethodAccessorImpl.java:43)
	at java.lang.reflect.Method.invoke(Method.java:498)
	at org.codehaus.plexus.classworlds.launcher.Launcher.launchStandard(Launcher.java:330)
	at org.codehaus.plexus.classworlds.launcher.Launcher.launch(Launcher.java:238)
	at jenkins.maven3.agent.Maven33Main.launch(Maven33Main.java:176)
	at sun.reflect.NativeMethodAccessorImpl.invoke0(Native Method)
	at sun.reflect.NativeMethodAccessorImpl.invoke(NativeMethodAccessorImpl.java:62)
	at sun.reflect.DelegatingMethodAccessorImpl.invoke(DelegatingMethodAccessorImpl.java:43)
	at java.lang.reflect.Method.invoke(Method.java:498)
	at hudson.maven.Maven3Builder.call(Maven3Builder.java:139)
	at hudson.maven.Maven3Builder.call(Maven3Builder.java:70)
	at hudson.remoting.UserRequest.perform(UserRequest.java:120)
	at hudson.remoting.UserRequest.perform(UserRequest.java:48)
	at hudson.remoting.Request$2.run(Request.java:326)
	at hudson.remoting.InterceptingExecutorService$1.call(InterceptingExecutorService.java:68)
	at java.util.concurrent.FutureTask.run(FutureTask.java:266)
	at java.util.concurrent.ThreadPoolExecutor.runWorker(ThreadPoolExecutor.java:1142)
	at java.util.concurrent.ThreadPoolExecutor$Worker.run(ThreadPoolExecutor.java:617)
	at java.lang.Thread.run(Thread.java:745)
Caused by: org.apache.maven.plugin.PluginExecutionException: Execution default of goal org.apache.maven.plugins:maven-dependency-plugin:3.0.1:analyze-only
failed: Plugin org.apache.maven.plugins:maven-dependency-plugin:3.0.1 or one of its dependencies
could not be resolved: Failed to collect dependencies at org.apache.maven.plugins:maven-dependency-plugin:jar:3.0.1
-> org.apache.maven.reporting:maven-reporting-impl:jar:2.3
	at org.apache.maven.plugin.DefaultBuildPluginManager.executeMojo(DefaultBuildPluginManager.java:106)
	at org.apache.maven.lifecycle.internal.MojoExecutor.execute(MojoExecutor.java:208)
	... 31 more
Caused by: org.apache.maven.plugin.PluginResolutionException: Plugin org.apache.maven.plugins:maven-dependency-plugin:3.0.1
or one of its dependencies could not be resolved: Failed to collect dependencies at org.apache.maven.plugins:maven-dependency-plugin:jar:3.0.1
-> org.apache.maven.reporting:maven-reporting-impl:jar:2.3
	at org.apache.maven.plugin.internal.DefaultPluginDependenciesResolver.resolveInternal(DefaultPluginDependenciesResolver.java:214)
	at org.apache.maven.plugin.internal.DefaultPluginDependenciesResolver.resolve(DefaultPluginDependenciesResolver.java:149)
	at org.apache.maven.plugin.internal.DefaultMavenPluginManager.createPluginRealm(DefaultMavenPluginManager.java:422)
	at org.apache.maven.plugin.internal.DefaultMavenPluginManager.setupPluginRealm(DefaultMavenPluginManager.java:385)
	at org.apache.maven.plugin.DefaultBuildPluginManager.getPluginRealm(DefaultBuildPluginManager.java:231)
	at org.apache.maven.plugin.DefaultBuildPluginManager.executeMojo(DefaultBuildPluginManager.java:102)
	... 32 more
Caused by: org.eclipse.aether.collection.DependencyCollectionException: Failed to collect
dependencies at org.apache.maven.plugins:maven-dependency-plugin:jar:3.0.1 -> org.apache.maven.reporting:maven-reporting-impl:jar:2.3
	at org.eclipse.aether.internal.impl.DefaultDependencyCollector.collectDependencies(DefaultDependencyCollector.java:291)
	at org.eclipse.aether.internal.impl.DefaultRepositorySystem.collectDependencies(DefaultRepositorySystem.java:316)
	at org.apache.maven.plugin.internal.DefaultPluginDependenciesResolver.resolveInternal(DefaultPluginDependenciesResolver.java:202)
	... 37 more
Caused by: org.eclipse.aether.resolution.ArtifactDescriptorException: Failed to read artifact
descriptor for org.apache.maven.reporting:maven-reporting-impl:jar:2.3
	at org.apache.maven.repository.internal.DefaultArtifactDescriptorReader.loadPom(DefaultArtifactDescriptorReader.java:302)
	at org.apache.maven.repository.internal.DefaultArtifactDescriptorReader.readArtifactDescriptor(DefaultArtifactDescriptorReader.java:218)
	at org.eclipse.aether.internal.impl.DefaultDependencyCollector.resolveCachedArtifactDescriptor(DefaultDependencyCollector.java:535)
	at org.eclipse.aether.internal.impl.DefaultDependencyCollector.getArtifactDescriptorResult(DefaultDependencyCollector.java:519)
	at org.eclipse.aether.internal.impl.DefaultDependencyCollector.processDependency(DefaultDependencyCollector.java:409)
	at org.eclipse.aether.internal.impl.DefaultDependencyCollector.processDependency(DefaultDependencyCollector.java:363)
	at org.eclipse.aether.internal.impl.DefaultDependencyCollector.process(DefaultDependencyCollector.java:351)
	at org.eclipse.aether.internal.impl.DefaultDependencyCollector.collectDependencies(DefaultDependencyCollector.java:254)
	... 39 more
Caused by: org.eclipse.aether.resolution.ArtifactResolutionException: Could not transfer artifact
org.apache.maven.reporting:maven-reporting-impl:pom:2.3 from/to central (https://repo.maven.apache.org/maven2):
Connection reset
	at org.eclipse.aether.internal.impl.DefaultArtifactResolver.resolve(DefaultArtifactResolver.java:444)
	at org.eclipse.aether.internal.impl.DefaultArtifactResolver.resolveArtifacts(DefaultArtifactResolver.java:246)
	at org.eclipse.aether.internal.impl.DefaultArtifactResolver.resolveArtifact(DefaultArtifactResolver.java:223)
	at org.apache.maven.repository.internal.DefaultArtifactDescriptorReader.loadPom(DefaultArtifactDescriptorReader.java:287)
	... 46 more
Caused by: org.eclipse.aether.transfer.ArtifactTransferException: Could not transfer artifact
org.apache.maven.reporting:maven-reporting-impl:pom:2.3 from/to central (https://repo.maven.apache.org/maven2):
Connection reset
	at org.eclipse.aether.connector.basic.ArtifactTransportListener.transferFailed(ArtifactTransportListener.java:43)
	at org.eclipse.aether.connector.basic.BasicRepositoryConnector$TaskRunner.run(BasicRepositoryConnector.java:355)
	at org.eclipse.aether.util.concurrency.RunnableErrorForwarder$1.run(RunnableErrorForwarder.java:67)
	at org.eclipse.aether.connector.basic.BasicRepositoryConnector$DirectExecutor.execute(BasicRepositoryConnector.java:581)
	at org.eclipse.aether.connector.basic.BasicRepositoryConnector.get(BasicRepositoryConnector.java:249)
	at org.eclipse.aether.internal.impl.DefaultArtifactResolver.performDownloads(DefaultArtifactResolver.java:520)
	at org.eclipse.aether.internal.impl.DefaultArtifactResolver.resolve(DefaultArtifactResolver.java:421)
	... 49 more
Caused by: org.apache.maven.wagon.TransferFailedException: Connection reset
	at org.apache.maven.wagon.providers.http.AbstractHttpClientWagon.fillInputData(AbstractHttpClientWagon.java:1066)
	at org.apache.maven.wagon.providers.http.AbstractHttpClientWagon.fillInputData(AbstractHttpClientWagon.java:960)
	at org.apache.maven.wagon.StreamWagon.getInputStream(StreamWagon.java:116)
	at org.apache.maven.wagon.StreamWagon.getIfNewer(StreamWagon.java:88)
	at org.apache.maven.wagon.StreamWagon.get(StreamWagon.java:61)
	at org.eclipse.aether.transport.wagon.WagonTransporter$GetTaskRunner.run(WagonTransporter.java:560)
	at org.eclipse.aether.transport.wagon.WagonTransporter.execute(WagonTransporter.java:427)
	at org.eclipse.aether.transport.wagon.WagonTransporter.get(WagonTransporter.java:404)
	at org.eclipse.aether.connector.basic.BasicRepositoryConnector$GetTaskRunner.runTask(BasicRepositoryConnector.java:447)
	at org.eclipse.aether.connector.basic.BasicRepositoryConnector$TaskRunner.run(BasicRepositoryConnector.java:350)
	... 54 more
Caused by: java.net.SocketException: Connection reset
	at java.net.SocketInputStream.read(SocketInputStream.java:210)
	at java.net.SocketInputStream.read(SocketInputStream.java:141)
	at sun.security.ssl.InputRecord.readFully(InputRecord.java:465)
	at sun.security.ssl.InputRecord.read(InputRecord.java:503)
	at sun.security.ssl.SSLSocketImpl.readRecord(SSLSocketImpl.java:973)
	at sun.security.ssl.SSLSocketImpl.readDataRecord(SSLSocketImpl.java:930)
	at sun.security.ssl.AppInputStream.read(AppInputStream.java:105)
	at org.apache.maven.wagon.providers.http.httpclient.impl.io.SessionInputBufferImpl.streamRead(SessionInputBufferImpl.java:136)
	at org.apache.maven.wagon.providers.http.httpclient.impl.io.SessionInputBufferImpl.fillBuffer(SessionInputBufferImpl.java:152)
	at org.apache.maven.wagon.providers.http.httpclient.impl.io.SessionInputBufferImpl.readLine(SessionInputBufferImpl.java:270)
	at org.apache.maven.wagon.providers.http.httpclient.impl.conn.DefaultHttpResponseParser.parseHead(DefaultHttpResponseParser.java:140)
	at org.apache.maven.wagon.providers.http.httpclient.impl.conn.DefaultHttpResponseParser.parseHead(DefaultHttpResponseParser.java:57)
	at org.apache.maven.wagon.providers.http.httpclient.impl.io.AbstractMessageParser.parse(AbstractMessageParser.java:260)
	at org.apache.maven.wagon.providers.http.httpclient.impl.DefaultBHttpClientConnection.receiveResponseHeader(DefaultBHttpClientConnection.java:161)
	at org.apache.maven.wagon.providers.http.httpclient.impl.conn.CPoolProxy.receiveResponseHeader(CPoolProxy.java:153)
	at org.apache.maven.wagon.providers.http.httpclient.protocol.HttpRequestExecutor.doReceiveResponse(HttpRequestExecutor.java:271)
	at org.apache.maven.wagon.providers.http.httpclient.protocol.HttpRequestExecutor.execute(HttpRequestExecutor.java:123)
	at org.apache.maven.wagon.providers.http.httpclient.impl.execchain.MainClientExec.execute(MainClientExec.java:254)
	at org.apache.maven.wagon.providers.http.httpclient.impl.execchain.ProtocolExec.execute(ProtocolExec.java:195)
	at org.apache.maven.wagon.providers.http.httpclient.impl.execchain.RetryExec.execute(RetryExec.java:86)
	at org.apache.maven.wagon.providers.http.httpclient.impl.execchain.RedirectExec.execute(RedirectExec.java:108)
	at org.apache.maven.wagon.providers.http.httpclient.impl.client.InternalHttpClient.doExecute(InternalHttpClient.java:184)
	at org.apache.maven.wagon.providers.http.httpclient.impl.client.CloseableHttpClient.execute(CloseableHttpClient.java:82)
	at org.apache.maven.wagon.providers.http.AbstractHttpClientWagon.execute(AbstractHttpClientWagon.java:832)
	at org.apache.maven.wagon.providers.http.AbstractHttpClientWagon.fillInputData(AbstractHttpClientWagon.java:983)
	... 63 more
2017-05-26T01:31:50.685 [ERROR] 
2017-05-26T01:31:50.686 [ERROR] Re-run Maven using the -X switch to enable full debug logging.
2017-05-26T01:31:50.686 [ERROR] 
2017-05-26T01:31:50.686 [ERROR] For more information about the errors and possible solutions,
please read the following articles:
2017-05-26T01:31:50.686 [ERROR] [Help 1] http://cwiki.apache.org/confluence/display/MAVEN/PluginResolutionException
channel stopped
Not sending mail to unregistered user mingmxu@ebay.com
Not sending mail to unregistered user kirpichov@google.com
Not sending mail to unregistered user github@nakomis.com
Not sending mail to unregistered user klk@google.com
Not sending mail to unregistered user sourabhbajaj@google.com

Mime
View raw message