beam-commits mailing list archives

Site index · List index
Message view « Date » · « Thread »
Top « Date » · « Thread »
From Apache Jenkins Server <jenk...@builds.apache.org>
Subject Build failed in Jenkins: beam_PostCommit_Java_ValidatesRunner_Flink #2901
Date Tue, 23 May 2017 01:45:43 GMT
See <https://builds.apache.org/job/beam_PostCommit_Java_ValidatesRunner_Flink/2901/display/redirect?page=changes>

Changes:

[klk] Add WindowIntoTranslator

------------------------------------------
[...truncated 400.23 KB...]
2017-05-23T01:44:37.586 [INFO] Tests run: 4, Failures: 0, Errors: 0, Skipped: 0, Time elapsed:
0.014 s - in org.apache.beam.sdk.util.SerializableUtilsTest
2017-05-23T01:44:37.588 [INFO] Running org.apache.beam.sdk.util.NumberedShardedFileTest
2017-05-23T01:44:37.715 [INFO] Tests run: 9, Failures: 0, Errors: 0, Skipped: 0, Time elapsed:
0.125 s - in org.apache.beam.sdk.util.NumberedShardedFileTest
2017-05-23T01:44:37.715 [INFO] Running org.apache.beam.sdk.util.UnownedOutputStreamTest
2017-05-23T01:44:37.717 [INFO] Tests run: 2, Failures: 0, Errors: 0, Skipped: 0, Time elapsed:
0 s - in org.apache.beam.sdk.util.UnownedOutputStreamTest
2017-05-23T01:44:37.717 [INFO] Running org.apache.beam.sdk.util.CombineFnUtilTest
2017-05-23T01:44:37.731 [INFO] Tests run: 3, Failures: 0, Errors: 0, Skipped: 0, Time elapsed:
0.012 s - in org.apache.beam.sdk.util.CombineFnUtilTest
2017-05-23T01:44:37.732 [INFO] Running org.apache.beam.sdk.util.BucketingFunctionTest
2017-05-23T01:44:37.734 [INFO] Tests run: 4, Failures: 0, Errors: 0, Skipped: 0, Time elapsed:
0 s - in org.apache.beam.sdk.util.BucketingFunctionTest
2017-05-23T01:44:37.735 [INFO] Running org.apache.beam.sdk.util.NameUtilsTest
2017-05-23T01:44:37.741 [INFO] Tests run: 11, Failures: 0, Errors: 0, Skipped: 0, Time elapsed:
0.004 s - in org.apache.beam.sdk.util.NameUtilsTest
2017-05-23T01:44:37.742 [INFO] Running org.apache.beam.sdk.util.UserCodeExceptionTest
2017-05-23T01:44:37.757 [INFO] Tests run: 8, Failures: 0, Errors: 0, Skipped: 0, Time elapsed:
0.012 s - in org.apache.beam.sdk.util.UserCodeExceptionTest
2017-05-23T01:44:37.757 [INFO] Running org.apache.beam.sdk.util.MovingFunctionTest
2017-05-23T01:44:37.759 [INFO] Tests run: 5, Failures: 0, Errors: 0, Skipped: 0, Time elapsed:
0 s - in org.apache.beam.sdk.util.MovingFunctionTest
2017-05-23T01:44:38.331 [INFO] 
2017-05-23T01:44:38.331 [INFO] Results:
2017-05-23T01:44:38.331 [INFO] 
2017-05-23T01:44:38.331 [WARNING] Tests run: 2311, Failures: 0, Errors: 0, Skipped: 1
2017-05-23T01:44:38.331 [INFO] 
[JENKINS] Recording test results
2017-05-23T01:45:08.874 [INFO] 
2017-05-23T01:45:08.874 [INFO] --- jacoco-maven-plugin:0.7.8:report (report) @ beam-sdks-java-core
---
2017-05-23T01:45:08.983 [INFO] Loading execution data file <https://builds.apache.org/job/beam_PostCommit_Java_ValidatesRunner_Flink/ws/sdks/java/core/target/jacoco.exec>
2017-05-23T01:45:09.586 [INFO] Analyzed bundle 'Apache Beam :: SDKs :: Java :: Core' with
1037 classes
2017-05-23T01:45:12.095 [INFO] 
2017-05-23T01:45:12.095 [INFO] --- build-helper-maven-plugin:3.0.0:regex-properties (render-artifact-id)
@ beam-sdks-java-core ---
2017-05-23T01:45:12.235 [INFO] 
2017-05-23T01:45:12.235 [INFO] --- maven-jar-plugin:3.0.2:jar (default-jar) @ beam-sdks-java-core
---
2017-05-23T01:45:12.455 [INFO] Building jar: <https://builds.apache.org/job/beam_PostCommit_Java_ValidatesRunner_Flink/ws/sdks/java/core/target/beam-sdks-java-core-2.1.0-SNAPSHOT.jar>
2017-05-23T01:45:12.722 [INFO] 
2017-05-23T01:45:12.722 [INFO] --- maven-site-plugin:3.5.1:attach-descriptor (attach-descriptor)
@ beam-sdks-java-core ---
2017-05-23T01:45:15.286 [INFO] 
2017-05-23T01:45:15.286 [INFO] --- maven-jar-plugin:3.0.2:test-jar (default-test-jar) @ beam-sdks-java-core
---
2017-05-23T01:45:15.452 [INFO] Building jar: <https://builds.apache.org/job/beam_PostCommit_Java_ValidatesRunner_Flink/ws/sdks/java/core/target/beam-sdks-java-core-2.1.0-SNAPSHOT-tests.jar>
2017-05-23T01:45:15.615 [INFO] 
2017-05-23T01:45:15.615 [INFO] --- maven-shade-plugin:3.0.0:shade (bundle-and-repackage) @
beam-sdks-java-core ---
2017-05-23T01:45:15.623 [INFO] Including com.google.guava:guava:jar:20.0 in the shaded jar.
2017-05-23T01:45:15.623 [INFO] Including com.google.protobuf:protobuf-java:jar:3.2.0 in the
shaded jar.
2017-05-23T01:45:15.623 [INFO] Excluding com.google.code.findbugs:jsr305:jar:3.0.1 from the
shaded jar.
2017-05-23T01:45:15.623 [INFO] Excluding com.fasterxml.jackson.core:jackson-core:jar:2.8.8
from the shaded jar.
2017-05-23T01:45:15.623 [INFO] Excluding com.fasterxml.jackson.core:jackson-annotations:jar:2.8.8
from the shaded jar.
2017-05-23T01:45:15.623 [INFO] Excluding com.fasterxml.jackson.core:jackson-databind:jar:2.8.8
from the shaded jar.
2017-05-23T01:45:15.623 [INFO] Excluding org.slf4j:slf4j-api:jar:1.7.14 from the shaded jar.
2017-05-23T01:45:15.623 [INFO] Including net.bytebuddy:byte-buddy:jar:1.6.8 in the shaded
jar.
2017-05-23T01:45:15.623 [INFO] Excluding org.apache.avro:avro:jar:1.8.1 from the shaded jar.
2017-05-23T01:45:15.623 [INFO] Excluding org.codehaus.jackson:jackson-core-asl:jar:1.9.13
from the shaded jar.
2017-05-23T01:45:15.623 [INFO] Excluding org.codehaus.jackson:jackson-mapper-asl:jar:1.9.13
from the shaded jar.
2017-05-23T01:45:15.623 [INFO] Excluding com.thoughtworks.paranamer:paranamer:jar:2.7 from
the shaded jar.
2017-05-23T01:45:15.623 [INFO] Excluding org.xerial.snappy:snappy-java:jar:1.1.4-M3 from the
shaded jar.
2017-05-23T01:45:15.623 [INFO] Including org.apache.commons:commons-compress:jar:1.9 in the
shaded jar.
2017-05-23T01:45:15.623 [INFO] Including org.apache.commons:commons-lang3:jar:3.5 in the shaded
jar.
2017-05-23T01:45:15.623 [INFO] Excluding joda-time:joda-time:jar:2.4 from the shaded jar.
2017-05-23T01:45:15.623 [INFO] Excluding org.tukaani:xz:jar:1.5 from the shaded jar.
2017-05-23T01:45:15.623 [INFO] Excluding com.google.auto.service:auto-service:jar:1.0-rc2
from the shaded jar.
2017-05-23T01:45:15.623 [INFO] Excluding com.google.auto:auto-common:jar:0.3 from the shaded
jar.
2017-05-23T01:45:27.873 [INFO] Replacing original artifact with shaded artifact.
2017-05-23T01:45:27.873 [INFO] Replacing <https://builds.apache.org/job/beam_PostCommit_Java_ValidatesRunner_Flink/ws/sdks/java/core/target/beam-sdks-java-core-2.1.0-SNAPSHOT.jar>
with <https://builds.apache.org/job/beam_PostCommit_Java_ValidatesRunner_Flink/ws/sdks/java/core/target/beam-sdks-java-core-2.1.0-SNAPSHOT-shaded.jar>
2017-05-23T01:45:27.873 [INFO] Replacing original test artifact with shaded test artifact.
2017-05-23T01:45:27.873 [INFO] Replacing <https://builds.apache.org/job/beam_PostCommit_Java_ValidatesRunner_Flink/ws/sdks/java/core/target/beam-sdks-java-core-2.1.0-SNAPSHOT-tests.jar>
with <https://builds.apache.org/job/beam_PostCommit_Java_ValidatesRunner_Flink/ws/sdks/java/core/target/beam-sdks-java-core-2.1.0-SNAPSHOT-shaded-tests.jar>
2017-05-23T01:45:27.873 [INFO] Dependency-reduced POM written at: <https://builds.apache.org/job/beam_PostCommit_Java_ValidatesRunner_Flink/ws/sdks/java/core/dependency-reduced-pom.xml>
2017-05-23T01:45:28.097 [INFO] 
2017-05-23T01:45:28.097 [INFO] --- maven-dependency-plugin:3.0.0:analyze-only (default) @
beam-sdks-java-core ---
2017-05-23T01:45:28.310 [INFO] No dependency problems found
[JENKINS] Archiving disabled
2017-05-23T01:45:29.810 [INFO]                                                           
             
2017-05-23T01:45:29.810 [INFO] ------------------------------------------------------------------------
2017-05-23T01:45:29.810 [INFO] Building Apache Beam :: Runners 2.1.0-SNAPSHOT
2017-05-23T01:45:29.810 [INFO] ------------------------------------------------------------------------
2017-05-23T01:45:29.814 [INFO] 
2017-05-23T01:45:29.814 [INFO] --- maven-clean-plugin:3.0.0:clean (default-clean) @ beam-runners-parent
---
2017-05-23T01:45:29.816 [INFO] Deleting <https://builds.apache.org/job/beam_PostCommit_Java_ValidatesRunner_Flink/ws/runners>
(includes = [**/*.pyc, **/*.egg-info/, **/sdks/python/LICENSE, **/sdks/python/NOTICE, **/sdks/python/README.md],
excludes = [])
2017-05-23T01:45:29.884 [INFO] 
2017-05-23T01:45:29.884 [INFO] --- maven-enforcer-plugin:1.4.1:enforce (enforce) @ beam-runners-parent
---
2017-05-23T01:45:29.937 [INFO] 
2017-05-23T01:45:29.937 [INFO] --- maven-enforcer-plugin:1.4.1:enforce (enforce-banned-dependencies)
@ beam-runners-parent ---
2017-05-23T01:45:30.146 [INFO] 
2017-05-23T01:45:30.146 [INFO] --- maven-remote-resources-plugin:1.5:process (process-resource-bundles)
@ beam-runners-parent ---
2017-05-23T01:45:30.206 [INFO] 
2017-05-23T01:45:30.206 [INFO] --- maven-checkstyle-plugin:2.17:check (default) @ beam-runners-parent
---
2017-05-23T01:45:30.664 [INFO] Starting audit...
Audit done.
2017-05-23T01:45:30.715 [INFO] 
2017-05-23T01:45:30.715 [INFO] --- build-helper-maven-plugin:3.0.0:regex-properties (render-artifact-id)
@ beam-runners-parent ---
2017-05-23T01:45:30.766 [INFO] 
2017-05-23T01:45:30.766 [INFO] --- maven-site-plugin:3.5.1:attach-descriptor (attach-descriptor)
@ beam-runners-parent ---
2017-05-23T01:45:30.869 [INFO] 
2017-05-23T01:45:30.869 [INFO] --- maven-jar-plugin:3.0.2:jar (default-jar) @ beam-runners-parent
---
2017-05-23T01:45:30.870 [INFO] Skipping packaging of the jar
2017-05-23T01:45:30.970 [INFO] 
2017-05-23T01:45:30.970 [INFO] --- maven-jar-plugin:3.0.2:test-jar (default-test-jar) @ beam-runners-parent
---
2017-05-23T01:45:30.971 [INFO] Skipping packaging of the test-jar
2017-05-23T01:45:31.021 [INFO] 
2017-05-23T01:45:31.021 [INFO] --- maven-shade-plugin:3.0.0:shade (bundle-and-repackage) @
beam-runners-parent ---
2017-05-23T01:45:31.025 [INFO] Replacing original artifact with shaded artifact.
2017-05-23T01:45:31.075 [INFO] 
2017-05-23T01:45:31.075 [INFO] --- maven-dependency-plugin:3.0.0:analyze-only (default) @
beam-runners-parent ---
2017-05-23T01:45:31.076 [INFO] Skipping pom project
[JENKINS] Archiving disabled
2017-05-23T01:45:31.741 [INFO]                                                           
             
2017-05-23T01:45:31.741 [INFO] ------------------------------------------------------------------------
2017-05-23T01:45:31.741 [INFO] Building Apache Beam :: Runners :: Core Construction Java 2.1.0-SNAPSHOT
2017-05-23T01:45:31.741 [INFO] ------------------------------------------------------------------------
2017-05-23T01:45:31.748 [INFO] 
2017-05-23T01:45:31.748 [INFO] --- maven-clean-plugin:3.0.0:clean (default-clean) @ beam-runners-core-construction-java
---
2017-05-23T01:45:31.750 [INFO] Deleting <https://builds.apache.org/job/beam_PostCommit_Java_ValidatesRunner_Flink/ws/runners/core-construction-java>
(includes = [**/*.pyc, **/*.egg-info/, **/sdks/python/LICENSE, **/sdks/python/NOTICE, **/sdks/python/README.md],
excludes = [])
2017-05-23T01:45:31.803 [INFO] 
2017-05-23T01:45:31.803 [INFO] --- maven-enforcer-plugin:1.4.1:enforce (enforce) @ beam-runners-core-construction-java
---
2017-05-23T01:45:32.311 [INFO] 
2017-05-23T01:45:32.312 [INFO] --- maven-enforcer-plugin:1.4.1:enforce (enforce-banned-dependencies)
@ beam-runners-core-construction-java ---
2017-05-23T01:45:32.367 [INFO] 
2017-05-23T01:45:32.367 [INFO] --- maven-remote-resources-plugin:1.5:process (process-resource-bundles)
@ beam-runners-core-construction-java ---
2017-05-23T01:45:32.595 [INFO] 
2017-05-23T01:45:32.595 [INFO] --- maven-resources-plugin:3.0.2:resources (default-resources)
@ beam-runners-core-construction-java ---
2017-05-23T01:45:32.597 [INFO] Using 'UTF-8' encoding to copy filtered resources.
2017-05-23T01:45:32.597 [INFO] skip non existing resourceDirectory <https://builds.apache.org/job/beam_PostCommit_Java_ValidatesRunner_Flink/ws/runners/core-construction-java/src/main/resources>
2017-05-23T01:45:32.597 [INFO] Copying 3 resources
2017-05-23T01:45:32.648 [INFO] 
2017-05-23T01:45:32.648 [INFO] --- maven-compiler-plugin:3.6.1:compile (default-compile) @
beam-runners-core-construction-java ---
2017-05-23T01:45:32.659 [INFO] Changes detected - recompiling the module!
2017-05-23T01:45:32.660 [INFO] Compiling 31 source files to <https://builds.apache.org/job/beam_PostCommit_Java_ValidatesRunner_Flink/ws/runners/core-construction-java/target/classes>
2017-05-23T01:45:33.433 [WARNING] bootstrap class path not set in conjunction with -source
1.7
2017-05-23T01:45:33.433 [INFO] <https://builds.apache.org/job/beam_PostCommit_Java_ValidatesRunner_Flink/ws/runners/core-construction-java/src/main/java/org/apache/beam/runners/core/construction/Triggers.java>:
Some input files use or override a deprecated API.
2017-05-23T01:45:33.433 [INFO] <https://builds.apache.org/job/beam_PostCommit_Java_ValidatesRunner_Flink/ws/runners/core-construction-java/src/main/java/org/apache/beam/runners/core/construction/Triggers.java>:
Recompile with -Xlint:deprecation for details.
2017-05-23T01:45:33.433 [INFO] <https://builds.apache.org/job/beam_PostCommit_Java_ValidatesRunner_Flink/ws/runners/core-construction-java/src/main/java/org/apache/beam/runners/core/construction/PTransforms.java>:
Some input files use unchecked or unsafe operations.
2017-05-23T01:45:33.434 [INFO] <https://builds.apache.org/job/beam_PostCommit_Java_ValidatesRunner_Flink/ws/runners/core-construction-java/src/main/java/org/apache/beam/runners/core/construction/PTransforms.java>:
Recompile with -Xlint:unchecked for details.
2017-05-23T01:45:33.484 [INFO] 
2017-05-23T01:45:33.484 [INFO] --- maven-resources-plugin:3.0.2:testResources (default-testResources)
@ beam-runners-core-construction-java ---
2017-05-23T01:45:33.485 [INFO] Using 'UTF-8' encoding to copy filtered resources.
2017-05-23T01:45:33.485 [INFO] skip non existing resourceDirectory <https://builds.apache.org/job/beam_PostCommit_Java_ValidatesRunner_Flink/ws/runners/core-construction-java/src/test/resources>
2017-05-23T01:45:33.485 [INFO] Copying 3 resources
2017-05-23T01:45:33.536 [INFO] 
2017-05-23T01:45:33.536 [INFO] --- maven-compiler-plugin:3.6.1:testCompile (default-testCompile)
@ beam-runners-core-construction-java ---
2017-05-23T01:45:33.551 [INFO] Changes detected - recompiling the module!
2017-05-23T01:45:33.551 [INFO] Compiling 22 source files to <https://builds.apache.org/job/beam_PostCommit_Java_ValidatesRunner_Flink/ws/runners/core-construction-java/target/test-classes>
2017-05-23T01:45:34.444 [INFO] <https://builds.apache.org/job/beam_PostCommit_Java_ValidatesRunner_Flink/ws/runners/core-construction-java/src/test/java/org/apache/beam/runners/core/construction/PCollectionsTest.java>:
Some input files use or override a deprecated API.
2017-05-23T01:45:34.444 [INFO] <https://builds.apache.org/job/beam_PostCommit_Java_ValidatesRunner_Flink/ws/runners/core-construction-java/src/test/java/org/apache/beam/runners/core/construction/PCollectionsTest.java>:
Recompile with -Xlint:deprecation for details.
2017-05-23T01:45:34.444 [INFO] <https://builds.apache.org/job/beam_PostCommit_Java_ValidatesRunner_Flink/ws/runners/core-construction-java/src/test/java/org/apache/beam/runners/core/construction/ParDosTest.java>:
Some input files use unchecked or unsafe operations.
2017-05-23T01:45:34.444 [INFO] <https://builds.apache.org/job/beam_PostCommit_Java_ValidatesRunner_Flink/ws/runners/core-construction-java/src/test/java/org/apache/beam/runners/core/construction/ParDosTest.java>:
Recompile with -Xlint:unchecked for details.
2017-05-23T01:45:34.444 [INFO] -------------------------------------------------------------
2017-05-23T01:45:34.444 [ERROR] COMPILATION ERROR : 
2017-05-23T01:45:34.444 [INFO] -------------------------------------------------------------
2017-05-23T01:45:34.445 [ERROR] <https://builds.apache.org/job/beam_PostCommit_Java_ValidatesRunner_Flink/ws/runners/core-construction-java/src/test/java/org/apache/beam/runners/core/construction/WindowIntoTranslatorTest.java>:[87,67]
method toAppliedPTransform in class org.apache.beam.sdk.runners.TransformHierarchy.Node cannot
be applied to given types;
  required: org.apache.beam.sdk.Pipeline
  found: no arguments
  reason: actual and formal argument lists differ in length
2017-05-23T01:45:34.445 [INFO] 1 error
2017-05-23T01:45:34.445 [INFO] -------------------------------------------------------------
[JENKINS] Archiving disabled
[JENKINS] Archiving disabled
[JENKINS] Archiving disabled
[JENKINS] Archiving disabled
[JENKINS] Archiving disabled
[JENKINS] Archiving disabled
[JENKINS] Archiving disabled
[JENKINS] Archiving disabled
[JENKINS] Archiving disabled
[JENKINS] Archiving disabled
[JENKINS] Archiving disabled
[JENKINS] Archiving disabled
[JENKINS] Archiving disabled
2017-05-23T01:45:39.344 [INFO] ------------------------------------------------------------------------
2017-05-23T01:45:39.344 [INFO] Reactor Summary:
2017-05-23T01:45:39.344 [INFO] 
2017-05-23T01:45:39.344 [INFO] Apache Beam :: Parent .............................. SUCCESS
[ 29.014 s]
2017-05-23T01:45:39.344 [INFO] Apache Beam :: SDKs :: Java :: Build Tools ......... SUCCESS
[ 13.502 s]
2017-05-23T01:45:39.344 [INFO] Apache Beam :: SDKs ................................ SUCCESS
[  2.015 s]
2017-05-23T01:45:39.344 [INFO] Apache Beam :: SDKs :: Common ...................... SUCCESS
[  1.717 s]
2017-05-23T01:45:39.344 [INFO] Apache Beam :: SDKs :: Common :: Fn API ............ SUCCESS
[ 17.301 s]
2017-05-23T01:45:39.344 [INFO] Apache Beam :: SDKs :: Common :: Runner API ........ SUCCESS
[  9.014 s]
2017-05-23T01:45:39.345 [INFO] Apache Beam :: SDKs :: Java ........................ SUCCESS
[  1.683 s]
2017-05-23T01:45:39.345 [INFO] Apache Beam :: SDKs :: Java :: Core ................ SUCCESS
[02:13 min]
2017-05-23T01:45:39.345 [INFO] Apache Beam :: Runners ............................. SUCCESS
[  1.634 s]
2017-05-23T01:45:39.345 [INFO] Apache Beam :: Runners :: Core Construction Java ... FAILURE
[  2.933 s]
2017-05-23T01:45:39.345 [INFO] Apache Beam :: Runners :: Core Java ................ SKIPPED
2017-05-23T01:45:39.345 [INFO] Apache Beam :: Runners :: Flink .................... SKIPPED
2017-05-23T01:45:39.345 [INFO] ------------------------------------------------------------------------
2017-05-23T01:45:39.345 [INFO] BUILD FAILURE
2017-05-23T01:45:39.345 [INFO] ------------------------------------------------------------------------
2017-05-23T01:45:39.345 [INFO] Total time: 04:28 min
2017-05-23T01:45:39.345 [INFO] Finished at: 2017-05-23T01:45:39+00:00
2017-05-23T01:45:40.121 [INFO] Final Memory: 173M/1460M
2017-05-23T01:45:40.121 [INFO] ------------------------------------------------------------------------
2017-05-23T01:45:40.121 [WARNING] The requested profile "validates-runner-tests" could not
be activated because it does not exist.
2017-05-23T01:45:40.127 [ERROR] Failed to execute goal org.apache.maven.plugins:maven-compiler-plugin:3.6.1:testCompile
(default-testCompile) on project beam-runners-core-construction-java: Compilation failure
2017-05-23T01:45:40.127 [ERROR] <https://builds.apache.org/job/beam_PostCommit_Java_ValidatesRunner_Flink/ws/runners/core-construction-java/src/test/java/org/apache/beam/runners/core/construction/WindowIntoTranslatorTest.java>:[87,67]
method toAppliedPTransform in class org.apache.beam.sdk.runners.TransformHierarchy.Node cannot
be applied to given types;
2017-05-23T01:45:40.127 [ERROR] required: org.apache.beam.sdk.Pipeline
2017-05-23T01:45:40.127 [ERROR] found: no arguments
2017-05-23T01:45:40.127 [ERROR] reason: actual and formal argument lists differ in length
2017-05-23T01:45:40.127 [ERROR] -> [Help 1]
org.apache.maven.lifecycle.LifecycleExecutionException: Failed to execute goal org.apache.maven.plugins:maven-compiler-plugin:3.6.1:testCompile
(default-testCompile) on project beam-runners-core-construction-java: Compilation failure
<https://builds.apache.org/job/beam_PostCommit_Java_ValidatesRunner_Flink/ws/runners/core-construction-java/src/test/java/org/apache/beam/runners/core/construction/WindowIntoTranslatorTest.java>:[87,67]
method toAppliedPTransform in class org.apache.beam.sdk.runners.TransformHierarchy.Node cannot
be applied to given types;
  required: org.apache.beam.sdk.Pipeline
  found: no arguments
  reason: actual and formal argument lists differ in length

	at org.apache.maven.lifecycle.internal.MojoExecutor.execute(MojoExecutor.java:212)
	at org.apache.maven.lifecycle.internal.MojoExecutor.execute(MojoExecutor.java:153)
	at org.apache.maven.lifecycle.internal.MojoExecutor.execute(MojoExecutor.java:145)
	at org.apache.maven.lifecycle.internal.LifecycleModuleBuilder.buildProject(LifecycleModuleBuilder.java:116)
	at org.apache.maven.lifecycle.internal.LifecycleModuleBuilder.buildProject(LifecycleModuleBuilder.java:80)
	at org.apache.maven.lifecycle.internal.builder.singlethreaded.SingleThreadedBuilder.build(SingleThreadedBuilder.java:51)
	at org.apache.maven.lifecycle.internal.LifecycleStarter.execute(LifecycleStarter.java:128)
	at org.apache.maven.DefaultMaven.doExecute(DefaultMaven.java:307)
	at org.apache.maven.DefaultMaven.doExecute(DefaultMaven.java:193)
	at org.apache.maven.DefaultMaven.execute(DefaultMaven.java:106)
	at org.jvnet.hudson.maven3.launcher.Maven33Launcher.main(Maven33Launcher.java:129)
	at sun.reflect.NativeMethodAccessorImpl.invoke0(Native Method)
	at sun.reflect.NativeMethodAccessorImpl.invoke(NativeMethodAccessorImpl.java:62)
	at sun.reflect.DelegatingMethodAccessorImpl.invoke(DelegatingMethodAccessorImpl.java:43)
	at java.lang.reflect.Method.invoke(Method.java:498)
	at org.codehaus.plexus.classworlds.launcher.Launcher.launchStandard(Launcher.java:330)
	at org.codehaus.plexus.classworlds.launcher.Launcher.launch(Launcher.java:238)
	at jenkins.maven3.agent.Maven33Main.launch(Maven33Main.java:176)
	at sun.reflect.NativeMethodAccessorImpl.invoke0(Native Method)
	at sun.reflect.NativeMethodAccessorImpl.invoke(NativeMethodAccessorImpl.java:62)
	at sun.reflect.DelegatingMethodAccessorImpl.invoke(DelegatingMethodAccessorImpl.java:43)
	at java.lang.reflect.Method.invoke(Method.java:498)
	at hudson.maven.Maven3Builder.call(Maven3Builder.java:139)
	at hudson.maven.Maven3Builder.call(Maven3Builder.java:70)
	at hudson.remoting.UserRequest.perform(UserRequest.java:153)
	at hudson.remoting.UserRequest.perform(UserRequest.java:50)
	at hudson.remoting.Request$2.run(Request.java:336)
	at hudson.remoting.InterceptingExecutorService$1.call(InterceptingExecutorService.java:68)
	at java.util.concurrent.FutureTask.run(FutureTask.java:266)
	at java.util.concurrent.ThreadPoolExecutor.runWorker(ThreadPoolExecutor.java:1142)
	at java.util.concurrent.ThreadPoolExecutor$Worker.run(ThreadPoolExecutor.java:617)
	at java.lang.Thread.run(Thread.java:745)
Caused by: org.apache.maven.plugin.compiler.CompilationFailureException: Compilation failure
<https://builds.apache.org/job/beam_PostCommit_Java_ValidatesRunner_Flink/ws/runners/core-construction-java/src/test/java/org/apache/beam/runners/core/construction/WindowIntoTranslatorTest.java>:[87,67]
method toAppliedPTransform in class org.apache.beam.sdk.runners.TransformHierarchy.Node cannot
be applied to given types;
  required: org.apache.beam.sdk.Pipeline
  found: no arguments
  reason: actual and formal argument lists differ in length

	at org.apache.maven.plugin.compiler.AbstractCompilerMojo.execute(AbstractCompilerMojo.java:1029)
	at org.apache.maven.plugin.compiler.TestCompilerMojo.execute(TestCompilerMojo.java:170)
	at org.apache.maven.plugin.DefaultBuildPluginManager.executeMojo(DefaultBuildPluginManager.java:134)
	at org.apache.maven.lifecycle.internal.MojoExecutor.execute(MojoExecutor.java:208)
	... 31 more
2017-05-23T01:45:40.129 [ERROR] 
2017-05-23T01:45:40.129 [ERROR] Re-run Maven using the -X switch to enable full debug logging.
2017-05-23T01:45:40.129 [ERROR] 
2017-05-23T01:45:40.129 [ERROR] For more information about the errors and possible solutions,
please read the following articles:
2017-05-23T01:45:40.129 [ERROR] [Help 1] http://cwiki.apache.org/confluence/display/MAVEN/MojoFailureException
2017-05-23T01:45:40.129 [ERROR] 
2017-05-23T01:45:40.129 [ERROR] After correcting the problems, you can resume the build with
the command
2017-05-23T01:45:40.129 [ERROR]   mvn <goals> -rf :beam-runners-core-construction-java
channel stopped
Not sending mail to unregistered user klk@google.com

Mime
View raw message