beam-commits mailing list archives

Site index · List index
Message view « Date » · « Thread »
Top « Date » · « Thread »
From Apache Jenkins Server <>
Subject Build failed in Jenkins: beam_PostCommit_Java_ValidatesRunner_Apex #1577
Date Fri, 26 May 2017 21:05:23 GMT
See <>


[dhalperi] [BEAM-1542] SpannerIO sink updates

[robertwb] [BEAM-2366] Don't try to pickle gen_protos in tests.

[...truncated 205.75 KB...]
2017-05-26T21:04:58.582 [INFO] Downloading:
2017-05-26T21:04:58.611 [INFO] Downloaded:
(8 KB at 252.5 KB/sec)
2017-05-26T21:04:58.615 [INFO] Downloading:
2017-05-26T21:04:58.643 [INFO] Downloaded:
(5 KB at 168.7 KB/sec)
2017-05-26T21:04:58.650 [INFO] Downloading:
2017-05-26T21:04:58.677 [INFO] Downloaded:
(5 KB at 180.1 KB/sec)
2017-05-26T21:04:58.681 [INFO] Downloading:
2017-05-26T21:04:58.708 [INFO] Downloaded:
(8 KB at 275.2 KB/sec)
2017-05-26T21:04:58.712 [INFO] Downloading:
2017-05-26T21:04:58.738 [INFO] Downloaded:
(18 KB at 657.1 KB/sec)
2017-05-26T21:04:58.800 [INFO] Downloading:
2017-05-26T21:04:58.827 [INFO] Downloaded:
(31 KB at 1127.9 KB/sec)
2017-05-26T21:04:58.831 [INFO] Downloading:
2017-05-26T21:04:58.858 [INFO] Downloaded:
(13 KB at 448.6 KB/sec)
2017-05-26T21:04:58.873 [INFO] Downloading:
2017-05-26T21:04:58.873 [INFO] Downloading:
2017-05-26T21:04:58.873 [INFO] Downloading:
2017-05-26T21:04:58.875 [INFO] Downloading:
2017-05-26T21:04:58.874 [INFO] Downloading:
2017-05-26T21:04:58.904 [INFO] Downloaded:
(18 KB at 566.3 KB/sec)
2017-05-26T21:04:58.904 [INFO] Downloading:
2017-05-26T21:04:58.921 [INFO] Downloaded:
(151 KB at 3135.6 KB/sec)
2017-05-26T21:04:58.922 [INFO] Downloading:
2017-05-26T21:04:58.923 [INFO] Downloaded:
(190 KB at 3873.4 KB/sec)
2017-05-26T21:04:58.924 [INFO] Downloading:
2017-05-26T21:04:58.929 [INFO] Downloaded:
(161 KB at 2871.0 KB/sec)
2017-05-26T21:04:58.929 [INFO] Downloading:
2017-05-26T21:04:58.945 [INFO] Downloaded:
(165 KB at 2316.9 KB/sec)
2017-05-26T21:04:58.945 [INFO] Downloading:
2017-05-26T21:04:58.949 [INFO] Downloaded:
(11 KB at 145.9 KB/sec)
2017-05-26T21:04:58.951 [INFO] Downloading:
2017-05-26T21:04:58.951 [INFO] Downloaded:
(38 KB at 482.1 KB/sec)
2017-05-26T21:04:58.951 [INFO] Downloading:
2017-05-26T21:04:58.955 [INFO] Downloaded:
(12 KB at 136.4 KB/sec)
2017-05-26T21:04:58.955 [INFO] Downloading:
2017-05-26T21:04:58.974 [INFO] Downloaded:
(52 KB at 518.4 KB/sec)
2017-05-26T21:04:58.974 [INFO] Downloading:
2017-05-26T21:04:58.980 [INFO] Downloaded:
(16 KB at 141.8 KB/sec)
2017-05-26T21:04:58.980 [INFO] Downloading:
2017-05-26T21:04:58.983 [INFO] Downloaded:
(60 KB at 548.8 KB/sec)
2017-05-26T21:04:58.983 [INFO] Downloading:
2017-05-26T21:04:58.986 [INFO] Downloaded:
(37 KB at 329.8 KB/sec)
2017-05-26T21:04:58.986 [INFO] Downloading:
2017-05-26T21:04:59.001 [INFO] Downloaded:
(8 KB at 59.0 KB/sec)
2017-05-26T21:04:59.001 [INFO] Downloading:
2017-05-26T21:04:59.008 [INFO] Downloaded:
(1201 KB at 8891.2 KB/sec)
2017-05-26T21:04:59.008 [INFO] Downloading:
2017-05-26T21:04:59.012 [INFO] Downloaded:
(37 KB at 265.9 KB/sec)
2017-05-26T21:04:59.013 [INFO] Downloading:
2017-05-26T21:04:59.015 [INFO] Downloaded:
(39 KB at 273.4 KB/sec)
2017-05-26T21:04:59.015 [INFO] Downloading:
2017-05-26T21:04:59.041 [INFO] Downloaded:
(42 KB at 249.9 KB/sec)
2017-05-26T21:04:59.041 [INFO] Downloading:
2017-05-26T21:04:59.052 [INFO] Downloaded:
(52 KB at 292.0 KB/sec)
2017-05-26T21:04:59.052 [INFO] Downloaded:
(35 KB at 191.9 KB/sec)
2017-05-26T21:04:59.052 [INFO] Downloading:
2017-05-26T21:04:59.052 [INFO] Downloading:
2017-05-26T21:04:59.056 [INFO] Downloaded:
(36 KB at 196.8 KB/sec)
2017-05-26T21:04:59.056 [INFO] Downloading:
2017-05-26T21:04:59.061 [INFO] Downloaded:
(383 KB at 2047.8 KB/sec)
2017-05-26T21:04:59.073 [INFO] Downloaded:
(61 KB at 301.6 KB/sec)
2017-05-26T21:04:59.096 [INFO] Downloaded:
(121 KB at 544.1 KB/sec)
2017-05-26T21:04:59.109 [INFO] Downloaded:
(278 KB at 1186.1 KB/sec)
2017-05-26T21:04:59.136 [INFO] Downloaded:
(575 KB at 2201.3 KB/sec)
2017-05-26T21:04:59.378 [INFO] Skipping pom project
[JENKINS] Archiving disabled
2017-05-26T21:05:00.651 [INFO]                                                           
2017-05-26T21:05:00.651 [INFO] ------------------------------------------------------------------------
2017-05-26T21:05:00.651 [INFO] Building Apache Beam :: SDKs :: Java :: Build Tools 2.1.0-SNAPSHOT
2017-05-26T21:05:00.651 [INFO] ------------------------------------------------------------------------
2017-05-26T21:05:00.654 [INFO] Downloading:
2017-05-26T21:05:00.681 [INFO] Downloaded:
(11 KB at 405.1 KB/sec)
2017-05-26T21:05:00.685 [INFO] Downloading:
2017-05-26T21:05:00.720 [INFO] Downloaded:
(58 KB at 1635.7 KB/sec)
2017-05-26T21:05:00.724 [INFO] Downloading:
2017-05-26T21:05:00.752 [INFO] Downloaded:
(4 KB at 121.6 KB/sec)
2017-05-26T21:05:00.754 [INFO] Downloading:
2017-05-26T21:05:00.785 [INFO] Downloaded:
(35 KB at 1119.7 KB/sec)
2017-05-26T21:05:00.789 [INFO] Downloading:
2017-05-26T21:05:00.817 [INFO] Downloaded:
(10 KB at 336.4 KB/sec)
2017-05-26T21:05:00.820 [INFO] Downloading:
2017-05-26T21:05:00.856 [INFO] Downloaded:
(14 KB at 361.7 KB/sec)
2017-05-26T21:05:00.859 [INFO] Downloading:
2017-05-26T21:05:00.891 [INFO] Downloaded:
(32 KB at 989.9 KB/sec)
2017-05-26T21:05:00.895 [INFO] Downloading:
2017-05-26T21:05:00.925 [INFO] Downloaded:
(14 KB at 434.5 KB/sec)
2017-05-26T21:05:00.928 [INFO] Downloading:
2017-05-26T21:05:00.968 [INFO] Downloaded:
(107 KB at 2650.7 KB/sec)
2017-05-26T21:05:00.973 [INFO] Downloading:
2017-05-26T21:05:01.000 [INFO] Downloaded:
(7 KB at 234.3 KB/sec)
2017-05-26T21:05:01.002 [INFO] Downloading:
2017-05-26T21:05:01.038 [INFO] Downloaded:
(21 KB at 564.3 KB/sec)
2017-05-26T21:05:01.043 [INFO] Downloading:
2017-05-26T21:05:01.075 [INFO] Downloaded:
(52 KB at 1624.3 KB/sec)
2017-05-26T21:05:01.081 [INFO] 
2017-05-26T21:05:01.081 [INFO] --- maven-clean-plugin:3.0.0:clean (default-clean) @ beam-sdks-java-build-tools
2017-05-26T21:05:01.083 [INFO] Deleting <>
(includes = [**/*.pyc, **/*.egg-info/, **/sdks/python/LICENSE, **/sdks/python/NOTICE, **/sdks/python/],
excludes = [])
2017-05-26T21:05:01.132 [INFO] 
2017-05-26T21:05:01.132 [INFO] --- maven-enforcer-plugin:1.4.1:enforce (enforce) @ beam-sdks-java-build-tools
2017-05-26T21:05:01.185 [INFO] 
2017-05-26T21:05:01.185 [INFO] --- maven-enforcer-plugin:1.4.1:enforce (enforce-banned-dependencies)
@ beam-sdks-java-build-tools ---
2017-05-26T21:05:01.239 [INFO] 
2017-05-26T21:05:01.239 [INFO] --- maven-remote-resources-plugin:1.5:process (process-resource-bundles)
@ beam-sdks-java-build-tools ---
2017-05-26T21:05:01.308 [INFO] 
2017-05-26T21:05:01.308 [INFO] --- maven-resources-plugin:3.0.2:resources (default-resources)
@ beam-sdks-java-build-tools ---
2017-05-26T21:05:01.310 [INFO] Using 'UTF-8' encoding to copy filtered resources.
2017-05-26T21:05:01.311 [INFO] Copying 4 resources
2017-05-26T21:05:01.332 [INFO] Copying 3 resources
2017-05-26T21:05:01.383 [INFO] 
2017-05-26T21:05:01.384 [INFO] --- maven-compiler-plugin:3.6.1:compile (default-compile) @
beam-sdks-java-build-tools ---
2017-05-26T21:05:01.391 [INFO] Downloading:
2017-05-26T21:05:01.430 [INFO] Downloaded:
(5 KB at 118.7 KB/sec)
2017-05-26T21:05:01.435 [INFO] Downloading:
2017-05-26T21:05:01.471 [INFO] Downloaded:
(4 KB at 109.8 KB/sec)
2017-05-26T21:05:01.475 [INFO] Downloading:
2017-05-26T21:05:01.512 [INFO] Downloaded:
(2 KB at 51.2 KB/sec)
2017-05-26T21:05:01.514 [INFO] Downloading:
2017-05-26T21:05:01.541 [INFO] Downloaded:
(6 KB at 198.9 KB/sec)
2017-05-26T21:05:01.551 [INFO] Downloading:
2017-05-26T21:05:01.580 [INFO] Downloaded:
(16 KB at 525.0 KB/sec)
2017-05-26T21:05:01.583 [INFO] Downloading:
2017-05-26T21:05:01.622 [INFO] Downloaded:
(893 B at 22.4 KB/sec)
2017-05-26T21:05:01.623 [INFO] Downloading:
2017-05-26T21:05:01.651 [INFO] Downloaded:
(5 KB at 174.6 KB/sec)
2017-05-26T21:05:01.654 [INFO] Downloading:
2017-05-26T21:05:01.680 [INFO] Downloaded:
(713 B at 26.8 KB/sec)
2017-05-26T21:05:01.684 [INFO] Downloading:
2017-05-26T21:05:01.711 [INFO] Downloaded:
(794 B at 28.7 KB/sec)
2017-05-26T21:05:01.712 [INFO] Downloading:
2017-05-26T21:05:01.739 [INFO] Downloaded:
(2 KB at 50.1 KB/sec)
2017-05-26T21:05:01.745 [INFO] Downloading:
2017-05-26T21:05:01.746 [INFO] Downloading:
2017-05-26T21:05:01.747 [INFO] Downloading:
2017-05-26T21:05:01.747 [INFO] Downloading:
2017-05-26T21:05:01.748 [INFO] Downloading:
2017-05-26T21:05:01.774 [INFO] Downloaded:
(14 KB at 455.9 KB/sec)
2017-05-26T21:05:01.774 [INFO] Downloading:
2017-05-26T21:05:01.780 [INFO] Downloaded:
(26 KB at 803.7 KB/sec)
2017-05-26T21:05:01.780 [INFO] Downloading:
2017-05-26T21:05:01.780 [INFO] Downloaded:
(55 KB at 1557.4 KB/sec)
2017-05-26T21:05:01.790 [INFO] Downloaded:
(160 KB at 3552.3 KB/sec)
2017-05-26T21:05:01.802 [INFO] Downloaded:
(5 KB at 84.9 KB/sec)
2017-05-26T21:05:01.806 [INFO] Downloaded:
(20 KB at 335.8 KB/sec)
2017-05-26T21:05:01.827 [INFO] Downloaded:
(307 KB at 3826.2 KB/sec)
2017-05-26T21:05:01.873 [INFO] No sources to compile
2017-05-26T21:05:01.922 [INFO] 
2017-05-26T21:05:01.922 [INFO] --- formatter-maven-plugin:2.0.1:format (test-code-style) @
beam-sdks-java-build-tools ---
2017-05-26T21:05:01.925 [INFO] Downloading:
2017-05-26T21:05:01.952 [INFO] Downloaded:
(7 KB at 247.3 KB/sec)
2017-05-26T21:05:01.954 [INFO] Downloading:
2017-05-26T21:05:02.014 [INFO] Downloaded:
(10 KB at 161.1 KB/sec)
2017-05-26T21:05:02.017 [INFO] Downloading:
2017-05-26T21:05:02.047 [INFO] Downloaded:
(2 KB at 40.6 KB/sec)
2017-05-26T21:05:02.049 [INFO] Downloading:
2017-05-26T21:05:02.087 [INFO] Downloaded:
(4 KB at 95.6 KB/sec)
2017-05-26T21:05:02.092 [INFO] Downloading:
2017-05-26T21:05:02.119 [INFO] Downloaded:
(2 KB at 45.1 KB/sec)
2017-05-26T21:05:02.124 [INFO] Downloading:
2017-05-26T21:05:02.154 [INFO] Downloaded:
(18 KB at 572.6 KB/sec)
2017-05-26T21:05:02.160 [INFO] Downloading:
2017-05-26T21:05:02.186 [INFO] Downloaded:
(2 KB at 55.3 KB/sec)
2017-05-26T21:05:02.189 [INFO] Downloading:
2017-05-26T21:05:02.215 [INFO] Downloaded:
(266 B at 10.0 KB/sec)
2017-05-26T21:05:02.217 [INFO] Downloading:
2017-05-26T21:05:02.260 [INFO] Downloaded:
(5 KB at 100.7 KB/sec)
2017-05-26T21:05:02.262 [INFO] Downloading:
2017-05-26T21:05:02.290 [INFO] Downloaded:
(11 KB at 390.6 KB/sec)
2017-05-26T21:05:02.291 [INFO] Downloading:
2017-05-26T21:05:02.321 [INFO] Downloaded:
(31 KB at 1021.8 KB/sec)
2017-05-26T21:05:02.324 [INFO] Downloading:
2017-05-26T21:05:02.353 [INFO] Downloaded:
(2 KB at 56.2 KB/sec)
2017-05-26T21:05:02.354 [INFO] Downloading:
2017-05-26T21:05:02.383 [INFO] Downloaded:
(16 KB at 545.2 KB/sec)
2017-05-26T21:05:02.388 [INFO] Downloading:
2017-05-26T21:05:02.416 [INFO] Downloaded:
(2 KB at 46.0 KB/sec)
2017-05-26T21:05:02.419 [INFO] Downloading:
2017-05-26T21:05:02.445 [INFO] Downloaded:
(4 KB at 118.0 KB/sec)
2017-05-26T21:05:02.449 [INFO] Downloading:
2017-05-26T21:05:02.449 [INFO] Downloading:
2017-05-26T21:05:02.450 [INFO] Downloading:
2017-05-26T21:05:02.450 [INFO] Downloading:
2017-05-26T21:05:02.450 [INFO] Downloading:
2017-05-26T21:05:02.516 [INFO] Downloaded:
(281 KB at 4249.4 KB/sec)
2017-05-26T21:05:02.516 [INFO] Downloading:
2017-05-26T21:05:02.543 [INFO] Downloaded:
(236 KB at 2537.1 KB/sec)
2017-05-26T21:05:02.543 [INFO] Downloading:
2017-05-26T21:05:02.547 [INFO] Downloaded:
(43 KB at 438.8 KB/sec)
2017-05-26T21:05:02.547 [INFO] Downloading:
2017-05-26T21:05:02.592 [INFO] Downloaded:
(60 KB at 417.3 KB/sec)
2017-05-26T21:05:02.592 [INFO] Downloading:
2017-05-26T21:05:02.603 [INFO] Downloaded:
(227 KB at 1480.9 KB/sec)
2017-05-26T21:05:02.603 [INFO] Downloading:
2017-05-26T21:05:02.622 [INFO] Downloaded:
(14 KB at 81.2 KB/sec)
2017-05-26T21:05:02.623 [INFO] Downloading:
2017-05-26T21:05:02.657 [INFO] Downloaded:
(22 KB at 103.2 KB/sec)
2017-05-26T21:05:02.657 [INFO] Downloading:
2017-05-26T21:05:02.667 [INFO] Downloaded:
(170 KB at 781.2 KB/sec)
2017-05-26T21:05:02.689 [INFO] Downloaded:
(37 KB at 153.3 KB/sec)
2017-05-26T21:05:02.795 [INFO] Downloaded:
(2386 KB at 6894.2 KB/sec)
2017-05-26T21:05:04.170 [INFO] Downloaded:
(19470 KB at 11312.9 KB/sec)
[WARNING] Failed to getClass for net.revelc.code.formatter.FormatterMojo
[JENKINS] Archiving disabled
[JENKINS] Archiving disabled
[JENKINS] Archiving disabled
[JENKINS] Archiving disabled
[JENKINS] Archiving disabled
[JENKINS] Archiving disabled
[JENKINS] Archiving disabled
[JENKINS] Archiving disabled
[JENKINS] Archiving disabled
[JENKINS] Archiving disabled
[JENKINS] Archiving disabled
[JENKINS] Archiving disabled
[JENKINS] Archiving disabled
2017-05-26T21:05:08.029 [INFO] ------------------------------------------------------------------------
2017-05-26T21:05:08.029 [INFO] Reactor Summary:
2017-05-26T21:05:08.029 [INFO] 
2017-05-26T21:05:08.030 [INFO] Apache Beam :: Parent .............................. SUCCESS
[ 23.731 s]
2017-05-26T21:05:08.030 [INFO] Apache Beam :: SDKs :: Java :: Build Tools ......... FAILURE
[  4.227 s]
2017-05-26T21:05:08.030 [INFO] Apache Beam :: SDKs ................................ SKIPPED
2017-05-26T21:05:08.030 [INFO] Apache Beam :: SDKs :: Common ...................... SKIPPED
2017-05-26T21:05:08.030 [INFO] Apache Beam :: SDKs :: Common :: Fn API ............ SKIPPED
2017-05-26T21:05:08.030 [INFO] Apache Beam :: SDKs :: Common :: Runner API ........ SKIPPED
2017-05-26T21:05:08.030 [INFO] Apache Beam :: SDKs :: Java ........................ SKIPPED
2017-05-26T21:05:08.030 [INFO] Apache Beam :: SDKs :: Java :: Core ................ SKIPPED
2017-05-26T21:05:08.030 [INFO] Apache Beam :: Runners ............................. SKIPPED
2017-05-26T21:05:08.030 [INFO] Apache Beam :: Runners :: Core Construction Java ... SKIPPED
2017-05-26T21:05:08.030 [INFO] Apache Beam :: Runners :: Core Java ................ SKIPPED
2017-05-26T21:05:08.030 [INFO] Apache Beam :: Runners :: Apex ..................... SKIPPED
2017-05-26T21:05:08.030 [INFO] ------------------------------------------------------------------------
2017-05-26T21:05:08.030 [INFO] BUILD FAILURE
2017-05-26T21:05:08.030 [INFO] ------------------------------------------------------------------------
2017-05-26T21:05:08.030 [INFO] Total time: 01:08 min
2017-05-26T21:05:08.031 [INFO] Finished at: 2017-05-26T21:05:08+00:00
2017-05-26T21:05:08.347 [INFO] Final Memory: 54M/684M
2017-05-26T21:05:08.347 [INFO] ------------------------------------------------------------------------
2017-05-26T21:05:08.347 [WARNING] The requested profile "validates-runner-tests" could not
be activated because it does not exist.
Waiting for Jenkins to finish collecting data
2017-05-26T21:05:15.182 [ERROR] Failed to execute goal net.revelc.code.formatter:formatter-maven-plugin:2.0.1:format
(test-code-style) on project beam-sdks-java-build-tools: Execution test-code-style of goal
net.revelc.code.formatter:formatter-maven-plugin:2.0.1:format failed: Plugin net.revelc.code.formatter:formatter-maven-plugin:2.0.1
or one of its dependencies could not be resolved: Could not transfer artifact net.revelc.code.formatter:jsdt-core:jar:2.0.1
from/to central ( GET request of: net/revelc/code/formatter/jsdt-core/2.0.1/jsdt-core-2.0.1.jar
from central failed: Connection reset -> [Help 1]
2017-05-26T21:05:15.183 [ERROR] 
2017-05-26T21:05:15.183 [ERROR] To see the full stack trace of the errors, re-run Maven with
the -e switch.
2017-05-26T21:05:15.183 [ERROR] Re-run Maven using the -X switch to enable full debug logging.
2017-05-26T21:05:15.183 [ERROR] 
2017-05-26T21:05:15.183 [ERROR] For more information about the errors and possible solutions,
please read the following articles:
2017-05-26T21:05:15.183 [ERROR] [Help 1]
2017-05-26T21:05:15.183 [ERROR] 
2017-05-26T21:05:15.183 [ERROR] After correcting the problems, you can resume the build with
the command
2017-05-26T21:05:15.183 [ERROR]   mvn <goals> -rf :beam-sdks-java-build-tools
channel stopped

View raw message