beam-commits mailing list archives

Site index · List index
Message view « Date » · « Thread »
Top « Date » · « Thread »
From Apache Jenkins Server <jenk...@builds.apache.org>
Subject Build failed in Jenkins: beam_PostCommit_Python_Verify #2090
Date Wed, 03 May 2017 01:03:59 GMT
See <https://builds.apache.org/job/beam_PostCommit_Python_Verify/2090/display/redirect?page=changes>

Changes:

[klk] Skip null options when converting back to argv

[klk] Instantiate runner briefly in Pipeline

[dhalperi] [BEAM-59] Move GcsFileSystem to gcp-core

[dhalperi] Full removal of Aggregators in Java SDK and Runners

[davor] Include LICENSE and NOTICE in python dist files

------------------------------------------
[...truncated 511.39 KB...]
Collecting setuptools (from pyhamcrest->-r postcommit_requirements.txt (line 1))
  File was already downloaded /tmp/dataflow-requirements-cache/setuptools-35.0.2.zip
test_undeclared_outputs (apache_beam.transforms.ptransform_test.PTransformTest) ... ok
<https://builds.apache.org/job/beam_PostCommit_Python_Verify/ws/sdks/python/apache_beam/coders/typecoders.py>:132:
UserWarning: Using fallback coder for typehint: List[Any].
  warnings.warn('Using fallback coder for typehint: %r.' % typehint)
<https://builds.apache.org/job/beam_PostCommit_Python_Verify/ws/sdks/python/apache_beam/coders/typecoders.py>:132:
UserWarning: Using fallback coder for typehint: Union[].
  warnings.warn('Using fallback coder for typehint: %r.' % typehint)
Collecting six (from pyhamcrest->-r postcommit_requirements.txt (line 1))
  File was already downloaded /tmp/dataflow-requirements-cache/six-1.10.0.tar.gz
Collecting funcsigs>=1 (from mock->-r postcommit_requirements.txt (line 2))
  File was already downloaded /tmp/dataflow-requirements-cache/funcsigs-1.0.2.tar.gz
test_as_dict_twice (apache_beam.transforms.sideinputs_test.SideInputsTest) ... ok
Collecting pbr>=0.11 (from mock->-r postcommit_requirements.txt (line 2))
  File was already downloaded /tmp/dataflow-requirements-cache/pbr-3.0.0.tar.gz
DEPRECATION: pip install --download has been deprecated and will be removed in the future.
Pip now has a download command that should be used instead.
Collecting pyhamcrest (from -r postcommit_requirements.txt (line 1))
  File was already downloaded /tmp/dataflow-requirements-cache/PyHamcrest-1.9.0.tar.gz
Collecting packaging>=16.8 (from setuptools->pyhamcrest->-r postcommit_requirements.txt
(line 1))
  File was already downloaded /tmp/dataflow-requirements-cache/packaging-16.8.tar.gz
DEPRECATION: pip install --download has been deprecated and will be removed in the future.
Pip now has a download command that should be used instead.
Collecting mock (from -r postcommit_requirements.txt (line 2))
  File was already downloaded /tmp/dataflow-requirements-cache/mock-2.0.0.tar.gz
Collecting pyhamcrest (from -r postcommit_requirements.txt (line 1))
Collecting appdirs>=1.4.0 (from setuptools->pyhamcrest->-r postcommit_requirements.txt
(line 1))
  File was already downloaded /tmp/dataflow-requirements-cache/PyHamcrest-1.9.0.tar.gz
  File was already downloaded /tmp/dataflow-requirements-cache/appdirs-1.4.3.tar.gz
Collecting pyparsing (from packaging>=16.8->setuptools->pyhamcrest->-r postcommit_requirements.txt
(line 1))
Collecting setuptools (from pyhamcrest->-r postcommit_requirements.txt (line 1))
  File was already downloaded /tmp/dataflow-requirements-cache/pyparsing-2.2.0.tar.gz
Collecting mock (from -r postcommit_requirements.txt (line 2))
  File was already downloaded /tmp/dataflow-requirements-cache/mock-2.0.0.tar.gz
  File was already downloaded /tmp/dataflow-requirements-cache/setuptools-35.0.2.zip
Collecting setuptools (from pyhamcrest->-r postcommit_requirements.txt (line 1))
Successfully downloaded pyhamcrest mock setuptools six funcsigs pbr packaging appdirs pyparsing
  File was already downloaded /tmp/dataflow-requirements-cache/setuptools-35.0.2.zip
Collecting six (from pyhamcrest->-r postcommit_requirements.txt (line 1))
  File was already downloaded /tmp/dataflow-requirements-cache/six-1.10.0.tar.gz
Collecting funcsigs>=1 (from mock->-r postcommit_requirements.txt (line 2))
  File was already downloaded /tmp/dataflow-requirements-cache/funcsigs-1.0.2.tar.gz
Collecting six (from pyhamcrest->-r postcommit_requirements.txt (line 1))
  File was already downloaded /tmp/dataflow-requirements-cache/six-1.10.0.tar.gz
Collecting pbr>=0.11 (from mock->-r postcommit_requirements.txt (line 2))
  File was already downloaded /tmp/dataflow-requirements-cache/pbr-3.0.0.tar.gz
Collecting funcsigs>=1 (from mock->-r postcommit_requirements.txt (line 2))
  File was already downloaded /tmp/dataflow-requirements-cache/funcsigs-1.0.2.tar.gz
Collecting pbr>=0.11 (from mock->-r postcommit_requirements.txt (line 2))
  File was already downloaded /tmp/dataflow-requirements-cache/pbr-3.0.0.tar.gz
Collecting packaging>=16.8 (from setuptools->pyhamcrest->-r postcommit_requirements.txt
(line 1))
  File was already downloaded /tmp/dataflow-requirements-cache/packaging-16.8.tar.gz
Collecting appdirs>=1.4.0 (from setuptools->pyhamcrest->-r postcommit_requirements.txt
(line 1))
  File was already downloaded /tmp/dataflow-requirements-cache/appdirs-1.4.3.tar.gz
Collecting packaging>=16.8 (from setuptools->pyhamcrest->-r postcommit_requirements.txt
(line 1))
  File was already downloaded /tmp/dataflow-requirements-cache/packaging-16.8.tar.gz
Collecting pyparsing (from packaging>=16.8->setuptools->pyhamcrest->-r postcommit_requirements.txt
(line 1))
  File was already downloaded /tmp/dataflow-requirements-cache/pyparsing-2.2.0.tar.gz
Collecting appdirs>=1.4.0 (from setuptools->pyhamcrest->-r postcommit_requirements.txt
(line 1))
  File was already downloaded /tmp/dataflow-requirements-cache/appdirs-1.4.3.tar.gz
Collecting pyparsing (from packaging>=16.8->setuptools->pyhamcrest->-r postcommit_requirements.txt
(line 1))
  File was already downloaded /tmp/dataflow-requirements-cache/pyparsing-2.2.0.tar.gz
Successfully downloaded pyhamcrest mock setuptools six funcsigs pbr packaging appdirs pyparsing
Successfully downloaded pyhamcrest mock setuptools six funcsigs pbr packaging appdirs pyparsing
test_as_list_and_as_dict_side_inputs (apache_beam.transforms.sideinputs_test.SideInputsTest)
... ok
DEPRECATION: pip install --download has been deprecated and will be removed in the future.
Pip now has a download command that should be used instead.
Collecting pyhamcrest (from -r postcommit_requirements.txt (line 1))
  File was already downloaded /tmp/dataflow-requirements-cache/PyHamcrest-1.9.0.tar.gz
Collecting mock (from -r postcommit_requirements.txt (line 2))
  File was already downloaded /tmp/dataflow-requirements-cache/mock-2.0.0.tar.gz
Collecting setuptools (from pyhamcrest->-r postcommit_requirements.txt (line 1))
  File was already downloaded /tmp/dataflow-requirements-cache/setuptools-35.0.2.zip
Collecting six (from pyhamcrest->-r postcommit_requirements.txt (line 1))
  File was already downloaded /tmp/dataflow-requirements-cache/six-1.10.0.tar.gz
Collecting funcsigs>=1 (from mock->-r postcommit_requirements.txt (line 2))
  File was already downloaded /tmp/dataflow-requirements-cache/funcsigs-1.0.2.tar.gz
Collecting pbr>=0.11 (from mock->-r postcommit_requirements.txt (line 2))
  File was already downloaded /tmp/dataflow-requirements-cache/pbr-3.0.0.tar.gz
Collecting packaging>=16.8 (from setuptools->pyhamcrest->-r postcommit_requirements.txt
(line 1))
  File was already downloaded /tmp/dataflow-requirements-cache/packaging-16.8.tar.gz
Collecting appdirs>=1.4.0 (from setuptools->pyhamcrest->-r postcommit_requirements.txt
(line 1))
  File was already downloaded /tmp/dataflow-requirements-cache/appdirs-1.4.3.tar.gz
Collecting pyparsing (from packaging>=16.8->setuptools->pyhamcrest->-r postcommit_requirements.txt
(line 1))
  File was already downloaded /tmp/dataflow-requirements-cache/pyparsing-2.2.0.tar.gz
Successfully downloaded pyhamcrest mock setuptools six funcsigs pbr packaging appdirs pyparsing
test_as_singleton_with_different_defaults (apache_beam.transforms.sideinputs_test.SideInputsTest)
... ok
DEPRECATION: pip install --download has been deprecated and will be removed in the future.
Pip now has a download command that should be used instead.
Collecting pyhamcrest (from -r postcommit_requirements.txt (line 1))
  File was already downloaded /tmp/dataflow-requirements-cache/PyHamcrest-1.9.0.tar.gz
Collecting mock (from -r postcommit_requirements.txt (line 2))
  File was already downloaded /tmp/dataflow-requirements-cache/mock-2.0.0.tar.gz
Collecting setuptools (from pyhamcrest->-r postcommit_requirements.txt (line 1))
  File was already downloaded /tmp/dataflow-requirements-cache/setuptools-35.0.2.zip
Collecting six (from pyhamcrest->-r postcommit_requirements.txt (line 1))
  File was already downloaded /tmp/dataflow-requirements-cache/six-1.10.0.tar.gz
Collecting funcsigs>=1 (from mock->-r postcommit_requirements.txt (line 2))
  File was already downloaded /tmp/dataflow-requirements-cache/funcsigs-1.0.2.tar.gz
Collecting pbr>=0.11 (from mock->-r postcommit_requirements.txt (line 2))
  File was already downloaded /tmp/dataflow-requirements-cache/pbr-3.0.0.tar.gz
Collecting packaging>=16.8 (from setuptools->pyhamcrest->-r postcommit_requirements.txt
(line 1))
  File was already downloaded /tmp/dataflow-requirements-cache/packaging-16.8.tar.gz
Collecting appdirs>=1.4.0 (from setuptools->pyhamcrest->-r postcommit_requirements.txt
(line 1))
  File was already downloaded /tmp/dataflow-requirements-cache/appdirs-1.4.3.tar.gz
Collecting pyparsing (from packaging>=16.8->setuptools->pyhamcrest->-r postcommit_requirements.txt
(line 1))
  File was already downloaded /tmp/dataflow-requirements-cache/pyparsing-2.2.0.tar.gz
Successfully downloaded pyhamcrest mock setuptools six funcsigs pbr packaging appdirs pyparsing
test_as_singleton_without_unique_labels (apache_beam.transforms.sideinputs_test.SideInputsTest)
... ok
DEPRECATION: pip install --download has been deprecated and will be removed in the future.
Pip now has a download command that should be used instead.
Collecting pyhamcrest (from -r postcommit_requirements.txt (line 1))
  File was already downloaded /tmp/dataflow-requirements-cache/PyHamcrest-1.9.0.tar.gz
Collecting mock (from -r postcommit_requirements.txt (line 2))
  File was already downloaded /tmp/dataflow-requirements-cache/mock-2.0.0.tar.gz
Collecting setuptools (from pyhamcrest->-r postcommit_requirements.txt (line 1))
  File was already downloaded /tmp/dataflow-requirements-cache/setuptools-35.0.2.zip
Collecting six (from pyhamcrest->-r postcommit_requirements.txt (line 1))
  File was already downloaded /tmp/dataflow-requirements-cache/six-1.10.0.tar.gz
Collecting funcsigs>=1 (from mock->-r postcommit_requirements.txt (line 2))
  File was already downloaded /tmp/dataflow-requirements-cache/funcsigs-1.0.2.tar.gz
Collecting pbr>=0.11 (from mock->-r postcommit_requirements.txt (line 2))
  File was already downloaded /tmp/dataflow-requirements-cache/pbr-3.0.0.tar.gz
Collecting packaging>=16.8 (from setuptools->pyhamcrest->-r postcommit_requirements.txt
(line 1))
  File was already downloaded /tmp/dataflow-requirements-cache/packaging-16.8.tar.gz
Collecting appdirs>=1.4.0 (from setuptools->pyhamcrest->-r postcommit_requirements.txt
(line 1))
  File was already downloaded /tmp/dataflow-requirements-cache/appdirs-1.4.3.tar.gz
Collecting pyparsing (from packaging>=16.8->setuptools->pyhamcrest->-r postcommit_requirements.txt
(line 1))
  File was already downloaded /tmp/dataflow-requirements-cache/pyparsing-2.2.0.tar.gz
Successfully downloaded pyhamcrest mock setuptools six funcsigs pbr packaging appdirs pyparsing
test_default_value_singleton_side_input (apache_beam.transforms.sideinputs_test.SideInputsTest)
... ok
DEPRECATION: pip install --download has been deprecated and will be removed in the future.
Pip now has a download command that should be used instead.
Collecting pyhamcrest (from -r postcommit_requirements.txt (line 1))
  File was already downloaded /tmp/dataflow-requirements-cache/PyHamcrest-1.9.0.tar.gz
Collecting mock (from -r postcommit_requirements.txt (line 2))
  File was already downloaded /tmp/dataflow-requirements-cache/mock-2.0.0.tar.gz
Collecting setuptools (from pyhamcrest->-r postcommit_requirements.txt (line 1))
  File was already downloaded /tmp/dataflow-requirements-cache/setuptools-35.0.2.zip
Collecting six (from pyhamcrest->-r postcommit_requirements.txt (line 1))
  File was already downloaded /tmp/dataflow-requirements-cache/six-1.10.0.tar.gz
Collecting funcsigs>=1 (from mock->-r postcommit_requirements.txt (line 2))
  File was already downloaded /tmp/dataflow-requirements-cache/funcsigs-1.0.2.tar.gz
Collecting pbr>=0.11 (from mock->-r postcommit_requirements.txt (line 2))
  File was already downloaded /tmp/dataflow-requirements-cache/pbr-3.0.0.tar.gz
Collecting packaging>=16.8 (from setuptools->pyhamcrest->-r postcommit_requirements.txt
(line 1))
  File was already downloaded /tmp/dataflow-requirements-cache/packaging-16.8.tar.gz
Collecting appdirs>=1.4.0 (from setuptools->pyhamcrest->-r postcommit_requirements.txt
(line 1))
  File was already downloaded /tmp/dataflow-requirements-cache/appdirs-1.4.3.tar.gz
Collecting pyparsing (from packaging>=16.8->setuptools->pyhamcrest->-r postcommit_requirements.txt
(line 1))
  File was already downloaded /tmp/dataflow-requirements-cache/pyparsing-2.2.0.tar.gz
Successfully downloaded pyhamcrest mock setuptools six funcsigs pbr packaging appdirs pyparsing
test_empty_singleton_side_input (apache_beam.transforms.sideinputs_test.SideInputsTest) ...
ok
test_flattened_side_input (apache_beam.transforms.sideinputs_test.SideInputsTest) ... ok
test_iterable_side_input (apache_beam.transforms.sideinputs_test.SideInputsTest) ... ok
test_multi_valued_singleton_side_input (apache_beam.transforms.sideinputs_test.SideInputsTest)
... ok

----------------------------------------------------------------------
Ran 15 tests in 1481.700s

OK
Found: https://console.cloud.google.com/dataflow/job/2017-05-02_17_24_36-14588303205929825066?project=apache-beam-testing
Found: https://console.cloud.google.com/dataflow/job/2017-05-02_17_30_42-18111932835306284576?project=apache-beam-testing
Found: https://console.cloud.google.com/dataflow/job/2017-05-02_17_36_37-9250875152952089583?project=apache-beam-testing
Found: https://console.cloud.google.com/dataflow/job/2017-05-02_17_43_16-5019348869709917464?project=apache-beam-testing
Found: https://console.cloud.google.com/dataflow/job/2017-05-02_17_24_35-10223197700147464488?project=apache-beam-testing
Found: https://console.cloud.google.com/dataflow/job/2017-05-02_17_30_59-18281734172290430850?project=apache-beam-testing
Found: https://console.cloud.google.com/dataflow/job/2017-05-02_17_36_36-12672382633194654424?project=apache-beam-testing
Found: https://console.cloud.google.com/dataflow/job/2017-05-02_17_41_42-8255190292434051510?project=apache-beam-testing
Found: https://console.cloud.google.com/dataflow/job/2017-05-02_17_24_36-1778287085165575145?project=apache-beam-testing
Found: https://console.cloud.google.com/dataflow/job/2017-05-02_17_29_54-11500318962331577516?project=apache-beam-testing
Found: https://console.cloud.google.com/dataflow/job/2017-05-02_17_36_38-2306817637113085067?project=apache-beam-testing
Found: https://console.cloud.google.com/dataflow/job/2017-05-02_17_42_40-3616023482866700104?project=apache-beam-testing
Found: https://console.cloud.google.com/dataflow/job/2017-05-02_17_24_36-11353066113499408413?project=apache-beam-testing
Found: https://console.cloud.google.com/dataflow/job/2017-05-02_17_30_47-1220886306958811080?project=apache-beam-testing
Found: https://console.cloud.google.com/dataflow/job/2017-05-02_17_36_47-14648351761188335939?project=apache-beam-testing

# Run integration tests on the Google Cloud Dataflow service
# and validate that jobs finish successfully.
echo ">>> RUNNING TEST DATAFLOW RUNNER it tests"
>>> RUNNING TEST DATAFLOW RUNNER it tests
python setup.py nosetests \
  --attr IT \
  --nocapture \
  --processes=4 \
  --process-timeout=900 \
  --test-pipeline-options=" \
    --runner=TestDataflowRunner \
    --project=$PROJECT \
    --staging_location=$GCS_LOCATION/staging-it \
    --temp_location=$GCS_LOCATION/temp-it \
    --output=$GCS_LOCATION/py-it-cloud/output \
    --sdk_location=$SDK_LOCATION \
    --num_workers=1 \
    --sleep_secs=20"
<https://builds.apache.org/job/beam_PostCommit_Python_Verify/ws/sdks/python/local/lib/python2.7/site-packages/setuptools/dist.py>:334:
UserWarning: Normalizing '0.7.0.dev' to '0.7.0.dev0'
  normalized_version,
running nosetests
running egg_info
writing requirements to apache_beam.egg-info/requires.txt
writing apache_beam.egg-info/PKG-INFO
writing top-level names to apache_beam.egg-info/top_level.txt
writing dependency_links to apache_beam.egg-info/dependency_links.txt
writing entry points to apache_beam.egg-info/entry_points.txt
reading manifest file 'apache_beam.egg-info/SOURCES.txt'
reading manifest template 'MANIFEST.in'
warning: no files found matching 'NOTICE'
warning: no files found matching 'LICENSE'
writing manifest file 'apache_beam.egg-info/SOURCES.txt'
<https://builds.apache.org/job/beam_PostCommit_Python_Verify/ws/sdks/python/apache_beam/coders/typecoders.py>:132:
UserWarning: Using fallback coder for typehint: Any.
  warnings.warn('Using fallback coder for typehint: %r.' % typehint)
<https://builds.apache.org/job/beam_PostCommit_Python_Verify/ws/sdks/python/apache_beam/coders/typecoders.py>:132:
UserWarning: Using fallback coder for typehint: Dict[Any, Any].
  warnings.warn('Using fallback coder for typehint: %r.' % typehint)
<https://builds.apache.org/job/beam_PostCommit_Python_Verify/ws/sdks/python/apache_beam/coders/typecoders.py>:132:
UserWarning: Using fallback coder for typehint: Any.
  warnings.warn('Using fallback coder for typehint: %r.' % typehint)
test_bigquery_tornadoes_it (apache_beam.examples.cookbook.bigquery_tornadoes_it_test.BigqueryTornadoesIT)
... ok
Found: https://console.cloud.google.com/dataflow/job/2017-05-02_17_48_59-7245858823557993558?project=apache-beam-testing
test_wordcount_it (apache_beam.examples.wordcount_it_test.WordCountIT) ... ERROR

======================================================================
ERROR: test_wordcount_it (apache_beam.examples.wordcount_it_test.WordCountIT)
----------------------------------------------------------------------
Traceback (most recent call last):
  File "<https://builds.apache.org/job/beam_PostCommit_Python_Verify/ws/sdks/python/nose-1.3.7-py2.7.egg/nose/plugins/multiprocess.py",>
line 812, in run
    test(orig)
  File "<https://builds.apache.org/job/beam_PostCommit_Python_Verify/ws/sdks/python/nose-1.3.7-py2.7.egg/nose/case.py",>
line 45, in __call__
    return self.run(*arg, **kwarg)
  File "<https://builds.apache.org/job/beam_PostCommit_Python_Verify/ws/sdks/python/nose-1.3.7-py2.7.egg/nose/case.py",>
line 133, in run
    self.runTest(result)
  File "<https://builds.apache.org/job/beam_PostCommit_Python_Verify/ws/sdks/python/nose-1.3.7-py2.7.egg/nose/case.py",>
line 151, in runTest
    test(result)
  File "/usr/lib/python2.7/unittest/case.py", line 395, in __call__
    return self.run(*args, **kwds)
  File "/usr/lib/python2.7/unittest/case.py", line 331, in run
    testMethod()
  File "<https://builds.apache.org/job/beam_PostCommit_Python_Verify/ws/sdks/python/apache_beam/examples/wordcount_it_test.py",>
line 61, in test_wordcount_it
    wordcount.run(test_pipeline.get_full_options_as_args(**extra_opts))
  File "<https://builds.apache.org/job/beam_PostCommit_Python_Verify/ws/sdks/python/apache_beam/examples/wordcount.py",>
line 109, in run
    result = p.run()
  File "<https://builds.apache.org/job/beam_PostCommit_Python_Verify/ws/sdks/python/apache_beam/pipeline.py",>
line 166, in run
    return self.runner.run(self)
  File "<https://builds.apache.org/job/beam_PostCommit_Python_Verify/ws/sdks/python/apache_beam/runners/dataflow/test_dataflow_runner.py",>
line 44, in run
    self.result.wait_until_finish()
  File "<https://builds.apache.org/job/beam_PostCommit_Python_Verify/ws/sdks/python/apache_beam/runners/dataflow/dataflow_runner.py",>
line 768, in wait_until_finish
    time.sleep(5.0)
  File "<https://builds.apache.org/job/beam_PostCommit_Python_Verify/ws/sdks/python/nose-1.3.7-py2.7.egg/nose/plugins/multiprocess.py",>
line 276, in signalhandler
    raise TimedOutException()
TimedOutException: 'test_wordcount_it (apache_beam.examples.wordcount_it_test.WordCountIT)'

----------------------------------------------------------------------
Ran 2 tests in 900.807s

FAILED (errors=1)
Found: https://console.cloud.google.com/dataflow/job/2017-05-02_17_48_58-9213729077682283597?project=apache-beam-testing
Build step 'Execute shell' marked build as failure
Not sending mail to unregistered user klk@google.com

Mime
View raw message