beam-commits mailing list archives

Site index · List index
Message view « Date » · « Thread »
Top « Date » · « Thread »
From Apache Jenkins Server <jenk...@builds.apache.org>
Subject Build failed in Jenkins: beam_PostCommit_Java_MavenInstall #3661
Date Fri, 05 May 2017 01:07:02 GMT
See <https://builds.apache.org/job/beam_PostCommit_Java_MavenInstall/3661/display/redirect?page=changes>

Changes:

[dhalperi] [BEAM-1871] Move out test only utilities used only in examples/java out

------------------------------------------
[...truncated 1.44 MB...]
2017-05-05T01:05:15.207 [INFO]   symbol:   class FastNanoClockAndSleeper
2017-05-05T01:05:15.207 [INFO]   location: class it.pkg.testing.FileChecksumMatcherTest
2017-05-05T01:05:15.207 [INFO] 2017-05-05\T\01:05:15.207 [ERROR] <https://builds.apache.org/job/beam_PostCommit_Java_MavenInstall/ws/sdks/java/maven-archetypes/examples/target/test-classes/projects/basic/project/basic/src/test/java/it/pkg/testing/NumberedShardedFileTest.java>:[55,4]
cannot find symbol
2017-05-05T01:05:15.207 [INFO]   symbol:   class Mock
2017-05-05T01:05:15.207 [INFO]   location: class it.pkg.testing.NumberedShardedFileTest
2017-05-05T01:05:15.207 [INFO] 2017-05-05\T\01:05:15.207 [ERROR] <https://builds.apache.org/job/beam_PostCommit_Java_MavenInstall/ws/sdks/java/maven-archetypes/examples/target/test-classes/projects/basic/project/basic/src/test/java/it/pkg/testing/FileChecksumMatcherTest.java>:[50,4]
cannot find symbol
2017-05-05T01:05:15.207 [INFO]   symbol:   class Mock
2017-05-05T01:05:15.207 [INFO]   location: class it.pkg.testing.FileChecksumMatcherTest
2017-05-05T01:05:15.207 [INFO] 2017-05-05\T\01:05:15.207 [INFO] 16 errors 
2017-05-05T01:05:15.207 [INFO] 2017-05-05\T\01:05:15.207 [INFO] -------------------------------------------------------------
2017-05-05T01:05:15.208 [INFO] 2017-05-05\T\01:05:15.208 [INFO] ------------------------------------------------------------------------
2017-05-05T01:05:15.208 [INFO] 2017-05-05\T\01:05:15.208 [INFO] BUILD FAILURE
2017-05-05T01:05:15.208 [INFO] 2017-05-05\T\01:05:15.208 [INFO] ------------------------------------------------------------------------
2017-05-05T01:05:15.208 [INFO] 2017-05-05\T\01:05:15.208 [INFO] Total time: 7.396 s
2017-05-05T01:05:15.208 [INFO] 2017-05-05\T\01:05:15.208 [INFO] Finished at: 2017-05-05T01:05:15+00:00
2017-05-05T01:05:15.557 [INFO] 2017-05-05\T\01:05:15.557 [INFO] Final Memory: 34M/334M
2017-05-05T01:05:15.557 [INFO] 2017-05-05\T\01:05:15.557 [INFO] ------------------------------------------------------------------------
2017-05-05T01:05:15.561 [INFO] 2017-05-05\T\01:05:15.561 [ERROR] Failed to execute goal org.apache.maven.plugins:maven-compiler-plugin:3.5.1:testCompile
(default-testCompile) on project basic: Compilation failure: Compilation failure:
2017-05-05T01:05:15.561 [INFO] 2017-05-05\T\01:05:15.561 [ERROR] <https://builds.apache.org/job/beam_PostCommit_Java_MavenInstall/ws/sdks/java/maven-archetypes/examples/target/test-classes/projects/basic/project/basic/src/test/java/it/pkg/testing/NumberedShardedFileTest.java>:[24,26]
package org.mockito does not exist
2017-05-05T01:05:15.562 [INFO] 2017-05-05\T\01:05:15.561 [ERROR] <https://builds.apache.org/job/beam_PostCommit_Java_MavenInstall/ws/sdks/java/maven-archetypes/examples/target/test-classes/projects/basic/project/basic/src/test/java/it/pkg/testing/NumberedShardedFileTest.java>:[24,1]
static import only from classes and interfaces
2017-05-05T01:05:15.562 [INFO] 2017-05-05\T\01:05:15.561 [ERROR] <https://builds.apache.org/job/beam_PostCommit_Java_MavenInstall/ws/sdks/java/maven-archetypes/examples/target/test-classes/projects/basic/project/basic/src/test/java/it/pkg/testing/NumberedShardedFileTest.java>:[25,26]
package org.mockito does not exist
2017-05-05T01:05:15.562 [INFO] 2017-05-05\T\01:05:15.561 [ERROR] <https://builds.apache.org/job/beam_PostCommit_Java_MavenInstall/ws/sdks/java/maven-archetypes/examples/target/test-classes/projects/basic/project/basic/src/test/java/it/pkg/testing/NumberedShardedFileTest.java>:[25,1]
static import only from classes and interfaces
2017-05-05T01:05:15.562 [INFO] 2017-05-05\T\01:05:15.561 [ERROR] <https://builds.apache.org/job/beam_PostCommit_Java_MavenInstall/ws/sdks/java/maven-archetypes/examples/target/test-classes/projects/basic/project/basic/src/test/java/it/pkg/testing/NumberedShardedFileTest.java>:[26,26]
package org.mockito does not exist
2017-05-05T01:05:15.562 [INFO] 2017-05-05\T\01:05:15.561 [ERROR] <https://builds.apache.org/job/beam_PostCommit_Java_MavenInstall/ws/sdks/java/maven-archetypes/examples/target/test-classes/projects/basic/project/basic/src/test/java/it/pkg/testing/NumberedShardedFileTest.java>:[26,1]
static import only from classes and interfaces
2017-05-05T01:05:15.562 [INFO] 2017-05-05\T\01:05:15.561 [ERROR] <https://builds.apache.org/job/beam_PostCommit_Java_MavenInstall/ws/sdks/java/maven-archetypes/examples/target/test-classes/projects/basic/project/basic/src/test/java/it/pkg/testing/NumberedShardedFileTest.java>:[37,35]
cannot find symbol
2017-05-05T01:05:15.562 [INFO] 2017-05-05\T\01:05:15.561 [ERROR] symbol:   class FastNanoClockAndSleeper
2017-05-05T01:05:15.562 [INFO] 2017-05-05\T\01:05:15.561 [ERROR] location: package org.apache.beam.sdk.testing
2017-05-05T01:05:15.562 [INFO] 2017-05-05\T\01:05:15.561 [ERROR] <https://builds.apache.org/job/beam_PostCommit_Java_MavenInstall/ws/sdks/java/maven-archetypes/examples/target/test-classes/projects/basic/project/basic/src/test/java/it/pkg/testing/NumberedShardedFileTest.java>:[45,19]
package org.mockito does not exist
2017-05-05T01:05:15.562 [INFO] 2017-05-05\T\01:05:15.561 [ERROR] <https://builds.apache.org/job/beam_PostCommit_Java_MavenInstall/ws/sdks/java/maven-archetypes/examples/target/test-classes/projects/basic/project/basic/src/test/java/it/pkg/testing/NumberedShardedFileTest.java>:[46,19]
package org.mockito does not exist
2017-05-05T01:05:15.562 [INFO] 2017-05-05\T\01:05:15.561 [ERROR] <https://builds.apache.org/job/beam_PostCommit_Java_MavenInstall/ws/sdks/java/maven-archetypes/examples/target/test-classes/projects/basic/project/basic/src/test/java/it/pkg/testing/NumberedShardedFileTest.java>:[53,16]
cannot find symbol
2017-05-05T01:05:15.562 [INFO] 2017-05-05\T\01:05:15.561 [ERROR] symbol:   class FastNanoClockAndSleeper
2017-05-05T01:05:15.562 [INFO] 2017-05-05\T\01:05:15.561 [ERROR] location: class it.pkg.testing.NumberedShardedFileTest
2017-05-05T01:05:15.562 [INFO] 2017-05-05\T\01:05:15.561 [ERROR] <https://builds.apache.org/job/beam_PostCommit_Java_MavenInstall/ws/sdks/java/maven-archetypes/examples/target/test-classes/projects/basic/project/basic/src/test/java/it/pkg/testing/FileChecksumMatcherTest.java>:[30,35]
cannot find symbol
2017-05-05T01:05:15.562 [INFO] 2017-05-05\T\01:05:15.562 [ERROR] symbol:   class FastNanoClockAndSleeper
2017-05-05T01:05:15.562 [INFO] 2017-05-05\T\01:05:15.562 [ERROR] location: package org.apache.beam.sdk.testing
2017-05-05T01:05:15.562 [INFO] 2017-05-05\T\01:05:15.562 [ERROR] <https://builds.apache.org/job/beam_PostCommit_Java_MavenInstall/ws/sdks/java/maven-archetypes/examples/target/test-classes/projects/basic/project/basic/src/test/java/it/pkg/testing/FileChecksumMatcherTest.java>:[37,19]
package org.mockito does not exist
2017-05-05T01:05:15.562 [INFO] 2017-05-05\T\01:05:15.562 [ERROR] <https://builds.apache.org/job/beam_PostCommit_Java_MavenInstall/ws/sdks/java/maven-archetypes/examples/target/test-classes/projects/basic/project/basic/src/test/java/it/pkg/testing/FileChecksumMatcherTest.java>:[38,19]
package org.mockito does not exist
2017-05-05T01:05:15.562 [INFO] 2017-05-05\T\01:05:15.562 [ERROR] <https://builds.apache.org/job/beam_PostCommit_Java_MavenInstall/ws/sdks/java/maven-archetypes/examples/target/test-classes/projects/basic/project/basic/src/test/java/it/pkg/testing/FileChecksumMatcherTest.java>:[48,10]
cannot find symbol
2017-05-05T01:05:15.562 [INFO] 2017-05-05\T\01:05:15.562 [ERROR] symbol:   class FastNanoClockAndSleeper
2017-05-05T01:05:15.562 [INFO] 2017-05-05\T\01:05:15.562 [ERROR] location: class it.pkg.testing.FileChecksumMatcherTest
2017-05-05T01:05:15.562 [INFO] 2017-05-05\T\01:05:15.562 [ERROR] <https://builds.apache.org/job/beam_PostCommit_Java_MavenInstall/ws/sdks/java/maven-archetypes/examples/target/test-classes/projects/basic/project/basic/src/test/java/it/pkg/testing/NumberedShardedFileTest.java>:[55,4]
cannot find symbol
2017-05-05T01:05:15.562 [INFO] 2017-05-05\T\01:05:15.562 [ERROR] symbol:   class Mock
2017-05-05T01:05:15.562 [INFO] 2017-05-05\T\01:05:15.562 [ERROR] location: class it.pkg.testing.NumberedShardedFileTest
2017-05-05T01:05:15.562 [INFO] 2017-05-05\T\01:05:15.562 [ERROR] <https://builds.apache.org/job/beam_PostCommit_Java_MavenInstall/ws/sdks/java/maven-archetypes/examples/target/test-classes/projects/basic/project/basic/src/test/java/it/pkg/testing/FileChecksumMatcherTest.java>:[50,4]
cannot find symbol
2017-05-05T01:05:15.562 [INFO] 2017-05-05\T\01:05:15.562 [ERROR] symbol:   class Mock
2017-05-05T01:05:15.562 [INFO] 2017-05-05\T\01:05:15.562 [ERROR] location: class it.pkg.testing.FileChecksumMatcherTest
2017-05-05T01:05:15.562 [INFO] 2017-05-05\T\01:05:15.562 [ERROR] -> [Help 1]
2017-05-05T01:05:15.562 [INFO] org.apache.maven.lifecycle.LifecycleExecutionException: Failed
to execute goal org.apache.maven.plugins:maven-compiler-plugin:3.5.1:testCompile (default-testCompile)
on project basic: Compilation failure
2017-05-05T01:05:15.562 [INFO] 	at org.apache.maven.lifecycle.internal.MojoExecutor.execute(MojoExecutor.java:212)
2017-05-05T01:05:15.562 [INFO] 	at org.apache.maven.lifecycle.internal.MojoExecutor.execute(MojoExecutor.java:153)
2017-05-05T01:05:15.562 [INFO] 	at org.apache.maven.lifecycle.internal.MojoExecutor.execute(MojoExecutor.java:145)
2017-05-05T01:05:15.562 [INFO] 	at org.apache.maven.lifecycle.internal.LifecycleModuleBuilder.buildProject(LifecycleModuleBuilder.java:116)
2017-05-05T01:05:15.562 [INFO] 	at org.apache.maven.lifecycle.internal.LifecycleModuleBuilder.buildProject(LifecycleModuleBuilder.java:80)
2017-05-05T01:05:15.562 [INFO] 	at org.apache.maven.lifecycle.internal.builder.singlethreaded.SingleThreadedBuilder.build(SingleThreadedBuilder.java:51)
2017-05-05T01:05:15.562 [INFO] 	at org.apache.maven.lifecycle.internal.LifecycleStarter.execute(LifecycleStarter.java:128)
2017-05-05T01:05:15.562 [INFO] 	at org.apache.maven.DefaultMaven.doExecute(DefaultMaven.java:307)
2017-05-05T01:05:15.562 [INFO] 	at org.apache.maven.DefaultMaven.doExecute(DefaultMaven.java:193)
2017-05-05T01:05:15.562 [INFO] 	at org.apache.maven.DefaultMaven.execute(DefaultMaven.java:106)
2017-05-05T01:05:15.562 [INFO] 	at org.apache.maven.cli.MavenCli.execute(MavenCli.java:862)
2017-05-05T01:05:15.562 [INFO] 	at org.apache.maven.cli.MavenCli.doMain(MavenCli.java:286)
2017-05-05T01:05:15.562 [INFO] 	at org.apache.maven.cli.MavenCli.main(MavenCli.java:197)
2017-05-05T01:05:15.562 [INFO] 	at sun.reflect.NativeMethodAccessorImpl.invoke0(Native Method)
2017-05-05T01:05:15.562 [INFO] 	at sun.reflect.NativeMethodAccessorImpl.invoke(NativeMethodAccessorImpl.java:62)
2017-05-05T01:05:15.562 [INFO] 	at sun.reflect.DelegatingMethodAccessorImpl.invoke(DelegatingMethodAccessorImpl.java:43)
2017-05-05T01:05:15.563 [INFO] 	at java.lang.reflect.Method.invoke(Method.java:498)
2017-05-05T01:05:15.563 [INFO] 	at org.codehaus.plexus.classworlds.launcher.Launcher.launchEnhanced(Launcher.java:289)
2017-05-05T01:05:15.563 [INFO] 	at org.codehaus.plexus.classworlds.launcher.Launcher.launch(Launcher.java:229)
2017-05-05T01:05:15.563 [INFO] 	at org.codehaus.plexus.classworlds.launcher.Launcher.mainWithExitCode(Launcher.java:415)
2017-05-05T01:05:15.563 [INFO] 	at org.codehaus.plexus.classworlds.launcher.Launcher.main(Launcher.java:356)
2017-05-05T01:05:15.563 [INFO] Caused by: org.apache.maven.plugin.compiler.CompilationFailureException:
Compilation failure
2017-05-05T01:05:15.563 [INFO] 	at org.apache.maven.plugin.compiler.AbstractCompilerMojo.execute(AbstractCompilerMojo.java:972)
2017-05-05T01:05:15.563 [INFO] 	at org.apache.maven.plugin.compiler.TestCompilerMojo.execute(TestCompilerMojo.java:153)
2017-05-05T01:05:15.563 [INFO] 	at org.apache.maven.plugin.DefaultBuildPluginManager.executeMojo(DefaultBuildPluginManager.java:134)
2017-05-05T01:05:15.563 [INFO] 	at org.apache.maven.lifecycle.internal.MojoExecutor.execute(MojoExecutor.java:208)
2017-05-05T01:05:15.563 [INFO] 	... 20 more
2017-05-05T01:05:15.563 [INFO] 2017-05-05\T\01:05:15.562 [ERROR] 
2017-05-05T01:05:15.563 [INFO] 2017-05-05\T\01:05:15.562 [ERROR] Re-run Maven using the -X
switch to enable full debug logging.
2017-05-05T01:05:15.563 [INFO] 2017-05-05\T\01:05:15.563 [ERROR] 
2017-05-05T01:05:15.563 [INFO] 2017-05-05\T\01:05:15.563 [ERROR] For more information about
the errors and possible solutions, please read the following articles:
2017-05-05T01:05:15.563 [INFO] 2017-05-05\T\01:05:15.563 [ERROR] [Help 1] http://cwiki.apache.org/confluence/display/MAVEN/MojoFailureException
2017-05-05T01:05:15.583 [INFO] Post-archetype-generation invoker exit code: 1
[JENKINS] Recording test results
[JENKINS] Archiving disabled
2017-05-05T01:05:16.346 [INFO]                                                           
             
2017-05-05T01:05:16.346 [INFO] ------------------------------------------------------------------------
2017-05-05T01:05:16.346 [INFO] Skipping Apache Beam :: Parent
2017-05-05T01:05:16.346 [INFO] This project has been banned from the build due to previous
failures.
2017-05-05T01:05:16.346 [INFO] ------------------------------------------------------------------------
[JENKINS] Archiving disabled
[JENKINS] Archiving disabled
[JENKINS] Archiving disabled
[JENKINS] Archiving disabled
[JENKINS] Archiving disabled
[JENKINS] Archiving disabled
[JENKINS] Archiving disabled
[JENKINS] Archiving disabled
[JENKINS] Archiving disabled
[JENKINS] Archiving disabled
[JENKINS] Archiving disabled
[JENKINS] Archiving disabled
[JENKINS] Archiving disabled
[JENKINS] Archiving disabled
[JENKINS] Archiving disabled
[JENKINS] Archiving disabled
[JENKINS] Archiving disabled
[JENKINS] Archiving disabled
[JENKINS] Archiving disabled
[JENKINS] Archiving disabled
[JENKINS] Archiving disabled
[JENKINS] Archiving disabled
[JENKINS] Archiving disabled
[JENKINS] Archiving disabled
[JENKINS] Archiving disabled
[JENKINS] Archiving disabled
[JENKINS] Archiving disabled
[JENKINS] Archiving disabled
[JENKINS] Archiving disabled
[JENKINS] Archiving disabled
[JENKINS] Archiving disabled
[JENKINS] Archiving disabled
[JENKINS] Archiving disabled
[JENKINS] Archiving disabled
[JENKINS] Archiving disabled
[JENKINS] Archiving disabled
[JENKINS] Archiving disabled
[JENKINS] Archiving disabled
[JENKINS] Archiving disabled
[JENKINS] Archiving disabled
[JENKINS] Archiving disabled
[JENKINS] Archiving disabled
[JENKINS] Archiving disabled
[JENKINS] Archiving disabled
[JENKINS] Archiving disabled
2017-05-05T01:05:34.801 [INFO] ------------------------------------------------------------------------
2017-05-05T01:05:34.801 [INFO] Reactor Summary:
2017-05-05T01:05:34.801 [INFO] 
2017-05-05T01:05:34.801 [INFO] Apache Beam :: Parent .............................. SUCCESS
[ 28.540 s]
2017-05-05T01:05:34.801 [INFO] Apache Beam :: SDKs :: Java :: Build Tools ......... SUCCESS
[ 11.762 s]
2017-05-05T01:05:34.801 [INFO] Apache Beam :: SDKs ................................ SUCCESS
[  5.185 s]
2017-05-05T01:05:34.801 [INFO] Apache Beam :: SDKs :: Common ...................... SUCCESS
[  1.508 s]
2017-05-05T01:05:34.801 [INFO] Apache Beam :: SDKs :: Common :: Fn API ............ SUCCESS
[ 18.711 s]
2017-05-05T01:05:34.801 [INFO] Apache Beam :: SDKs :: Common :: Runner API ........ SUCCESS
[ 12.433 s]
2017-05-05T01:05:34.801 [INFO] Apache Beam :: SDKs :: Java ........................ SUCCESS
[  1.737 s]
2017-05-05T01:05:34.801 [INFO] Apache Beam :: SDKs :: Java :: Core ................ SUCCESS
[02:10 min]
2017-05-05T01:05:34.801 [INFO] Apache Beam :: SDKs :: Java :: IO .................. SUCCESS
[  1.541 s]
2017-05-05T01:05:34.801 [INFO] Apache Beam :: SDKs :: Java :: IO :: Common ........ SUCCESS
[  3.943 s]
2017-05-05T01:05:34.801 [INFO] Apache Beam :: Runners ............................. SUCCESS
[  1.552 s]
2017-05-05T01:05:34.801 [INFO] Apache Beam :: Runners :: Core Construction Java ... SUCCESS
[ 19.906 s]
2017-05-05T01:05:34.801 [INFO] Apache Beam :: Runners :: Core Java ................ SUCCESS
[ 42.261 s]
2017-05-05T01:05:34.801 [INFO] Apache Beam :: Runners :: Direct Java .............. SUCCESS
[02:40 min]
2017-05-05T01:05:34.801 [INFO] Apache Beam :: SDKs :: Java :: IO :: Elasticsearch . SUCCESS
[ 39.814 s]
2017-05-05T01:05:34.801 [INFO] Apache Beam :: SDKs :: Java :: Extensions .......... SUCCESS
[  1.404 s]
2017-05-05T01:05:34.801 [INFO] Apache Beam :: SDKs :: Java :: Extensions :: Google Cloud Platform
Core SUCCESS [ 32.460 s]
2017-05-05T01:05:34.801 [INFO] Apache Beam :: SDKs :: Java :: Extensions :: Protobuf SUCCESS
[ 19.123 s]
2017-05-05T01:05:34.801 [INFO] Apache Beam :: SDKs :: Java :: IO :: Google Cloud Platform
SUCCESS [01:41 min]
2017-05-05T01:05:34.801 [INFO] Apache Beam :: SDKs :: Java :: IO :: Hadoop Common . SUCCESS
[ 20.498 s]
2017-05-05T01:05:34.802 [INFO] Apache Beam :: SDKs :: Java :: IO :: Hadoop File System SUCCESS
[ 41.750 s]
2017-05-05T01:05:34.802 [INFO] Apache Beam :: SDKs :: Java :: IO :: Hadoop ........ SUCCESS
[  3.420 s]
2017-05-05T01:05:34.802 [INFO] Apache Beam :: SDKs :: Java :: IO :: Hadoop :: input-format
SUCCESS [ 22.275 s]
2017-05-05T01:05:34.802 [INFO] Apache Beam :: Runners :: Google Cloud Dataflow .... SUCCESS
[04:50 min]
2017-05-05T01:05:34.802 [INFO] Apache Beam :: SDKs :: Java :: IO :: Hadoop :: jdk1.8-tests
SUCCESS [01:17 min]
2017-05-05T01:05:34.802 [INFO] Apache Beam :: SDKs :: Java :: IO :: HBase ......... SUCCESS
[01:05 min]
2017-05-05T01:05:34.802 [INFO] Apache Beam :: SDKs :: Java :: IO :: JDBC .......... SUCCESS
[ 24.310 s]
2017-05-05T01:05:34.802 [INFO] Apache Beam :: SDKs :: Java :: IO :: JMS ........... SUCCESS
[ 18.609 s]
2017-05-05T01:05:34.802 [INFO] Apache Beam :: SDKs :: Java :: IO :: Kafka ......... SUCCESS
[ 27.481 s]
2017-05-05T01:05:34.802 [INFO] Apache Beam :: SDKs :: Java :: IO :: Kinesis ....... SUCCESS
[ 20.537 s]
2017-05-05T01:05:34.802 [INFO] Apache Beam :: SDKs :: Java :: IO :: MongoDB ....... SUCCESS
[ 26.267 s]
2017-05-05T01:05:34.802 [INFO] Apache Beam :: SDKs :: Java :: IO :: MQTT .......... SUCCESS
[ 16.741 s]
2017-05-05T01:05:34.802 [INFO] Apache Beam :: SDKs :: Java :: IO :: XML ........... SUCCESS
[ 20.148 s]
2017-05-05T01:05:34.802 [INFO] Apache Beam :: SDKs :: Java :: Maven Archetypes .... SUCCESS
[  1.543 s]
2017-05-05T01:05:34.802 [INFO] Apache Beam :: SDKs :: Java :: Maven Archetypes :: Starter
SUCCESS [ 13.446 s]
2017-05-05T01:05:34.802 [INFO] Apache Beam :: SDKs :: Java :: Maven Archetypes :: Examples
FAILURE [ 16.307 s]
2017-05-05T01:05:34.802 [INFO] Apache Beam :: SDKs :: Java :: Maven Archetypes :: Examples
- Java 8 SKIPPED
2017-05-05T01:05:34.802 [INFO] Apache Beam :: SDKs :: Java :: Extensions :: Jackson SKIPPED
2017-05-05T01:05:34.802 [INFO] Apache Beam :: SDKs :: Java :: Extensions :: Join library SKIPPED
2017-05-05T01:05:34.802 [INFO] Apache Beam :: SDKs :: Java :: Extensions :: Sorter  SKIPPED
2017-05-05T01:05:34.802 [INFO] Apache Beam :: SDKs :: Java :: Harness ............. SKIPPED
2017-05-05T01:05:34.802 [INFO] Apache Beam :: SDKs :: Java :: Java 8 Tests ........ SKIPPED
2017-05-05T01:05:34.802 [INFO] Apache Beam :: SDKs :: Python ...................... SKIPPED
2017-05-05T01:05:34.802 [INFO] Apache Beam :: Runners :: Flink .................... SKIPPED
2017-05-05T01:05:34.802 [INFO] Apache Beam :: Runners :: Spark .................... SKIPPED
2017-05-05T01:05:34.802 [INFO] Apache Beam :: Runners :: Apex ..................... SKIPPED
2017-05-05T01:05:34.802 [INFO] Apache Beam :: Examples ............................ SKIPPED
2017-05-05T01:05:34.802 [INFO] Apache Beam :: Examples :: Java .................... SKIPPED
2017-05-05T01:05:34.802 [INFO] Apache Beam :: Examples :: Java 8 .................. SKIPPED
2017-05-05T01:05:34.802 [INFO] Apache Beam :: SDKs :: Java :: Aggregated Javadoc .. SKIPPED
2017-05-05T01:05:34.802 [INFO] ------------------------------------------------------------------------
2017-05-05T01:05:34.802 [INFO] BUILD FAILURE
2017-05-05T01:05:34.802 [INFO] ------------------------------------------------------------------------
2017-05-05T01:05:34.803 [INFO] Total time: 23:22 min
2017-05-05T01:05:34.803 [INFO] Finished at: 2017-05-05T01:05:34+00:00
[JENKINS] Archiving disabled
2017-05-05T01:05:35.955 [INFO] Final Memory: 263M/1533M
2017-05-05T01:05:35.955 [INFO] ------------------------------------------------------------------------
Waiting for Jenkins to finish collecting data
2017-05-05T01:06:38.630 [ERROR] Failed to execute goal org.apache.maven.plugins:maven-archetype-plugin:2.4:integration-test
(default-integration-test) on project beam-sdks-java-maven-archetypes-examples:
2017-05-05T01:06:38.630 [ERROR] Archetype IT 'basic' failed: Execution failure: exit code
= 1
2017-05-05T01:06:38.630 [ERROR] -> [Help 1]
org.apache.maven.lifecycle.LifecycleExecutionException: Failed to execute goal org.apache.maven.plugins:maven-archetype-plugin:2.4:integration-test
(default-integration-test) on project beam-sdks-java-maven-archetypes-examples: 
Archetype IT 'basic' failed: Execution failure: exit code = 1
	at org.apache.maven.lifecycle.internal.MojoExecutor.execute(MojoExecutor.java:216)
	at org.apache.maven.lifecycle.internal.MojoExecutor.execute(MojoExecutor.java:153)
	at org.apache.maven.lifecycle.internal.MojoExecutor.execute(MojoExecutor.java:145)
	at org.apache.maven.lifecycle.internal.LifecycleModuleBuilder.buildProject(LifecycleModuleBuilder.java:116)
	at org.apache.maven.lifecycle.internal.LifecycleModuleBuilder.buildProject(LifecycleModuleBuilder.java:80)
	at org.apache.maven.lifecycle.internal.builder.singlethreaded.SingleThreadedBuilder.build(SingleThreadedBuilder.java:51)
	at org.apache.maven.lifecycle.internal.LifecycleStarter.execute(LifecycleStarter.java:128)
	at org.apache.maven.DefaultMaven.doExecute(DefaultMaven.java:307)
	at org.apache.maven.DefaultMaven.doExecute(DefaultMaven.java:193)
	at org.apache.maven.DefaultMaven.execute(DefaultMaven.java:106)
	at org.jvnet.hudson.maven3.launcher.Maven33Launcher.main(Maven33Launcher.java:129)
	at sun.reflect.NativeMethodAccessorImpl.invoke0(Native Method)
	at sun.reflect.NativeMethodAccessorImpl.invoke(NativeMethodAccessorImpl.java:62)
	at sun.reflect.DelegatingMethodAccessorImpl.invoke(DelegatingMethodAccessorImpl.java:43)
	at java.lang.reflect.Method.invoke(Method.java:498)
	at org.codehaus.plexus.classworlds.launcher.Launcher.launchStandard(Launcher.java:330)
	at org.codehaus.plexus.classworlds.launcher.Launcher.launch(Launcher.java:238)
	at jenkins.maven3.agent.Maven33Main.launch(Maven33Main.java:176)
	at sun.reflect.NativeMethodAccessorImpl.invoke0(Native Method)
	at sun.reflect.NativeMethodAccessorImpl.invoke(NativeMethodAccessorImpl.java:62)
	at sun.reflect.DelegatingMethodAccessorImpl.invoke(DelegatingMethodAccessorImpl.java:43)
	at java.lang.reflect.Method.invoke(Method.java:498)
	at hudson.maven.Maven3Builder.call(Maven3Builder.java:139)
	at hudson.maven.Maven3Builder.call(Maven3Builder.java:70)
	at hudson.remoting.UserRequest.perform(UserRequest.java:153)
	at hudson.remoting.UserRequest.perform(UserRequest.java:50)
	at hudson.remoting.Request$2.run(Request.java:336)
	at hudson.remoting.InterceptingExecutorService$1.call(InterceptingExecutorService.java:68)
	at java.util.concurrent.FutureTask.run(FutureTask.java:266)
	at java.util.concurrent.ThreadPoolExecutor.runWorker(ThreadPoolExecutor.java:1142)
	at java.util.concurrent.ThreadPoolExecutor$Worker.run(ThreadPoolExecutor.java:617)
	at java.lang.Thread.run(Thread.java:745)
Caused by: org.apache.maven.plugin.MojoExecutionException: 
Archetype IT 'basic' failed: Execution failure: exit code = 1
	at org.apache.maven.archetype.mojos.IntegrationTestMojo.execute(IntegrationTestMojo.java:269)
	at org.apache.maven.plugin.DefaultBuildPluginManager.executeMojo(DefaultBuildPluginManager.java:134)
	at org.apache.maven.lifecycle.internal.MojoExecutor.execute(MojoExecutor.java:208)
	... 31 more
2017-05-05T01:06:38.631 [ERROR] 
2017-05-05T01:06:38.632 [ERROR] Re-run Maven using the -X switch to enable full debug logging.
2017-05-05T01:06:38.632 [ERROR] 
2017-05-05T01:06:38.632 [ERROR] For more information about the errors and possible solutions,
please read the following articles:
2017-05-05T01:06:38.632 [ERROR] [Help 1] http://cwiki.apache.org/confluence/display/MAVEN/MojoExecutionException
2017-05-05T01:06:38.632 [ERROR] 
2017-05-05T01:06:38.632 [ERROR] After correcting the problems, you can resume the build with
the command
2017-05-05T01:06:38.632 [ERROR]   mvn <goals> -rf :beam-sdks-java-maven-archetypes-examples
channel stopped
Not sending mail to unregistered user klk@google.com
Not sending mail to unregistered user kirpichov@google.com

Mime
View raw message