beam-commits mailing list archives

Site index · List index
Message view « Date » · « Thread »
Top « Date » · « Thread »
From Apache Jenkins Server <jenk...@builds.apache.org>
Subject Build failed in Jenkins: beam_PostCommit_Java_JDK_Versions_Test » JDK 1.8 (latest),beam #3
Date Tue, 02 May 2017 23:57:59 GMT
See <https://builds.apache.org/job/beam_PostCommit_Java_JDK_Versions_Test/jdk=JDK%201.8%20(latest),label=beam/3/display/redirect?page=changes>

Changes:

[dhalperi] Full removal of Aggregators in Java SDK and Runners

------------------------------------------
[...truncated 1.20 MB...]
2017-05-02\T\23:57:53.839 [INFO] 2017-05-02\T\23:57:53.839 [INFO] Downloading: https://repo.maven.apache.org/maven2/org/apache/maven/maven-profile/2.0.9/maven-profile-2.0.9.pom
2017-05-02\T\23:57:53.874 [INFO] 2017-05-02\T\23:57:53.871 [INFO] Downloaded: https://repo.maven.apache.org/maven2/org/apache/maven/maven-profile/2.0.9/maven-profile-2.0.9.pom
(3 KB at 60.7 KB/sec)
2017-05-02\T\23:57:53.891 [INFO] 2017-05-02\T\23:57:53.890 [INFO] Downloading: https://repo.maven.apache.org/maven2/org/apache/maven/maven-artifact-manager/2.0.9/maven-artifact-manager-2.0.9.pom
2017-05-02\T\23:57:53.940 [INFO] 2017-05-02\T\23:57:53.940 [INFO] Downloaded: https://repo.maven.apache.org/maven2/org/apache/maven/maven-artifact-manager/2.0.9/maven-artifact-manager-2.0.9.pom
(3 KB at 52.7 KB/sec)
2017-05-02\T\23:57:53.946 [INFO] 2017-05-02\T\23:57:53.946 [INFO] Downloading: https://repo.maven.apache.org/maven2/org/apache/maven/maven-repository-metadata/2.0.9/maven-repository-metadata-2.0.9.pom
2017-05-02\T\23:57:53.979 [INFO] 2017-05-02\T\23:57:53.979 [INFO] Downloaded: https://repo.maven.apache.org/maven2/org/apache/maven/maven-repository-metadata/2.0.9/maven-repository-metadata-2.0.9.pom
(2 KB at 56.3 KB/sec)
2017-05-02\T\23:57:53.984 [INFO] 2017-05-02\T\23:57:53.984 [INFO] Downloading: https://repo.maven.apache.org/maven2/org/apache/maven/maven-plugin-registry/2.0.9/maven-plugin-registry-2.0.9.pom
2017-05-02\T\23:57:54.014 [INFO] 2017-05-02\T\23:57:54.014 [INFO] Downloaded: https://repo.maven.apache.org/maven2/org/apache/maven/maven-plugin-registry/2.0.9/maven-plugin-registry-2.0.9.pom
(2 KB at 64.2 KB/sec)
2017-05-02\T\23:57:54.018 [INFO] 2017-05-02\T\23:57:54.018 [INFO] Downloading: https://repo.maven.apache.org/maven2/org/apache/maven/maven-core/2.0.9/maven-core-2.0.9.pom
2017-05-02\T\23:57:54.050 [INFO] 2017-05-02\T\23:57:54.049 [INFO] Downloaded: https://repo.maven.apache.org/maven2/org/apache/maven/maven-core/2.0.9/maven-core-2.0.9.pom
(8 KB at 245.2 KB/sec)
2017-05-02\T\23:57:54.080 [INFO] 2017-05-02\T\23:57:54.079 [INFO] Downloading: https://repo.maven.apache.org/maven2/org/apache/maven/maven-plugin-parameter-documenter/2.0.9/maven-plugin-parameter-documenter-2.0.9.pom
2017-05-02\T\23:57:54.137 [INFO] 2017-05-02\T\23:57:54.136 [INFO] Downloaded: https://repo.maven.apache.org/maven2/org/apache/maven/maven-plugin-parameter-documenter/2.0.9/maven-plugin-parameter-documenter-2.0.9.pom
(2 KB at 33.6 KB/sec)
2017-05-02\T\23:57:54.141 [INFO] 2017-05-02\T\23:57:54.141 [INFO] Downloading: https://repo.maven.apache.org/maven2/org/apache/maven/reporting/maven-reporting-api/2.0.9/maven-reporting-api-2.0.9.pom
2017-05-02\T\23:57:54.184 [INFO] 2017-05-02\T\23:57:54.183 [INFO] Downloaded: https://repo.maven.apache.org/maven2/org/apache/maven/reporting/maven-reporting-api/2.0.9/maven-reporting-api-2.0.9.pom
(2 KB at 41.9 KB/sec)
2017-05-02\T\23:57:54.186 [INFO] 2017-05-02\T\23:57:54.186 [INFO] Downloading: https://repo.maven.apache.org/maven2/org/apache/maven/reporting/maven-reporting/2.0.9/maven-reporting-2.0.9.pom
2017-05-02\T\23:57:54.219 [INFO] 2017-05-02\T\23:57:54.218 [INFO] Downloaded: https://repo.maven.apache.org/maven2/org/apache/maven/reporting/maven-reporting/2.0.9/maven-reporting-2.0.9.pom
(2 KB at 45.0 KB/sec)
2017-05-02\T\23:57:54.222 [INFO] 2017-05-02\T\23:57:54.222 [INFO] Downloading: https://repo.maven.apache.org/maven2/org/apache/maven/maven-error-diagnostics/2.0.9/maven-error-diagnostics-2.0.9.pom
2017-05-02\T\23:57:54.254 [INFO] 2017-05-02\T\23:57:54.251 [INFO] Downloaded: https://repo.maven.apache.org/maven2/org/apache/maven/maven-error-diagnostics/2.0.9/maven-error-diagnostics-2.0.9.pom
(2 KB at 58.7 KB/sec)
2017-05-02\T\23:57:54.280 [INFO] 2017-05-02\T\23:57:54.279 [INFO] Downloading: https://repo.maven.apache.org/maven2/org/apache/maven/maven-plugin-descriptor/2.0.9/maven-plugin-descriptor-2.0.9.pom
2017-05-02\T\23:57:54.310 [INFO] 2017-05-02\T\23:57:54.309 [INFO] Downloaded: https://repo.maven.apache.org/maven2/org/apache/maven/maven-plugin-descriptor/2.0.9/maven-plugin-descriptor-2.0.9.pom
(3 KB at 69.9 KB/sec)
2017-05-02\T\23:57:54.314 [INFO] 2017-05-02\T\23:57:54.313 [INFO] Downloading: https://repo.maven.apache.org/maven2/org/apache/maven/maven-monitor/2.0.9/maven-monitor-2.0.9.pom
2017-05-02\T\23:57:54.350 [INFO] 2017-05-02\T\23:57:54.347 [INFO] Downloaded: https://repo.maven.apache.org/maven2/org/apache/maven/maven-monitor/2.0.9/maven-monitor-2.0.9.pom
(2 KB at 36.9 KB/sec)
2017-05-02\T\23:57:54.352 [INFO] 2017-05-02\T\23:57:54.352 [INFO] Downloading: https://repo.maven.apache.org/maven2/org/apache/maven/maven-toolchain/2.0.9/maven-toolchain-2.0.9.pom
2017-05-02\T\23:57:54.384 [INFO] 2017-05-02\T\23:57:54.382 [INFO] Downloaded: https://repo.maven.apache.org/maven2/org/apache/maven/maven-toolchain/2.0.9/maven-toolchain-2.0.9.pom
(4 KB at 113.2 KB/sec)
2017-05-02\T\23:57:54.399 [INFO] 2017-05-02\T\23:57:54.399 [INFO] Downloading: https://repo.maven.apache.org/maven2/org/apache/maven/shared/maven-common-artifact-filters/1.3/maven-common-artifact-filters-1.3.pom
2017-05-02\T\23:57:54.431 [INFO] 2017-05-02\T\23:57:54.431 [INFO] Downloaded: https://repo.maven.apache.org/maven2/org/apache/maven/shared/maven-common-artifact-filters/1.3/maven-common-artifact-filters-1.3.pom
(4 KB at 113.0 KB/sec)
2017-05-02\T\23:57:54.486 [INFO] 2017-05-02\T\23:57:54.484 [INFO] Downloading: https://repo.maven.apache.org/maven2/org/apache/maven/maven-plugin-api/2.0.9/maven-plugin-api-2.0.9.jar
2017-05-02\T\23:57:54.486 [INFO] 2017-05-02\T\23:57:54.484 [INFO] Downloading: https://repo.maven.apache.org/maven2/org/apache/maven/surefire/surefire-booter/2.12.4/surefire-booter-2.12.4.jar
2017-05-02\T\23:57:54.490 [INFO] 2017-05-02\T\23:57:54.490 [INFO] Downloading: https://repo.maven.apache.org/maven2/org/apache/maven/surefire/maven-surefire-common/2.12.4/maven-surefire-common-2.12.4.jar
2017-05-02\T\23:57:54.495 [INFO] 2017-05-02\T\23:57:54.494 [INFO] Downloading: https://repo.maven.apache.org/maven2/org/apache/maven/surefire/surefire-api/2.12.4/surefire-api-2.12.4.jar
2017-05-02\T\23:57:54.496 [INFO] 2017-05-02\T\23:57:54.496 [INFO] Downloading: https://repo.maven.apache.org/maven2/org/apache/maven/shared/maven-common-artifact-filters/1.3/maven-common-artifact-filters-1.3.jar
2017-05-02\T\23:57:54.519 [INFO] 2017-05-02\T\23:57:54.518 [INFO] Downloaded: https://repo.maven.apache.org/maven2/org/apache/maven/maven-plugin-api/2.0.9/maven-plugin-api-2.0.9.jar
(13 KB at 349.7 KB/sec)
2017-05-02\T\23:57:54.519 [INFO] 2017-05-02\T\23:57:54.519 [INFO] Downloading: https://repo.maven.apache.org/maven2/org/codehaus/plexus/plexus-utils/3.0.8/plexus-utils-3.0.8.jar
2017-05-02\T\23:57:54.523 [INFO] 2017-05-02\T\23:57:54.522 [INFO] Downloaded: https://repo.maven.apache.org/maven2/org/apache/maven/surefire/surefire-booter/2.12.4/surefire-booter-2.12.4.jar
(34 KB at 891.3 KB/sec)
2017-05-02\T\23:57:54.523 [INFO] 2017-05-02\T\23:57:54.522 [INFO] Downloading: https://repo.maven.apache.org/maven2/org/apache/maven/maven-artifact/2.0.9/maven-artifact-2.0.9.jar
2017-05-02\T\23:57:54.545 [INFO] 2017-05-02\T\23:57:54.545 [INFO] Downloaded: https://repo.maven.apache.org/maven2/org/apache/maven/shared/maven-common-artifact-filters/1.3/maven-common-artifact-filters-1.3.jar
(31 KB at 551.5 KB/sec)
2017-05-02\T\23:57:54.545 [INFO] 2017-05-02\T\23:57:54.545 [INFO] Downloading: https://repo.maven.apache.org/maven2/org/apache/maven/maven-project/2.0.9/maven-project-2.0.9.jar
2017-05-02\T\23:57:54.574 [INFO] 2017-05-02\T\23:57:54.573 [INFO] Downloaded: https://repo.maven.apache.org/maven2/org/apache/maven/maven-artifact/2.0.9/maven-artifact-2.0.9.jar
(87 KB at 1071.9 KB/sec)
2017-05-02\T\23:57:54.574 [INFO] 2017-05-02\T\23:57:54.573 [INFO] Downloading: https://repo.maven.apache.org/maven2/org/apache/maven/maven-settings/2.0.9/maven-settings-2.0.9.jar
2017-05-02\T\23:57:54.596 [INFO] 2017-05-02\T\23:57:54.595 [INFO] Downloaded: https://repo.maven.apache.org/maven2/org/codehaus/plexus/plexus-utils/3.0.8/plexus-utils-3.0.8.jar
(227 KB at 2197.9 KB/sec)
2017-05-02\T\23:57:54.596 [INFO] 2017-05-02\T\23:57:54.595 [INFO] Downloading: https://repo.maven.apache.org/maven2/org/apache/maven/maven-profile/2.0.9/maven-profile-2.0.9.jar
2017-05-02\T\23:57:54.597 [INFO] 2017-05-02\T\23:57:54.597 [INFO] Downloaded: https://repo.maven.apache.org/maven2/org/apache/maven/surefire/surefire-api/2.12.4/surefire-api-2.12.4.jar
(115 KB at 1016.2 KB/sec)
2017-05-02\T\23:57:54.597 [INFO] 2017-05-02\T\23:57:54.597 [INFO] Downloading: https://repo.maven.apache.org/maven2/org/apache/maven/maven-artifact-manager/2.0.9/maven-artifact-manager-2.0.9.jar
2017-05-02\T\23:57:54.610 [INFO] 2017-05-02\T\23:57:54.609 [INFO] Downloaded: https://repo.maven.apache.org/maven2/org/apache/maven/maven-project/2.0.9/maven-project-2.0.9.jar
(119 KB at 1016.5 KB/sec)
2017-05-02\T\23:57:54.610 [INFO] 2017-05-02\T\23:57:54.609 [INFO] Downloading: https://repo.maven.apache.org/maven2/org/apache/maven/maven-plugin-registry/2.0.9/maven-plugin-registry-2.0.9.jar
2017-05-02\T\23:57:54.615 [INFO] 2017-05-02\T\23:57:54.615 [INFO] Downloaded: https://repo.maven.apache.org/maven2/org/apache/maven/maven-settings/2.0.9/maven-settings-2.0.9.jar
(48 KB at 393.1 KB/sec)
2017-05-02\T\23:57:54.615 [INFO] 2017-05-02\T\23:57:54.615 [INFO] Downloading: https://repo.maven.apache.org/maven2/org/apache/maven/maven-core/2.0.9/maven-core-2.0.9.jar
2017-05-02\T\23:57:54.623 [INFO] 2017-05-02\T\23:57:54.623 [INFO] Downloaded: https://repo.maven.apache.org/maven2/org/apache/maven/surefire/maven-surefire-common/2.12.4/maven-surefire-common-2.12.4.jar
(257 KB at 1885.8 KB/sec)
2017-05-02\T\23:57:54.626 [INFO] 2017-05-02\T\23:57:54.626 [INFO] Downloading: https://repo.maven.apache.org/maven2/org/apache/maven/maven-plugin-parameter-documenter/2.0.9/maven-plugin-parameter-documenter-2.0.9.jar
2017-05-02\T\23:57:54.638 [INFO] 2017-05-02\T\23:57:54.638 [INFO] Downloaded: https://repo.maven.apache.org/maven2/org/apache/maven/maven-profile/2.0.9/maven-profile-2.0.9.jar
(35 KB at 236.5 KB/sec)
2017-05-02\T\23:57:54.639 [INFO] 2017-05-02\T\23:57:54.638 [INFO] Downloading: https://repo.maven.apache.org/maven2/org/apache/maven/reporting/maven-reporting-api/2.0.9/maven-reporting-api-2.0.9.jar
2017-05-02\T\23:57:54.644 [INFO] 2017-05-02\T\23:57:54.643 [INFO] Downloaded: https://repo.maven.apache.org/maven2/org/apache/maven/maven-plugin-registry/2.0.9/maven-plugin-registry-2.0.9.jar
(29 KB at 188.0 KB/sec)
2017-05-02\T\23:57:54.645 [INFO] 2017-05-02\T\23:57:54.643 [INFO] Downloading: https://repo.maven.apache.org/maven2/org/apache/maven/maven-repository-metadata/2.0.9/maven-repository-metadata-2.0.9.jar
2017-05-02\T\23:57:54.648 [INFO] 2017-05-02\T\23:57:54.648 [INFO] Downloaded: https://repo.maven.apache.org/maven2/org/apache/maven/maven-artifact-manager/2.0.9/maven-artifact-manager-2.0.9.jar
(57 KB at 362.0 KB/sec)
2017-05-02\T\23:57:54.648 [INFO] 2017-05-02\T\23:57:54.648 [INFO] Downloading: https://repo.maven.apache.org/maven2/org/apache/maven/maven-error-diagnostics/2.0.9/maven-error-diagnostics-2.0.9.jar
2017-05-02\T\23:57:54.659 [INFO] 2017-05-02\T\23:57:54.659 [INFO] Downloaded: https://repo.maven.apache.org/maven2/org/apache/maven/maven-plugin-parameter-documenter/2.0.9/maven-plugin-parameter-documenter-2.0.9.jar
(21 KB at 122.1 KB/sec)
2017-05-02\T\23:57:54.660 [INFO] 2017-05-02\T\23:57:54.659 [INFO] Downloading: https://repo.maven.apache.org/maven2/org/apache/maven/maven-plugin-descriptor/2.0.9/maven-plugin-descriptor-2.0.9.jar
2017-05-02\T\23:57:54.674 [INFO] 2017-05-02\T\23:57:54.674 [INFO] Downloaded: https://repo.maven.apache.org/maven2/org/apache/maven/reporting/maven-reporting-api/2.0.9/maven-reporting-api-2.0.9.jar
(10 KB at 54.4 KB/sec)
2017-05-02\T\23:57:54.674 [INFO] 2017-05-02\T\23:57:54.674 [INFO] Downloading: https://repo.maven.apache.org/maven2/org/apache/maven/maven-monitor/2.0.9/maven-monitor-2.0.9.jar
2017-05-02\T\23:57:54.676 [INFO] 2017-05-02\T\23:57:54.675 [INFO] Downloaded: https://repo.maven.apache.org/maven2/org/apache/maven/maven-repository-metadata/2.0.9/maven-repository-metadata-2.0.9.jar
(24 KB at 131.1 KB/sec)
2017-05-02\T\23:57:54.676 [INFO] 2017-05-02\T\23:57:54.675 [INFO] Downloading: https://repo.maven.apache.org/maven2/org/apache/maven/maven-toolchain/2.0.9/maven-toolchain-2.0.9.jar
2017-05-02\T\23:57:54.681 [INFO] 2017-05-02\T\23:57:54.681 [INFO] Downloaded: https://repo.maven.apache.org/maven2/org/apache/maven/maven-error-diagnostics/2.0.9/maven-error-diagnostics-2.0.9.jar
(14 KB at 71.2 KB/sec)
2017-05-02\T\23:57:54.681 [INFO] 2017-05-02\T\23:57:54.681 [INFO] Downloading: https://repo.maven.apache.org/maven2/org/apache/maven/plugin-tools/maven-plugin-annotations/3.1/maven-plugin-annotations-3.1.jar
2017-05-02\T\23:57:54.683 [INFO] 2017-05-02\T\23:57:54.683 [INFO] Downloaded: https://repo.maven.apache.org/maven2/org/apache/maven/maven-core/2.0.9/maven-core-2.0.9.jar
(156 KB at 816.2 KB/sec)
2017-05-02\T\23:57:54.693 [INFO] 2017-05-02\T\23:57:54.693 [INFO] Downloaded: https://repo.maven.apache.org/maven2/org/apache/maven/maven-plugin-descriptor/2.0.9/maven-plugin-descriptor-2.0.9.jar
(37 KB at 180.9 KB/sec)
2017-05-02\T\23:57:54.705 [INFO] 2017-05-02\T\23:57:54.703 [INFO] Downloaded: https://repo.maven.apache.org/maven2/org/apache/maven/maven-monitor/2.0.9/maven-monitor-2.0.9.jar
(11 KB at 47.6 KB/sec)
2017-05-02\T\23:57:54.710 [INFO] 2017-05-02\T\23:57:54.710 [INFO] Downloaded: https://repo.maven.apache.org/maven2/org/apache/maven/plugin-tools/maven-plugin-annotations/3.1/maven-plugin-annotations-3.1.jar
(14 KB at 62.8 KB/sec)
2017-05-02\T\23:57:54.710 [INFO] 2017-05-02\T\23:57:54.710 [INFO] Downloaded: https://repo.maven.apache.org/maven2/org/apache/maven/maven-toolchain/2.0.9/maven-toolchain-2.0.9.jar
(38 KB at 170.1 KB/sec)
2017-05-02\T\23:57:54.788 [INFO] 2017-05-02\T\23:57:54.788 [INFO] No tests to run.
2017-05-02\T\23:57:54.796 [INFO] 2017-05-02\T\23:57:54.796 [INFO] 
2017-05-02\T\23:57:54.796 [INFO] 2017-05-02\T\23:57:54.796 [INFO] --- maven-jar-plugin:2.4:jar
(default-jar) @ basic ---
2017-05-02\T\23:57:54.905 [INFO] 2017-05-02\T\23:57:54.905 [INFO] Downloading: https://repo.maven.apache.org/maven2/org/codehaus/plexus/plexus-interpolation/1.15/plexus-interpolation-1.15.jar
2017-05-02\T\23:57:54.906 [INFO] 2017-05-02\T\23:57:54.906 [INFO] Downloading: https://repo.maven.apache.org/maven2/org/codehaus/plexus/plexus-archiver/2.1/plexus-archiver-2.1.jar
2017-05-02\T\23:57:54.909 [INFO] 2017-05-02\T\23:57:54.907 [INFO] Downloading: https://repo.maven.apache.org/maven2/org/codehaus/plexus/plexus-io/2.0.2/plexus-io-2.0.2.jar
2017-05-02\T\23:57:54.914 [INFO] 2017-05-02\T\23:57:54.914 [INFO] Downloading: https://repo.maven.apache.org/maven2/org/codehaus/plexus/plexus-utils/3.0/plexus-utils-3.0.jar
2017-05-02\T\23:57:54.952 [INFO] 2017-05-02\T\23:57:54.951 [INFO] Downloaded: https://repo.maven.apache.org/maven2/org/codehaus/plexus/plexus-interpolation/1.15/plexus-interpolation-1.15.jar
(60 KB at 1114.3 KB/sec)
2017-05-02\T\23:57:54.963 [INFO] 2017-05-02\T\23:57:54.963 [INFO] Downloaded: https://repo.maven.apache.org/maven2/org/codehaus/plexus/plexus-io/2.0.2/plexus-io-2.0.2.jar
(57 KB at 1016.1 KB/sec)
2017-05-02\T\23:57:54.973 [INFO] 2017-05-02\T\23:57:54.972 [INFO] Downloaded: https://repo.maven.apache.org/maven2/org/codehaus/plexus/plexus-archiver/2.1/plexus-archiver-2.1.jar
(181 KB at 2688.3 KB/sec)
2017-05-02\T\23:57:54.992 [INFO] 2017-05-02\T\23:57:54.992 [INFO] Downloaded: https://repo.maven.apache.org/maven2/org/codehaus/plexus/plexus-utils/3.0/plexus-utils-3.0.jar
(221 KB at 2567.1 KB/sec)
2017-05-02\T\23:57:55.171 [INFO] 2017-05-02\T\23:57:55.170 [INFO] Building jar: <https://builds.apache.org/job/beam_PostCommit_Java_JDK_Versions_Test/jdk=JDK%201.8%20(latest),label=beam/ws/sdks/java/maven-archetypes/starter/target/test-classes/projects/basic/project/basic/target/basic-0.1.jar>
2017-05-02\T\23:57:55.191 [INFO] 2017-05-02\T\23:57:55.191 [INFO] ------------------------------------------------------------------------
2017-05-02\T\23:57:55.192 [INFO] 2017-05-02\T\23:57:55.192 [INFO] BUILD SUCCESS
2017-05-02\T\23:57:55.192 [INFO] 2017-05-02\T\23:57:55.192 [INFO] ------------------------------------------------------------------------
2017-05-02\T\23:57:55.192 [INFO] 2017-05-02\T\23:57:55.192 [INFO] Total time: 7.162 s
2017-05-02\T\23:57:55.193 [INFO] 2017-05-02\T\23:57:55.193 [INFO] Finished at: 2017-05-02T23:57:55+00:00
2017-05-02\T\23:57:55.538 [INFO] 2017-05-02\T\23:57:55.538 [INFO] Final Memory: 24M/307M
2017-05-02\T\23:57:55.538 [INFO] 2017-05-02\T\23:57:55.538 [INFO] ------------------------------------------------------------------------
2017-05-02\T\23:57:55.557 [INFO] Post-archetype-generation invoker exit code: 0
2017-05-02\T\23:57:55.559 [INFO] 
2017-05-02\T\23:57:55.559 [INFO] --- maven-archetype-plugin:2.4:update-local-catalog (default-update-local-catalog)
@ beam-sdks-java-maven-archetypes-starter ---
2017-05-02\T\23:57:55.569 [INFO]                                                         
               
2017-05-02\T\23:57:55.569 [INFO] ------------------------------------------------------------------------
2017-05-02\T\23:57:55.569 [INFO] Building Apache Beam :: SDKs :: Java :: Maven Archetypes
:: Examples 0.7.0-SNAPSHOT
2017-05-02\T\23:57:55.569 [INFO] ------------------------------------------------------------------------
2017-05-02\T\23:57:55.574 [INFO] Downloading: https://repo.maven.apache.org/maven2/org/codehaus/mojo/exec-maven-plugin/1.5.0/exec-maven-plugin-1.5.0.pom
2017-05-02\T\23:57:55.622 [INFO] Downloaded: https://repo.maven.apache.org/maven2/org/codehaus/mojo/exec-maven-plugin/1.5.0/exec-maven-plugin-1.5.0.pom
(13 KB at 250.7 KB/sec)
2017-05-02\T\23:57:55.637 [INFO] Downloading: https://repo.maven.apache.org/maven2/org/codehaus/mojo/mojo-parent/38/mojo-parent-38.pom
2017-05-02\T\23:57:55.681 [INFO] Downloaded: https://repo.maven.apache.org/maven2/org/codehaus/mojo/mojo-parent/38/mojo-parent-38.pom
(33 KB at 734.1 KB/sec)
2017-05-02\T\23:57:55.686 [INFO] Downloading: https://repo.maven.apache.org/maven2/org/codehaus/mojo/exec-maven-plugin/1.5.0/exec-maven-plugin-1.5.0.jar
2017-05-02\T\23:57:55.720 [INFO] Downloaded: https://repo.maven.apache.org/maven2/org/codehaus/mojo/exec-maven-plugin/1.5.0/exec-maven-plugin-1.5.0.jar
(53 KB at 1531.0 KB/sec)
2017-05-02\T\23:57:55.747 [INFO] 
2017-05-02\T\23:57:55.747 [INFO] --- maven-clean-plugin:3.0.0:clean (default-clean) @ beam-sdks-java-maven-archetypes-examples
---
2017-05-02\T\23:57:55.749 [INFO] Deleting <https://builds.apache.org/job/beam_PostCommit_Java_JDK_Versions_Test/jdk=JDK%201.8%20(latest),label=beam/ws/sdks/java/maven-archetypes/examples>
(includes = [**/*.pyc, **/*.egg-info/], excludes = [])
2017-05-02\T\23:57:55.750 [INFO] 
2017-05-02\T\23:57:55.750 [INFO] --- maven-enforcer-plugin:1.4.1:enforce (enforce) @ beam-sdks-java-maven-archetypes-examples
---
2017-05-02\T\23:57:56.549 [INFO] 
2017-05-02\T\23:57:56.549 [INFO] --- exec-maven-plugin:1.5.0:exec (generate-archetype-contents)
@ beam-sdks-java-maven-archetypes-examples ---
2017-05-02\T\23:57:56.552 [INFO] Downloading: https://repo.maven.apache.org/maven2/org/apache/maven/maven-toolchain/1.0/maven-toolchain-1.0.pom
2017-05-02\T\23:57:56.579 [INFO] Downloaded: https://repo.maven.apache.org/maven2/org/apache/maven/maven-toolchain/1.0/maven-toolchain-1.0.pom
(4 KB at 123.5 KB/sec)
2017-05-02\T\23:57:56.584 [INFO] Downloading: https://repo.maven.apache.org/maven2/org/apache/commons/commons-exec/1.3/commons-exec-1.3.pom
2017-05-02\T\23:57:56.612 [INFO] Downloaded: https://repo.maven.apache.org/maven2/org/apache/commons/commons-exec/1.3/commons-exec-1.3.pom
(11 KB at 383.4 KB/sec)
2017-05-02\T\23:57:57.589 [INFO] Downloading: https://repo.maven.apache.org/maven2/org/apache/maven/maven-toolchain/1.0/maven-toolchain-1.0.jar
2017-05-02\T\23:57:57.589 [INFO] Downloading: https://repo.maven.apache.org/maven2/org/apache/commons/commons-exec/1.3/commons-exec-1.3.jar
2017-05-02\T\23:57:57.624 [INFO] Downloaded: https://repo.maven.apache.org/maven2/org/apache/commons/commons-exec/1.3/commons-exec-1.3.jar
(54 KB at 52.9 KB/sec)
2017-05-02\T\23:57:57.624 [INFO] Downloaded: https://repo.maven.apache.org/maven2/org/apache/maven/maven-toolchain/1.0/maven-toolchain-1.0.jar
(33 KB at 32.0 KB/sec)
rsync: change_dir "/home/jenkins/jenkins-slave/workspace/beam_PostCommit_Java_JDK_Versions_Test/jdk\#012.\#012(latest)/label/beam/sdks/java/maven-archetypes/examples/../../../../examples/java/src/main/java/org/apache/beam/examples"
failed: No such file or directory (2)
rsync error: some files/attrs were not transferred (see previous errors) (code 23) at main.c(1183)
[sender=3.1.0]
2017-05-02\T\23:57:57.891 [ERROR] Command execution failed.
org.apache.commons.exec.ExecuteException: Process exited with an error: 23 (Exit value: 23)
	at org.apache.commons.exec.DefaultExecutor.executeInternal(DefaultExecutor.java:404)
	at org.apache.commons.exec.DefaultExecutor.execute(DefaultExecutor.java:166)
	at org.codehaus.mojo.exec.ExecMojo.executeCommandLine(ExecMojo.java:764)
	at org.codehaus.mojo.exec.ExecMojo.executeCommandLine(ExecMojo.java:711)
	at org.codehaus.mojo.exec.ExecMojo.execute(ExecMojo.java:289)
	at org.apache.maven.plugin.DefaultBuildPluginManager.executeMojo(DefaultBuildPluginManager.java:134)
	at org.apache.maven.lifecycle.internal.MojoExecutor.execute(MojoExecutor.java:208)
	at org.apache.maven.lifecycle.internal.MojoExecutor.execute(MojoExecutor.java:153)
	at org.apache.maven.lifecycle.internal.MojoExecutor.execute(MojoExecutor.java:145)
	at org.apache.maven.lifecycle.internal.LifecycleModuleBuilder.buildProject(LifecycleModuleBuilder.java:116)
	at org.apache.maven.lifecycle.internal.LifecycleModuleBuilder.buildProject(LifecycleModuleBuilder.java:80)
	at org.apache.maven.lifecycle.internal.builder.singlethreaded.SingleThreadedBuilder.build(SingleThreadedBuilder.java:51)
	at org.apache.maven.lifecycle.internal.LifecycleStarter.execute(LifecycleStarter.java:128)
	at org.apache.maven.DefaultMaven.doExecute(DefaultMaven.java:307)
	at org.apache.maven.DefaultMaven.doExecute(DefaultMaven.java:193)
	at org.apache.maven.DefaultMaven.execute(DefaultMaven.java:106)
	at org.apache.maven.cli.MavenCli.execute(MavenCli.java:862)
	at org.apache.maven.cli.MavenCli.doMain(MavenCli.java:286)
	at org.apache.maven.cli.MavenCli.main(MavenCli.java:197)
	at sun.reflect.NativeMethodAccessorImpl.invoke0(Native Method)
	at sun.reflect.NativeMethodAccessorImpl.invoke(NativeMethodAccessorImpl.java:62)
	at sun.reflect.DelegatingMethodAccessorImpl.invoke(DelegatingMethodAccessorImpl.java:43)
	at java.lang.reflect.Method.invoke(Method.java:498)
	at org.codehaus.plexus.classworlds.launcher.Launcher.launchEnhanced(Launcher.java:289)
	at org.codehaus.plexus.classworlds.launcher.Launcher.launch(Launcher.java:229)
	at org.codehaus.plexus.classworlds.launcher.Launcher.mainWithExitCode(Launcher.java:415)
	at org.codehaus.plexus.classworlds.launcher.Launcher.main(Launcher.java:356)
2017-05-02\T\23:57:57.893 [INFO] ------------------------------------------------------------------------
2017-05-02\T\23:57:57.893 [INFO] Reactor Summary:
2017-05-02\T\23:57:57.893 [INFO] 
2017-05-02\T\23:57:57.893 [INFO] Apache Beam :: Parent .............................. SUCCESS
[ 26.206 s]
2017-05-02\T\23:57:57.893 [INFO] Apache Beam :: SDKs :: Java :: Build Tools ......... SUCCESS
[ 11.251 s]
2017-05-02\T\23:57:57.893 [INFO] Apache Beam :: SDKs ................................ SUCCESS
[  3.208 s]
2017-05-02\T\23:57:57.893 [INFO] Apache Beam :: SDKs :: Common ...................... SUCCESS
[  2.389 s]
2017-05-02\T\23:57:57.893 [INFO] Apache Beam :: SDKs :: Common :: Fn API ............ SUCCESS
[ 12.855 s]
2017-05-02\T\23:57:57.893 [INFO] Apache Beam :: SDKs :: Common :: Runner API ........ SUCCESS
[  7.914 s]
2017-05-02\T\23:57:57.893 [INFO] Apache Beam :: SDKs :: Java ........................ SUCCESS
[  0.703 s]
2017-05-02\T\23:57:57.893 [INFO] Apache Beam :: SDKs :: Java :: Core ................ SUCCESS
[01:47 min]
2017-05-02\T\23:57:57.893 [INFO] Apache Beam :: SDKs :: Java :: IO .................. SUCCESS
[  0.372 s]
2017-05-02\T\23:57:57.893 [INFO] Apache Beam :: SDKs :: Java :: IO :: Common ........ SUCCESS
[  2.476 s]
2017-05-02\T\23:57:57.893 [INFO] Apache Beam :: Runners ............................. SUCCESS
[  0.864 s]
2017-05-02\T\23:57:57.893 [INFO] Apache Beam :: Runners :: Core Construction Java ... SUCCESS
[ 11.629 s]
2017-05-02\T\23:57:57.893 [INFO] Apache Beam :: Runners :: Core Java ................ SUCCESS
[ 31.195 s]
2017-05-02\T\23:57:57.893 [INFO] Apache Beam :: Runners :: Direct Java .............. SUCCESS
[03:06 min]
2017-05-02\T\23:57:57.893 [INFO] Apache Beam :: SDKs :: Java :: IO :: Elasticsearch . SUCCESS
[ 34.762 s]
2017-05-02\T\23:57:57.893 [INFO] Apache Beam :: SDKs :: Java :: Extensions .......... SUCCESS
[  0.488 s]
2017-05-02\T\23:57:57.894 [INFO] Apache Beam :: SDKs :: Java :: Extensions :: Google Cloud
Platform Core SUCCESS [ 19.850 s]
2017-05-02\T\23:57:57.894 [INFO] Apache Beam :: SDKs :: Java :: Extensions :: Protobuf SUCCESS
[ 16.007 s]
2017-05-02\T\23:57:57.894 [INFO] Apache Beam :: SDKs :: Java :: IO :: Google Cloud Platform
SUCCESS [01:23 min]
2017-05-02\T\23:57:57.894 [INFO] Apache Beam :: SDKs :: Java :: IO :: Hadoop Common . SUCCESS
[ 14.474 s]
2017-05-02\T\23:57:57.894 [INFO] Apache Beam :: SDKs :: Java :: IO :: Hadoop File System SUCCESS
[ 34.180 s]
2017-05-02\T\23:57:57.894 [INFO] Apache Beam :: SDKs :: Java :: IO :: Hadoop ........ SUCCESS
[  3.784 s]
2017-05-02\T\23:57:57.894 [INFO] Apache Beam :: SDKs :: Java :: IO :: Hadoop :: input-format
SUCCESS [ 12.969 s]
2017-05-02\T\23:57:57.894 [INFO] Apache Beam :: Runners :: Google Cloud Dataflow .... SUCCESS
[ 36.934 s]
2017-05-02\T\23:57:57.894 [INFO] Apache Beam :: SDKs :: Java :: IO :: Hadoop :: jdk1.8-tests
SUCCESS [01:48 min]
2017-05-02\T\23:57:57.894 [INFO] Apache Beam :: SDKs :: Java :: IO :: HBase ......... SUCCESS
[01:14 min]
2017-05-02\T\23:57:57.894 [INFO] Apache Beam :: SDKs :: Java :: IO :: JDBC .......... SUCCESS
[ 18.103 s]
2017-05-02\T\23:57:57.894 [INFO] Apache Beam :: SDKs :: Java :: IO :: JMS ........... SUCCESS
[ 13.169 s]
2017-05-02\T\23:57:57.894 [INFO] Apache Beam :: SDKs :: Java :: IO :: Kafka ......... SUCCESS
[ 25.119 s]
2017-05-02\T\23:57:57.894 [INFO] Apache Beam :: SDKs :: Java :: IO :: Kinesis ....... SUCCESS
[ 15.518 s]
2017-05-02\T\23:57:57.894 [INFO] Apache Beam :: SDKs :: Java :: IO :: MongoDB ....... SUCCESS
[ 29.691 s]
2017-05-02\T\23:57:57.894 [INFO] Apache Beam :: SDKs :: Java :: IO :: MQTT .......... SUCCESS
[ 12.988 s]
2017-05-02\T\23:57:57.894 [INFO] Apache Beam :: SDKs :: Java :: IO :: XML ........... SUCCESS
[ 17.830 s]
2017-05-02\T\23:57:57.894 [INFO] Apache Beam :: SDKs :: Java :: Maven Archetypes .... SUCCESS
[  0.807 s]
2017-05-02\T\23:57:57.894 [INFO] Apache Beam :: SDKs :: Java :: Maven Archetypes :: Starter
SUCCESS [ 17.234 s]
2017-05-02\T\23:57:57.894 [INFO] Apache Beam :: SDKs :: Java :: Maven Archetypes :: Examples
FAILURE [  2.324 s]
2017-05-02\T\23:57:57.894 [INFO] Apache Beam :: SDKs :: Java :: Maven Archetypes :: Examples
- Java 8 SKIPPED
2017-05-02\T\23:57:57.894 [INFO] Apache Beam :: SDKs :: Java :: Extensions :: Jackson SKIPPED
2017-05-02\T\23:57:57.894 [INFO] Apache Beam :: SDKs :: Java :: Extensions :: Join library
SKIPPED
2017-05-02\T\23:57:57.894 [INFO] Apache Beam :: SDKs :: Java :: Extensions :: Sorter  SKIPPED
2017-05-02\T\23:57:57.894 [INFO] Apache Beam :: SDKs :: Java :: Harness ............. SKIPPED
2017-05-02\T\23:57:57.894 [INFO] Apache Beam :: SDKs :: Java :: Java 8 Tests ........ SKIPPED
2017-05-02\T\23:57:57.895 [INFO] Apache Beam :: Runners :: Flink .................... SKIPPED
2017-05-02\T\23:57:57.895 [INFO] Apache Beam :: Runners :: Spark .................... SKIPPED
2017-05-02\T\23:57:57.895 [INFO] Apache Beam :: Runners :: Apex ..................... SKIPPED
2017-05-02\T\23:57:57.895 [INFO] Apache Beam :: Examples ............................ SKIPPED
2017-05-02\T\23:57:57.895 [INFO] Apache Beam :: Examples :: Java .................... SKIPPED
2017-05-02\T\23:57:57.895 [INFO] Apache Beam :: Examples :: Java 8 .................. SKIPPED
2017-05-02\T\23:57:57.895 [INFO] Apache Beam :: SDKs :: Java :: Aggregated Javadoc .. SKIPPED
2017-05-02\T\23:57:57.895 [INFO] ------------------------------------------------------------------------
2017-05-02\T\23:57:57.895 [INFO] BUILD FAILURE
2017-05-02\T\23:57:57.895 [INFO] ------------------------------------------------------------------------
2017-05-02\T\23:57:57.895 [INFO] Total time: 16:42 min
2017-05-02\T\23:57:57.896 [INFO] Finished at: 2017-05-02T23:57:57+00:00
2017-05-02\T\23:57:59.115 [INFO] Final Memory: 233M/1483M
2017-05-02\T\23:57:59.115 [INFO] ------------------------------------------------------------------------
2017-05-02\T\23:57:59.116 [ERROR] Failed to execute goal org.codehaus.mojo:exec-maven-plugin:1.5.0:exec
(generate-archetype-contents) on project beam-sdks-java-maven-archetypes-examples: Command
execution failed. Process exited with an error: 23 (Exit value: 23) -> [Help 1]
org.apache.maven.lifecycle.LifecycleExecutionException: Failed to execute goal org.codehaus.mojo:exec-maven-plugin:1.5.0:exec
(generate-archetype-contents) on project beam-sdks-java-maven-archetypes-examples: Command
execution failed.
	at org.apache.maven.lifecycle.internal.MojoExecutor.execute(MojoExecutor.java:216)
	at org.apache.maven.lifecycle.internal.MojoExecutor.execute(MojoExecutor.java:153)
	at org.apache.maven.lifecycle.internal.MojoExecutor.execute(MojoExecutor.java:145)
	at org.apache.maven.lifecycle.internal.LifecycleModuleBuilder.buildProject(LifecycleModuleBuilder.java:116)
	at org.apache.maven.lifecycle.internal.LifecycleModuleBuilder.buildProject(LifecycleModuleBuilder.java:80)
	at org.apache.maven.lifecycle.internal.builder.singlethreaded.SingleThreadedBuilder.build(SingleThreadedBuilder.java:51)
	at org.apache.maven.lifecycle.internal.LifecycleStarter.execute(LifecycleStarter.java:128)
	at org.apache.maven.DefaultMaven.doExecute(DefaultMaven.java:307)
	at org.apache.maven.DefaultMaven.doExecute(DefaultMaven.java:193)
	at org.apache.maven.DefaultMaven.execute(DefaultMaven.java:106)
	at org.apache.maven.cli.MavenCli.execute(MavenCli.java:862)
	at org.apache.maven.cli.MavenCli.doMain(MavenCli.java:286)
	at org.apache.maven.cli.MavenCli.main(MavenCli.java:197)
	at sun.reflect.NativeMethodAccessorImpl.invoke0(Native Method)
	at sun.reflect.NativeMethodAccessorImpl.invoke(NativeMethodAccessorImpl.java:62)
	at sun.reflect.DelegatingMethodAccessorImpl.invoke(DelegatingMethodAccessorImpl.java:43)
	at java.lang.reflect.Method.invoke(Method.java:498)
	at org.codehaus.plexus.classworlds.launcher.Launcher.launchEnhanced(Launcher.java:289)
	at org.codehaus.plexus.classworlds.launcher.Launcher.launch(Launcher.java:229)
	at org.codehaus.plexus.classworlds.launcher.Launcher.mainWithExitCode(Launcher.java:415)
	at org.codehaus.plexus.classworlds.launcher.Launcher.main(Launcher.java:356)
Caused by: org.apache.maven.plugin.MojoExecutionException: Command execution failed.
	at org.codehaus.mojo.exec.ExecMojo.execute(ExecMojo.java:302)
	at org.apache.maven.plugin.DefaultBuildPluginManager.executeMojo(DefaultBuildPluginManager.java:134)
	at org.apache.maven.lifecycle.internal.MojoExecutor.execute(MojoExecutor.java:208)
	... 20 more
Caused by: org.apache.commons.exec.ExecuteException: Process exited with an error: 23 (Exit
value: 23)
	at org.apache.commons.exec.DefaultExecutor.executeInternal(DefaultExecutor.java:404)
	at org.apache.commons.exec.DefaultExecutor.execute(DefaultExecutor.java:166)
	at org.codehaus.mojo.exec.ExecMojo.executeCommandLine(ExecMojo.java:764)
	at org.codehaus.mojo.exec.ExecMojo.executeCommandLine(ExecMojo.java:711)
	at org.codehaus.mojo.exec.ExecMojo.execute(ExecMojo.java:289)
	... 22 more
2017-05-02\T\23:57:59.117 [ERROR] 
2017-05-02\T\23:57:59.117 [ERROR] Re-run Maven using the -X switch to enable full debug logging.
2017-05-02\T\23:57:59.117 [ERROR] 
2017-05-02\T\23:57:59.117 [ERROR] For more information about the errors and possible solutions,
please read the following articles:
2017-05-02\T\23:57:59.117 [ERROR] [Help 1] http://cwiki.apache.org/confluence/display/MAVEN/MojoExecutionException
2017-05-02\T\23:57:59.117 [ERROR] 
2017-05-02\T\23:57:59.117 [ERROR] After correcting the problems, you can resume the build
with the command
2017-05-02\T\23:57:59.117 [ERROR]   mvn <goals> -rf :beam-sdks-java-maven-archetypes-examples
Build step 'Invoke top-level Maven targets' marked build as failure

Mime
View raw message