beam-commits mailing list archives

Site index · List index
Message view « Date » · « Thread »
Top « Date » · « Thread »
From Apache Jenkins Server <jenk...@builds.apache.org>
Subject Build failed in Jenkins: beam_PostCommit_Java_MavenInstall #3933
Date Fri, 26 May 2017 18:15:20 GMT
See <https://builds.apache.org/job/beam_PostCommit_Java_MavenInstall/3933/display/redirect>

------------------------------------------
[...truncated 503.10 KB...]
2017-05-26T18:06:37.718 [INFO] --- maven-dependency-plugin:3.0.1:analyze-only (default) @
beam-runners-parent ---
2017-05-26T18:06:37.718 [INFO] Skipping pom project
2017-05-26T18:06:37.809 [INFO] 
2017-05-26T18:06:37.809 [INFO] --- apache-rat-plugin:0.12:check (default) @ beam-runners-parent
---
2017-05-26T18:06:37.814 [INFO] Enabled default license matchers.
2017-05-26T18:06:37.814 [INFO] Will parse SCM ignores for exclusions...
2017-05-26T18:06:37.814 [INFO] Finished adding exclusions from SCM ignore files.
2017-05-26T18:06:37.814 [INFO] 61 implicit excludes (use -debug for more details).
2017-05-26T18:06:37.814 [INFO] Exclude: **/target/**/*
2017-05-26T18:06:37.814 [INFO] Exclude: **/dependency-reduced-pom.xml
2017-05-26T18:06:37.814 [INFO] Exclude: **/hs_err_pid*.log
2017-05-26T18:06:37.814 [INFO] Exclude: .github/**/*
2017-05-26T18:06:37.814 [INFO] Exclude: **/*.iml
2017-05-26T18:06:37.814 [INFO] Exclude: **/.idea/**/*
2017-05-26T18:06:37.814 [INFO] Exclude: **/*.egg-info/**/*
2017-05-26T18:06:37.814 [INFO] Exclude: **/package-list
2017-05-26T18:06:37.814 [INFO] Exclude: **/user.avsc
2017-05-26T18:06:37.814 [INFO] Exclude: **/test/resources/**/*.txt
2017-05-26T18:06:37.814 [INFO] Exclude: **/test/**/.placeholder
2017-05-26T18:06:37.814 [INFO] Exclude: .repository/**/*
2017-05-26T18:06:37.814 [INFO] Exclude: **/nose-*.egg/**/*
2017-05-26T18:06:37.814 [INFO] Exclude: **/.eggs/**/*
2017-05-26T18:06:37.814 [INFO] Exclude: **/.tox/**/*
2017-05-26T18:06:37.814 [INFO] Exclude: **/.checkstyle
2017-05-26T18:06:37.814 [INFO] Exclude: **/.classpath
2017-05-26T18:06:37.814 [INFO] Exclude: **/.factorypath
2017-05-26T18:06:37.814 [INFO] Exclude: **/.project
2017-05-26T18:06:37.814 [INFO] Exclude: **/.settings/**/*
2017-05-26T18:06:37.814 [INFO] Exclude: **/apache_beam/runners/api/*_pb2*.py
2017-05-26T18:06:37.829 [INFO] 646 resources included (use -debug for more details)
2017-05-26T18:06:38.082 [INFO] Rat check: Summary over all files. Unapproved: 0, unknown:
0, generated: 0, approved: 646 licenses.
2017-05-26T18:06:38.150 [INFO] 
2017-05-26T18:06:38.150 [INFO] --- maven-install-plugin:2.5.2:install (default-install) @
beam-runners-parent ---
2017-05-26T18:06:38.151 [INFO] Installing <https://builds.apache.org/job/beam_PostCommit_Java_MavenInstall/ws/runners/pom.xml>
to <https://builds.apache.org/job/beam_PostCommit_Java_MavenInstall/ws/.repository/org/apache/beam/beam-runners-parent/2.1.0-SNAPSHOT/beam-runners-parent-2.1.0-SNAPSHOT.pom>
[JENKINS] Archiving disabled
2017-05-26T18:06:44.117 [INFO]                                                           
             
2017-05-26T18:06:44.117 [INFO] ------------------------------------------------------------------------
2017-05-26T18:06:44.117 [INFO] Building Apache Beam :: Runners :: Core Construction Java 2.1.0-SNAPSHOT
2017-05-26T18:06:44.117 [INFO] ------------------------------------------------------------------------
2017-05-26T18:06:44.125 [INFO] 
2017-05-26T18:06:44.125 [INFO] --- maven-clean-plugin:3.0.0:clean (default-clean) @ beam-runners-core-construction-java
---
2017-05-26T18:06:44.126 [INFO] Deleting <https://builds.apache.org/job/beam_PostCommit_Java_MavenInstall/ws/runners/core-construction-java>
(includes = [**/*.pyc, **/*.egg-info/, **/sdks/python/LICENSE, **/sdks/python/NOTICE, **/sdks/python/README.md],
excludes = [])
2017-05-26T18:06:44.208 [INFO] 
2017-05-26T18:06:44.208 [INFO] --- maven-enforcer-plugin:1.4.1:enforce (enforce) @ beam-runners-core-construction-java
---
2017-05-26T18:06:44.583 [INFO] 
2017-05-26T18:06:44.583 [INFO] --- maven-enforcer-plugin:1.4.1:enforce (enforce-banned-dependencies)
@ beam-runners-core-construction-java ---
2017-05-26T18:06:44.663 [INFO] 
2017-05-26T18:06:44.663 [INFO] --- maven-remote-resources-plugin:1.5:process (process-resource-bundles)
@ beam-runners-core-construction-java ---
2017-05-26T18:06:44.891 [INFO] 
2017-05-26T18:06:44.891 [INFO] --- maven-resources-plugin:3.0.2:resources (default-resources)
@ beam-runners-core-construction-java ---
2017-05-26T18:06:44.892 [INFO] Using 'UTF-8' encoding to copy filtered resources.
2017-05-26T18:06:44.892 [INFO] skip non existing resourceDirectory <https://builds.apache.org/job/beam_PostCommit_Java_MavenInstall/ws/runners/core-construction-java/src/main/resources>
2017-05-26T18:06:44.892 [INFO] Copying 3 resources
2017-05-26T18:06:44.942 [INFO] 
2017-05-26T18:06:44.942 [INFO] --- maven-compiler-plugin:3.6.1:compile (default-compile) @
beam-runners-core-construction-java ---
2017-05-26T18:06:44.949 [INFO] Changes detected - recompiling the module!
2017-05-26T18:06:44.950 [INFO] Compiling 32 source files to <https://builds.apache.org/job/beam_PostCommit_Java_MavenInstall/ws/runners/core-construction-java/target/classes>
2017-05-26T18:06:45.543 [INFO] <https://builds.apache.org/job/beam_PostCommit_Java_MavenInstall/ws/runners/core-construction-java/src/main/java/org/apache/beam/runners/core/construction/TriggerTranslation.java>:
Some input files use or override a deprecated API.
2017-05-26T18:06:45.543 [INFO] <https://builds.apache.org/job/beam_PostCommit_Java_MavenInstall/ws/runners/core-construction-java/src/main/java/org/apache/beam/runners/core/construction/TriggerTranslation.java>:
Recompile with -Xlint:deprecation for details.
2017-05-26T18:06:45.543 [INFO] <https://builds.apache.org/job/beam_PostCommit_Java_MavenInstall/ws/runners/core-construction-java/src/main/java/org/apache/beam/runners/core/construction/CombineTranslation.java>:
Some input files use unchecked or unsafe operations.
2017-05-26T18:06:45.543 [INFO] <https://builds.apache.org/job/beam_PostCommit_Java_MavenInstall/ws/runners/core-construction-java/src/main/java/org/apache/beam/runners/core/construction/CombineTranslation.java>:
Recompile with -Xlint:unchecked for details.
2017-05-26T18:06:45.543 [INFO] -------------------------------------------------------------
2017-05-26T18:06:45.543 [WARNING] COMPILATION WARNING : 
2017-05-26T18:06:45.543 [INFO] -------------------------------------------------------------
2017-05-26T18:06:45.543 [WARNING] bootstrap class path not set in conjunction with -source
1.7
2017-05-26T18:06:45.543 [INFO] 1 warning
2017-05-26T18:06:45.543 [INFO] -------------------------------------------------------------
2017-05-26T18:06:45.543 [INFO] -------------------------------------------------------------
2017-05-26T18:06:45.543 [ERROR] COMPILATION ERROR : 
2017-05-26T18:06:45.543 [INFO] -------------------------------------------------------------
2017-05-26T18:06:45.543 [ERROR] <https://builds.apache.org/job/beam_PostCommit_Java_MavenInstall/ws/runners/core-construction-java/src/main/java/org/apache/beam/runners/core/construction/CombineTranslation.java>:[108,12]
cannot find symbol
  symbol:   variable Coders
  location: class org.apache.beam.runners.core.construction.CombineTranslation
2017-05-26T18:06:45.543 [INFO] 1 error
2017-05-26T18:06:45.543 [INFO] -------------------------------------------------------------
[JENKINS] Archiving disabled
2017-05-26T18:06:48.477 [INFO]                                                           
             
2017-05-26T18:06:48.477 [INFO] ------------------------------------------------------------------------
2017-05-26T18:06:48.477 [INFO] Skipping Apache Beam :: Parent
2017-05-26T18:06:48.477 [INFO] This project has been banned from the build due to previous
failures.
2017-05-26T18:06:48.477 [INFO] ------------------------------------------------------------------------
[JENKINS] Archiving disabled
[JENKINS] Archiving disabled
[JENKINS] Archiving disabled
[JENKINS] Archiving disabled
[JENKINS] Archiving disabled
[JENKINS] Archiving disabled
[JENKINS] Archiving disabled
[JENKINS] Archiving disabled
[JENKINS] Archiving disabled
[JENKINS] Archiving disabled
[JENKINS] Archiving disabled
[JENKINS] Archiving disabled
[JENKINS] Archiving disabled
[JENKINS] Archiving disabled
[JENKINS] Archiving disabled
[JENKINS] Archiving disabled
[JENKINS] Archiving disabled
[JENKINS] Archiving disabled
[JENKINS] Archiving disabled
[JENKINS] Archiving disabled
[JENKINS] Archiving disabled
[JENKINS] Archiving disabled
[JENKINS] Archiving disabled
[JENKINS] Archiving disabled
[JENKINS] Archiving disabled
[JENKINS] Archiving disabled
[JENKINS] Archiving disabled
[JENKINS] Archiving disabled
[JENKINS] Archiving disabled
[JENKINS] Archiving disabled
[JENKINS] Archiving disabled
[JENKINS] Archiving disabled
[JENKINS] Archiving disabled
[JENKINS] Archiving disabled
[JENKINS] Archiving disabled
[JENKINS] Archiving disabled
[JENKINS] Archiving disabled
[JENKINS] Archiving disabled
[JENKINS] Archiving disabled
[JENKINS] Archiving disabled
[JENKINS] Archiving disabled
[JENKINS] Archiving disabled
[JENKINS] Archiving disabled
[JENKINS] Archiving disabled
[JENKINS] Archiving disabled
[JENKINS] Archiving disabled
2017-05-26T18:07:11.602 [INFO] ------------------------------------------------------------------------
2017-05-26T18:07:11.602 [INFO] Reactor Summary:
2017-05-26T18:07:11.602 [INFO] 
2017-05-26T18:07:11.603 [INFO] Apache Beam :: Parent .............................. SUCCESS
[ 34.721 s]
2017-05-26T18:07:11.603 [INFO] Apache Beam :: SDKs :: Java :: Build Tools ......... SUCCESS
[ 12.396 s]
2017-05-26T18:07:11.603 [INFO] Apache Beam :: SDKs ................................ SUCCESS
[  6.011 s]
2017-05-26T18:07:11.603 [INFO] Apache Beam :: SDKs :: Common ...................... SUCCESS
[  3.036 s]
2017-05-26T18:07:11.603 [INFO] Apache Beam :: SDKs :: Common :: Fn API ............ SUCCESS
[ 18.095 s]
2017-05-26T18:07:11.603 [INFO] Apache Beam :: SDKs :: Common :: Runner API ........ SUCCESS
[ 14.021 s]
2017-05-26T18:07:11.603 [INFO] Apache Beam :: SDKs :: Java ........................ SUCCESS
[  3.096 s]
2017-05-26T18:07:11.603 [INFO] Apache Beam :: SDKs :: Java :: Core ................ SUCCESS
[02:34 min]
2017-05-26T18:07:11.603 [INFO] Apache Beam :: SDKs :: Java :: IO .................. SUCCESS
[  2.785 s]
2017-05-26T18:07:11.603 [INFO] Apache Beam :: SDKs :: Java :: IO :: Common ........ SUCCESS
[ 12.631 s]
2017-05-26T18:07:11.603 [INFO] Apache Beam :: Runners ............................. SUCCESS
[  7.654 s]
2017-05-26T18:07:11.603 [INFO] Apache Beam :: Runners :: Core Construction Java ... FAILURE
[  3.654 s]
2017-05-26T18:07:11.603 [INFO] Apache Beam :: Runners :: Core Java ................ SKIPPED
2017-05-26T18:07:11.603 [INFO] Apache Beam :: Runners :: Direct Java .............. SKIPPED
2017-05-26T18:07:11.603 [INFO] Apache Beam :: SDKs :: Java :: IO :: Elasticsearch . SKIPPED
2017-05-26T18:07:11.603 [INFO] Apache Beam :: SDKs :: Java :: Extensions .......... SKIPPED
2017-05-26T18:07:11.603 [INFO] Apache Beam :: SDKs :: Java :: Extensions :: Google Cloud Platform
Core SKIPPED
2017-05-26T18:07:11.603 [INFO] Apache Beam :: SDKs :: Java :: Extensions :: Protobuf SKIPPED
2017-05-26T18:07:11.603 [INFO] Apache Beam :: SDKs :: Java :: IO :: Google Cloud Platform
SKIPPED
2017-05-26T18:07:11.603 [INFO] Apache Beam :: SDKs :: Java :: IO :: Hadoop Common . SKIPPED
2017-05-26T18:07:11.603 [INFO] Apache Beam :: SDKs :: Java :: IO :: Hadoop File System SKIPPED
2017-05-26T18:07:11.603 [INFO] Apache Beam :: SDKs :: Java :: IO :: Hadoop ........ SKIPPED
2017-05-26T18:07:11.603 [INFO] Apache Beam :: SDKs :: Java :: IO :: Hadoop :: input-format
SKIPPED
2017-05-26T18:07:11.603 [INFO] Apache Beam :: Runners :: Google Cloud Dataflow .... SKIPPED
2017-05-26T18:07:11.603 [INFO] Apache Beam :: SDKs :: Java :: IO :: Hadoop :: jdk1.8-tests
SKIPPED
2017-05-26T18:07:11.603 [INFO] Apache Beam :: SDKs :: Java :: IO :: HBase ......... SKIPPED
2017-05-26T18:07:11.603 [INFO] Apache Beam :: SDKs :: Java :: IO :: JDBC .......... SKIPPED
2017-05-26T18:07:11.603 [INFO] Apache Beam :: SDKs :: Java :: IO :: JMS ........... SKIPPED
2017-05-26T18:07:11.603 [INFO] Apache Beam :: SDKs :: Java :: IO :: Kafka ......... SKIPPED
2017-05-26T18:07:11.603 [INFO] Apache Beam :: SDKs :: Java :: IO :: Kinesis ....... SKIPPED
2017-05-26T18:07:11.603 [INFO] Apache Beam :: SDKs :: Java :: IO :: MongoDB ....... SKIPPED
2017-05-26T18:07:11.603 [INFO] Apache Beam :: SDKs :: Java :: IO :: MQTT .......... SKIPPED
2017-05-26T18:07:11.603 [INFO] Apache Beam :: SDKs :: Java :: IO :: XML ........... SKIPPED
2017-05-26T18:07:11.603 [INFO] Apache Beam :: SDKs :: Java :: Maven Archetypes .... SKIPPED
2017-05-26T18:07:11.603 [INFO] Apache Beam :: SDKs :: Java :: Maven Archetypes :: Starter
SKIPPED
2017-05-26T18:07:11.603 [INFO] Apache Beam :: Examples ............................ SKIPPED
2017-05-26T18:07:11.603 [INFO] Apache Beam :: Examples :: Java .................... SKIPPED
2017-05-26T18:07:11.603 [INFO] Apache Beam :: SDKs :: Java :: Maven Archetypes :: Examples
SKIPPED
2017-05-26T18:07:11.603 [INFO] Apache Beam :: Examples :: Java 8 .................. SKIPPED
2017-05-26T18:07:11.603 [INFO] Apache Beam :: SDKs :: Java :: Maven Archetypes :: Examples
- Java 8 SKIPPED
2017-05-26T18:07:11.603 [INFO] Apache Beam :: SDKs :: Java :: Extensions :: Jackson SKIPPED
2017-05-26T18:07:11.603 [INFO] Apache Beam :: SDKs :: Java :: Extensions :: Join library SKIPPED
2017-05-26T18:07:11.603 [INFO] Apache Beam :: SDKs :: Java :: Extensions :: Sorter  SKIPPED
2017-05-26T18:07:11.603 [INFO] Apache Beam :: SDKs :: Java :: Harness ............. SKIPPED
2017-05-26T18:07:11.603 [INFO] Apache Beam :: SDKs :: Java :: Java 8 Tests ........ SKIPPED
2017-05-26T18:07:11.603 [INFO] Apache Beam :: SDKs :: Python ...................... SKIPPED
2017-05-26T18:07:11.603 [INFO] Apache Beam :: Runners :: Flink .................... SKIPPED
2017-05-26T18:07:11.603 [INFO] Apache Beam :: Runners :: Spark .................... SKIPPED
2017-05-26T18:07:11.603 [INFO] Apache Beam :: Runners :: Apex ..................... SKIPPED
2017-05-26T18:07:11.603 [INFO] Apache Beam :: SDKs :: Java :: Aggregated Javadoc .. SKIPPED
2017-05-26T18:07:11.603 [INFO] ------------------------------------------------------------------------
2017-05-26T18:07:11.603 [INFO] BUILD FAILURE
2017-05-26T18:07:11.603 [INFO] ------------------------------------------------------------------------
2017-05-26T18:07:11.603 [INFO] Total time: 06:06 min
2017-05-26T18:07:11.604 [INFO] Finished at: 2017-05-26T18:07:11+00:00
2017-05-26T18:07:12.180 [INFO] Final Memory: 190M/1614M
2017-05-26T18:07:12.181 [INFO] ------------------------------------------------------------------------
Waiting for Jenkins to finish collecting data
2017-05-26T18:07:44.239 [ERROR] Failed to execute goal org.apache.maven.plugins:maven-compiler-plugin:3.6.1:compile
(default-compile) on project beam-runners-core-construction-java: Compilation failure
2017-05-26T18:07:44.239 [ERROR] <https://builds.apache.org/job/beam_PostCommit_Java_MavenInstall/ws/runners/core-construction-java/src/main/java/org/apache/beam/runners/core/construction/CombineTranslation.java>:[108,12]
cannot find symbol
2017-05-26T18:07:44.239 [ERROR] symbol:   variable Coders
2017-05-26T18:07:44.239 [ERROR] location: class org.apache.beam.runners.core.construction.CombineTranslation
2017-05-26T18:07:44.239 [ERROR] -> [Help 1]
org.apache.maven.lifecycle.LifecycleExecutionException: Failed to execute goal org.apache.maven.plugins:maven-compiler-plugin:3.6.1:compile
(default-compile) on project beam-runners-core-construction-java: Compilation failure
<https://builds.apache.org/job/beam_PostCommit_Java_MavenInstall/ws/runners/core-construction-java/src/main/java/org/apache/beam/runners/core/construction/CombineTranslation.java>:[108,12]
cannot find symbol
  symbol:   variable Coders
  location: class org.apache.beam.runners.core.construction.CombineTranslation

	at org.apache.maven.lifecycle.internal.MojoExecutor.execute(MojoExecutor.java:212)
	at org.apache.maven.lifecycle.internal.MojoExecutor.execute(MojoExecutor.java:153)
	at org.apache.maven.lifecycle.internal.MojoExecutor.execute(MojoExecutor.java:145)
	at org.apache.maven.lifecycle.internal.LifecycleModuleBuilder.buildProject(LifecycleModuleBuilder.java:116)
	at org.apache.maven.lifecycle.internal.LifecycleModuleBuilder.buildProject(LifecycleModuleBuilder.java:80)
	at org.apache.maven.lifecycle.internal.builder.singlethreaded.SingleThreadedBuilder.build(SingleThreadedBuilder.java:51)
	at org.apache.maven.lifecycle.internal.LifecycleStarter.execute(LifecycleStarter.java:128)
	at org.apache.maven.DefaultMaven.doExecute(DefaultMaven.java:307)
	at org.apache.maven.DefaultMaven.doExecute(DefaultMaven.java:193)
	at org.apache.maven.DefaultMaven.execute(DefaultMaven.java:106)
	at org.jvnet.hudson.maven3.launcher.Maven33Launcher.main(Maven33Launcher.java:129)
	at sun.reflect.NativeMethodAccessorImpl.invoke0(Native Method)
	at sun.reflect.NativeMethodAccessorImpl.invoke(NativeMethodAccessorImpl.java:62)
	at sun.reflect.DelegatingMethodAccessorImpl.invoke(DelegatingMethodAccessorImpl.java:43)
	at java.lang.reflect.Method.invoke(Method.java:498)
	at org.codehaus.plexus.classworlds.launcher.Launcher.launchStandard(Launcher.java:330)
	at org.codehaus.plexus.classworlds.launcher.Launcher.launch(Launcher.java:238)
	at jenkins.maven3.agent.Maven33Main.launch(Maven33Main.java:176)
	at sun.reflect.NativeMethodAccessorImpl.invoke0(Native Method)
	at sun.reflect.NativeMethodAccessorImpl.invoke(NativeMethodAccessorImpl.java:62)
	at sun.reflect.DelegatingMethodAccessorImpl.invoke(DelegatingMethodAccessorImpl.java:43)
	at java.lang.reflect.Method.invoke(Method.java:498)
	at hudson.maven.Maven3Builder.call(Maven3Builder.java:139)
	at hudson.maven.Maven3Builder.call(Maven3Builder.java:70)
	at hudson.remoting.UserRequest.perform(UserRequest.java:153)
	at hudson.remoting.UserRequest.perform(UserRequest.java:50)
	at hudson.remoting.Request$2.run(Request.java:336)
	at hudson.remoting.InterceptingExecutorService$1.call(InterceptingExecutorService.java:68)
	at java.util.concurrent.FutureTask.run(FutureTask.java:266)
	at java.util.concurrent.ThreadPoolExecutor.runWorker(ThreadPoolExecutor.java:1142)
	at java.util.concurrent.ThreadPoolExecutor$Worker.run(ThreadPoolExecutor.java:617)
	at java.lang.Thread.run(Thread.java:745)
Caused by: org.apache.maven.plugin.compiler.CompilationFailureException: Compilation failure
<https://builds.apache.org/job/beam_PostCommit_Java_MavenInstall/ws/runners/core-construction-java/src/main/java/org/apache/beam/runners/core/construction/CombineTranslation.java>:[108,12]
cannot find symbol
  symbol:   variable Coders
  location: class org.apache.beam.runners.core.construction.CombineTranslation

	at org.apache.maven.plugin.compiler.AbstractCompilerMojo.execute(AbstractCompilerMojo.java:1029)
	at org.apache.maven.plugin.compiler.CompilerMojo.execute(CompilerMojo.java:137)
	at org.apache.maven.plugin.DefaultBuildPluginManager.executeMojo(DefaultBuildPluginManager.java:134)
	at org.apache.maven.lifecycle.internal.MojoExecutor.execute(MojoExecutor.java:208)
	... 31 more
2017-05-26T18:07:44.240 [ERROR] 
2017-05-26T18:07:44.240 [ERROR] Re-run Maven using the -X switch to enable full debug logging.
2017-05-26T18:07:44.240 [ERROR] 
2017-05-26T18:07:44.240 [ERROR] For more information about the errors and possible solutions,
please read the following articles:
2017-05-26T18:07:44.240 [ERROR] [Help 1] http://cwiki.apache.org/confluence/display/MAVEN/MojoFailureException
2017-05-26T18:07:44.240 [ERROR] 
2017-05-26T18:07:44.240 [ERROR] After correcting the problems, you can resume the build with
the command
2017-05-26T18:07:44.240 [ERROR]   mvn <goals> -rf :beam-runners-core-construction-java
channel stopped

Mime
View raw message