beam-commits mailing list archives

Site index · List index
Message view « Date » · « Thread »
Top « Date » · « Thread »
From "ASF GitHub Bot (JIRA)" <j...@apache.org>
Subject [jira] [Commented] (BEAM-2015) Dataflow PostCommit has been failing since build #2814
Date Wed, 19 Apr 2017 19:08:41 GMT

    [ https://issues.apache.org/jira/browse/BEAM-2015?page=com.atlassian.jira.plugin.system.issuetabpanels:comment-tabpanel&focusedCommentId=15975320#comment-15975320
] 

ASF GitHub Bot commented on BEAM-2015:
--------------------------------------

Github user asfgit closed the pull request at:

    https://github.com/apache/beam/pull/2592


> Dataflow PostCommit has been failing since build #2814
> ------------------------------------------------------
>
>                 Key: BEAM-2015
>                 URL: https://issues.apache.org/jira/browse/BEAM-2015
>             Project: Beam
>          Issue Type: Bug
>          Components: runner-dataflow
>    Affects Versions: First stable release
>            Reporter: Luke Cwik
>            Assignee: Luke Cwik
>
> https://builds.apache.org/view/Beam/job/beam_PostCommit_Java_ValidatesRunner_Dataflow/2814/
> The issue is the runners/core-java is inheriting the maven profile which is being activated
by the specification of the validatesRunnerPipelineOptions system property.
> This issue had not been a problem in the past because the dependency order had made the
runners/google-cloud-dataflow-java part of the classpath.
> There was an assumption that runners/ would only have runner modules and that all submodules
would want to have the shared definition. This is no longer the case.
> {code}
> Tests run: 7, Failures: 0, Errors: 7, Skipped: 0, Time elapsed: 0.046 sec <<<
FAILURE! - in org.apache.beam.runners.core.SplittableParDoTest
> testCheckpointsAfterNumOutputs(org.apache.beam.runners.core.SplittableParDoTest)  Time
elapsed: 0.003 sec  <<< ERROR!
> java.lang.IllegalArgumentException: Unknown 'runner' specified 'org.apache.beam.runners.dataflow.testing.TestDataflowRunner',
supported pipeline runners [RegisteredTestRunner]
> 	at org.apache.beam.sdk.options.PipelineOptionsFactory.parseObjects(PipelineOptionsFactory.java:1609)
> 	at org.apache.beam.sdk.options.PipelineOptionsFactory.access$400(PipelineOptionsFactory.java:104)
> 	at org.apache.beam.sdk.options.PipelineOptionsFactory$Builder.as(PipelineOptionsFactory.java:289)
> 	at org.apache.beam.sdk.testing.TestPipeline.testingPipelineOptions(TestPipeline.java:392)
> 	at org.apache.beam.sdk.testing.TestPipeline.create(TestPipeline.java:257)
> 	at org.apache.beam.runners.core.SplittableParDoTest.<init>(SplittableParDoTest.java:149)
> 	at sun.reflect.NativeConstructorAccessorImpl.newInstance0(Native Method)
> 	at sun.reflect.NativeConstructorAccessorImpl.newInstance(NativeConstructorAccessorImpl.java:62)
> 	at sun.reflect.DelegatingConstructorAccessorImpl.newInstance(DelegatingConstructorAccessorImpl.java:45)
> 	at java.lang.reflect.Constructor.newInstance(Constructor.java:423)
> 	at org.junit.runners.BlockJUnit4ClassRunner.createTest(BlockJUnit4ClassRunner.java:217)
> 	at org.junit.runners.BlockJUnit4ClassRunner$1.runReflectiveCall(BlockJUnit4ClassRunner.java:266)
> 	at org.junit.internal.runners.model.ReflectiveCallable.run(ReflectiveCallable.java:12)
> 	at org.junit.runners.BlockJUnit4ClassRunner.methodBlock(BlockJUnit4ClassRunner.java:263)
> 	at org.junit.runners.BlockJUnit4ClassRunner.runChild(BlockJUnit4ClassRunner.java:78)
> 	at org.junit.runners.BlockJUnit4ClassRunner.runChild(BlockJUnit4ClassRunner.java:57)
> 	at org.junit.runners.ParentRunner$3.run(ParentRunner.java:290)
> 	at org.junit.runners.ParentRunner$1.schedule(ParentRunner.java:71)
> 	at org.junit.runners.ParentRunner.runChildren(ParentRunner.java:288)
> 	at org.junit.runners.ParentRunner.access$000(ParentRunner.java:58)
> 	at org.junit.runners.ParentRunner$2.evaluate(ParentRunner.java:268)
> 	at org.junit.runners.ParentRunner.run(ParentRunner.java:363)
> 	at org.junit.runners.Suite.runChild(Suite.java:128)
> 	at org.junit.runners.Suite.runChild(Suite.java:27)
> 	at org.junit.runners.ParentRunner$3.run(ParentRunner.java:290)
> 	at org.junit.runners.ParentRunner$1.schedule(ParentRunner.java:71)
> 	at org.junit.runners.ParentRunner.runChildren(ParentRunner.java:288)
> 	at org.junit.runners.ParentRunner.access$000(ParentRunner.java:58)
> 	at org.junit.runners.ParentRunner$2.evaluate(ParentRunner.java:268)
> 	at org.junit.runners.ParentRunner.run(ParentRunner.java:363)
> 	at org.apache.maven.surefire.junitcore.JUnitCore.run(JUnitCore.java:55)
> 	at org.apache.maven.surefire.junitcore.JUnitCoreWrapper.createRequestAndRun(JUnitCoreWrapper.java:137)
> 	at org.apache.maven.surefire.junitcore.JUnitCoreWrapper.executeEager(JUnitCoreWrapper.java:107)
> 	at org.apache.maven.surefire.junitcore.JUnitCoreWrapper.execute(JUnitCoreWrapper.java:83)
> 	at org.apache.maven.surefire.junitcore.JUnitCoreWrapper.execute(JUnitCoreWrapper.java:75)
> 	at org.apache.maven.surefire.junitcore.JUnitCoreProvider.invoke(JUnitCoreProvider.java:161)
> 	at sun.reflect.NativeMethodAccessorImpl.invoke0(Native Method)
> 	at sun.reflect.NativeMethodAccessorImpl.invoke(NativeMethodAccessorImpl.java:62)
> 	at sun.reflect.DelegatingMethodAccessorImpl.invoke(DelegatingMethodAccessorImpl.java:43)
> 	at java.lang.reflect.Method.invoke(Method.java:498)
> 	at org.apache.maven.surefire.util.ReflectionUtils.invokeMethodWithArray2(ReflectionUtils.java:202)
> 	at org.apache.maven.surefire.booter.ProviderFactory$ProviderProxy.invoke(ProviderFactory.java:155)
> 	at org.apache.maven.surefire.booter.ProviderFactory.invokeProvider(ProviderFactory.java:81)
> 	at org.apache.maven.plugin.surefire.InPluginVMSurefireStarter.runSuitesInProcess(InPluginVMSurefireStarter.java:82)
> 	at org.apache.maven.plugin.surefire.AbstractSurefireMojo.executeProvider(AbstractSurefireMojo.java:1010)
> 	at org.apache.maven.plugin.surefire.AbstractSurefireMojo.executeAfterPreconditionsChecked(AbstractSurefireMojo.java:862)
> 	at org.apache.maven.plugin.surefire.AbstractSurefireMojo.execute(AbstractSurefireMojo.java:755)
> 	at org.apache.maven.plugin.DefaultBuildPluginManager.executeMojo(DefaultBuildPluginManager.java:134)
> 	at org.apache.maven.lifecycle.internal.MojoExecutor.execute(MojoExecutor.java:208)
> 	at org.apache.maven.lifecycle.internal.MojoExecutor.execute(MojoExecutor.java:153)
> 	at org.apache.maven.lifecycle.internal.MojoExecutor.execute(MojoExecutor.java:145)
> 	at org.apache.maven.lifecycle.internal.LifecycleModuleBuilder.buildProject(LifecycleModuleBuilder.java:116)
> 	at org.apache.maven.lifecycle.internal.LifecycleModuleBuilder.buildProject(LifecycleModuleBuilder.java:80)
> 	at org.apache.maven.lifecycle.internal.builder.singlethreaded.SingleThreadedBuilder.build(SingleThreadedBuilder.java:51)
> 	at org.apache.maven.lifecycle.internal.LifecycleStarter.execute(LifecycleStarter.java:128)
> 	at org.apache.maven.DefaultMaven.doExecute(DefaultMaven.java:307)
> 	at org.apache.maven.DefaultMaven.doExecute(DefaultMaven.java:193)
> 	at org.apache.maven.DefaultMaven.execute(DefaultMaven.java:106)
> 	at org.jvnet.hudson.maven3.launcher.Maven33Launcher.main(Maven33Launcher.java:129)
> 	at sun.reflect.NativeMethodAccessorImpl.invoke0(Native Method)
> 	at sun.reflect.NativeMethodAccessorImpl.invoke(NativeMethodAccessorImpl.java:62)
> 	at sun.reflect.DelegatingMethodAccessorImpl.invoke(DelegatingMethodAccessorImpl.java:43)
> 	at java.lang.reflect.Method.invoke(Method.java:498)
> 	at org.codehaus.plexus.classworlds.launcher.Launcher.launchStandard(Launcher.java:330)
> 	at org.codehaus.plexus.classworlds.launcher.Launcher.launch(Launcher.java:238)
> 	at jenkins.maven3.agent.Maven33Main.launch(Maven33Main.java:176)
> 	at sun.reflect.NativeMethodAccessorImpl.invoke0(Native Method)
> 	at sun.reflect.NativeMethodAccessorImpl.invoke(NativeMethodAccessorImpl.java:62)
> 	at sun.reflect.DelegatingMethodAccessorImpl.invoke(DelegatingMethodAccessorImpl.java:43)
> 	at java.lang.reflect.Method.invoke(Method.java:498)
> 	at hudson.maven.Maven3Builder.call(Maven3Builder.java:139)
> 	at hudson.maven.Maven3Builder.call(Maven3Builder.java:70)
> 	at hudson.remoting.UserRequest.perform(UserRequest.java:153)
> 	at hudson.remoting.UserRequest.perform(UserRequest.java:50)
> 	at hudson.remoting.Request$2.run(Request.java:336)
> 	at hudson.remoting.InterceptingExecutorService$1.call(InterceptingExecutorService.java:68)
> 	at java.util.concurrent.FutureTask.run(FutureTask.java:266)
> 	at java.util.concurrent.ThreadPoolExecutor.runWorker(ThreadPoolExecutor.java:1142)
> 	at java.util.concurrent.ThreadPoolExecutor$Worker.run(ThreadPoolExecutor.java:617)
> 	at java.lang.Thread.run(Thread.java:745)
> Caused by: java.lang.ClassNotFoundException: org.apache.beam.runners.dataflow.testing.TestDataflowRunner
> 	at java.net.URLClassLoader.findClass(URLClassLoader.java:381)
> 	at java.lang.ClassLoader.loadClass(ClassLoader.java:424)
> 	at java.lang.ClassLoader.loadClass(ClassLoader.java:357)
> 	at org.apache.maven.surefire.booter.IsolatedClassLoader.loadClass(IsolatedClassLoader.java:97)
> 	at java.lang.Class.forName0(Native Method)
> 	at java.lang.Class.forName(Class.java:264)
> 	at org.apache.beam.sdk.options.PipelineOptionsFactory.parseObjects(PipelineOptionsFactory.java:1595)
> 	... 79 more
> {code}



--
This message was sent by Atlassian JIRA
(v6.3.15#6346)

Mime
View raw message