beam-commits mailing list archives

Site index · List index
Message view « Date » · « Thread »
Top « Date » · « Thread »
From Apache Jenkins Server <jenk...@builds.apache.org>
Subject Build failed in Jenkins: beam_PostCommit_Java_ValidatesRunner_Dataflow #2923
Date Mon, 24 Apr 2017 22:37:50 GMT
See <https://builds.apache.org/job/beam_PostCommit_Java_ValidatesRunner_Dataflow/2923/display/redirect?page=changes>

Changes:

[robertwb] Add instructions to regenerate Python proto wrappers.

[robertwb] Generate python proto wrappers for runner and fn API.

[robertwb] Add apache licence to generated files.

[robertwb] Adapt to PR #2505 changes to protos.

[lcwik] [BEAM-1871] Move ProtoCoder to new sdks/java/extensions/protobuf

------------------------------------------
[...truncated 1.35 MB...]
2017-04-24T22:37:27.952 [INFO] Downloading: https://repo.maven.apache.org/maven2/io/netty/netty-buffer/4.1.8.Final/netty-buffer-4.1.8.Final.pom
2017-04-24T22:37:27.979 [INFO] Downloaded: https://repo.maven.apache.org/maven2/io/netty/netty-buffer/4.1.8.Final/netty-buffer-4.1.8.Final.pom
(2 KB at 49.8 KB/sec)
2017-04-24T22:37:27.994 [INFO] Downloading: https://repo.maven.apache.org/maven2/io/netty/netty-common/4.1.8.Final/netty-common-4.1.8.Final.pom
2017-04-24T22:37:28.024 [INFO] Downloaded: https://repo.maven.apache.org/maven2/io/netty/netty-common/4.1.8.Final/netty-common-4.1.8.Final.pom
(10 KB at 327.9 KB/sec)
2017-04-24T22:37:28.032 [INFO] Downloading: https://repo.maven.apache.org/maven2/io/netty/netty-resolver/4.1.8.Final/netty-resolver-4.1.8.Final.pom
2017-04-24T22:37:28.060 [INFO] Downloaded: https://repo.maven.apache.org/maven2/io/netty/netty-resolver/4.1.8.Final/netty-resolver-4.1.8.Final.pom
(2 KB at 48.2 KB/sec)
2017-04-24T22:37:28.068 [INFO] Downloading: https://repo.maven.apache.org/maven2/io/netty/netty-handler/4.1.8.Final/netty-handler-4.1.8.Final.pom
2017-04-24T22:37:28.100 [INFO] Downloaded: https://repo.maven.apache.org/maven2/io/netty/netty-handler/4.1.8.Final/netty-handler-4.1.8.Final.pom
(3 KB at 73.2 KB/sec)
2017-04-24T22:37:28.107 [INFO] Downloading: https://repo.maven.apache.org/maven2/io/netty/netty-handler-proxy/4.1.8.Final/netty-handler-proxy-4.1.8.Final.pom
2017-04-24T22:37:28.135 [INFO] Downloaded: https://repo.maven.apache.org/maven2/io/netty/netty-handler-proxy/4.1.8.Final/netty-handler-proxy-4.1.8.Final.pom
(2 KB at 67.3 KB/sec)
2017-04-24T22:37:28.146 [INFO] Downloading: https://repo.maven.apache.org/maven2/io/netty/netty-codec-socks/4.1.8.Final/netty-codec-socks-4.1.8.Final.pom
2017-04-24T22:37:28.177 [INFO] Downloaded: https://repo.maven.apache.org/maven2/io/netty/netty-codec-socks/4.1.8.Final/netty-codec-socks-4.1.8.Final.pom
(2 KB at 42.3 KB/sec)
2017-04-24T22:37:28.184 [INFO] Downloading: https://repo.maven.apache.org/maven2/io/grpc/grpc-okhttp/1.2.0/grpc-okhttp-1.2.0.pom
2017-04-24T22:37:28.213 [INFO] Downloaded: https://repo.maven.apache.org/maven2/io/grpc/grpc-okhttp/1.2.0/grpc-okhttp-1.2.0.pom
(3 KB at 82.0 KB/sec)
2017-04-24T22:37:28.215 [INFO] Downloading: https://repo.maven.apache.org/maven2/com/squareup/okhttp/okhttp/2.5.0/okhttp-2.5.0.pom
2017-04-24T22:37:28.254 [INFO] Downloaded: https://repo.maven.apache.org/maven2/com/squareup/okhttp/okhttp/2.5.0/okhttp-2.5.0.pom
(2 KB at 35.4 KB/sec)
2017-04-24T22:37:28.256 [INFO] Downloading: https://repo.maven.apache.org/maven2/com/squareup/okhttp/parent/2.5.0/parent-2.5.0.pom
2017-04-24T22:37:28.286 [INFO] Downloaded: https://repo.maven.apache.org/maven2/com/squareup/okhttp/parent/2.5.0/parent-2.5.0.pom
(9 KB at 298.6 KB/sec)
2017-04-24T22:37:28.289 [INFO] Downloading: https://repo.maven.apache.org/maven2/com/squareup/okio/okio/1.6.0/okio-1.6.0.pom
2017-04-24T22:37:28.321 [INFO] Downloaded: https://repo.maven.apache.org/maven2/com/squareup/okio/okio/1.6.0/okio-1.6.0.pom
(2 KB at 45.1 KB/sec)
2017-04-24T22:37:28.323 [INFO] Downloading: https://repo.maven.apache.org/maven2/com/squareup/okio/okio-parent/1.6.0/okio-parent-1.6.0.pom
2017-04-24T22:37:28.351 [INFO] Downloaded: https://repo.maven.apache.org/maven2/com/squareup/okio/okio-parent/1.6.0/okio-parent-1.6.0.pom
(4 KB at 111.4 KB/sec)
2017-04-24T22:37:28.354 [INFO] Downloading: https://repo.maven.apache.org/maven2/io/grpc/grpc-protobuf-nano/1.2.0/grpc-protobuf-nano-1.2.0.pom
2017-04-24T22:37:28.382 [INFO] Downloaded: https://repo.maven.apache.org/maven2/io/grpc/grpc-protobuf-nano/1.2.0/grpc-protobuf-nano-1.2.0.pom
(3 KB at 74.7 KB/sec)
2017-04-24T22:37:28.385 [INFO] Downloading: https://repo.maven.apache.org/maven2/com/google/protobuf/nano/protobuf-javanano/3.0.0-alpha-5/protobuf-javanano-3.0.0-alpha-5.pom
2017-04-24T22:37:28.413 [INFO] Downloaded: https://repo.maven.apache.org/maven2/com/google/protobuf/nano/protobuf-javanano/3.0.0-alpha-5/protobuf-javanano-3.0.0-alpha-5.pom
(11 KB at 386.3 KB/sec)
2017-04-24T22:37:28.416 [INFO] Downloading: https://repo.maven.apache.org/maven2/com/google/cloud/bigtable/bigtable-protos/0.9.6/bigtable-protos-0.9.6.pom
2017-04-24T22:37:28.443 [INFO] Downloaded: https://repo.maven.apache.org/maven2/com/google/cloud/bigtable/bigtable-protos/0.9.6/bigtable-protos-0.9.6.pom
(8 KB at 275.0 KB/sec)
2017-04-24T22:37:28.445 [INFO] Downloading: https://repo.maven.apache.org/maven2/com/google/cloud/bigtable/bigtable-client-core-parent/0.9.6/bigtable-client-core-parent-0.9.6.pom
2017-04-24T22:37:28.473 [INFO] Downloaded: https://repo.maven.apache.org/maven2/com/google/cloud/bigtable/bigtable-client-core-parent/0.9.6/bigtable-client-core-parent-0.9.6.pom
(2 KB at 50.1 KB/sec)
2017-04-24T22:37:28.475 [INFO] Downloading: https://repo.maven.apache.org/maven2/com/google/cloud/bigtable/bigtable-client-parent/0.9.6/bigtable-client-parent-0.9.6.pom
2017-04-24T22:37:28.507 [INFO] Downloaded: https://repo.maven.apache.org/maven2/com/google/cloud/bigtable/bigtable-client-parent/0.9.6/bigtable-client-parent-0.9.6.pom
(25 KB at 778.6 KB/sec)
2017-04-24T22:37:28.511 [INFO] Downloading: https://repo.maven.apache.org/maven2/com/google/cloud/bigtable/bigtable-client-core/0.9.6/bigtable-client-core-0.9.6.pom
2017-04-24T22:37:28.552 [INFO] Downloaded: https://repo.maven.apache.org/maven2/com/google/cloud/bigtable/bigtable-client-core/0.9.6/bigtable-client-core-0.9.6.pom
(5 KB at 120.5 KB/sec)
2017-04-24T22:37:28.556 [INFO] Downloading: https://repo.maven.apache.org/maven2/commons-logging/commons-logging/1.2/commons-logging-1.2.pom
2017-04-24T22:37:28.585 [INFO] Downloaded: https://repo.maven.apache.org/maven2/commons-logging/commons-logging/1.2/commons-logging-1.2.pom
(19 KB at 646.8 KB/sec)
2017-04-24T22:37:28.594 [INFO] Downloading: https://repo.maven.apache.org/maven2/com/google/auth/google-auth-library-appengine/0.6.0/google-auth-library-appengine-0.6.0.pom
2017-04-24T22:37:28.623 [INFO] Downloaded: https://repo.maven.apache.org/maven2/com/google/auth/google-auth-library-appengine/0.6.0/google-auth-library-appengine-0.6.0.pom
(3 KB at 85.3 KB/sec)
2017-04-24T22:37:28.625 [INFO] Downloading: https://repo.maven.apache.org/maven2/com/google/auth/google-auth-library-parent/0.6.0/google-auth-library-parent-0.6.0.pom
2017-04-24T22:37:28.654 [INFO] Downloaded: https://repo.maven.apache.org/maven2/com/google/auth/google-auth-library-parent/0.6.0/google-auth-library-parent-0.6.0.pom
(8 KB at 274.3 KB/sec)
2017-04-24T22:37:28.658 [INFO] Downloading: https://repo.maven.apache.org/maven2/com/google/appengine/appengine-api-1.0-sdk/1.9.34/appengine-api-1.0-sdk-1.9.34.pom
2017-04-24T22:37:28.685 [INFO] Downloaded: https://repo.maven.apache.org/maven2/com/google/appengine/appengine-api-1.0-sdk/1.9.34/appengine-api-1.0-sdk-1.9.34.pom
(607 B at 22.0 KB/sec)
2017-04-24T22:37:28.687 [INFO] Downloading: https://repo.maven.apache.org/maven2/com/google/appengine/appengine/1.9.34/appengine-1.9.34.pom
2017-04-24T22:37:28.716 [INFO] Downloaded: https://repo.maven.apache.org/maven2/com/google/appengine/appengine/1.9.34/appengine-1.9.34.pom
(845 B at 28.5 KB/sec)
2017-04-24T22:37:28.717 [INFO] Downloading: https://repo.maven.apache.org/maven2/org/sonatype/oss/oss-parent/4/oss-parent-4.pom
2017-04-24T22:37:28.746 [INFO] Downloaded: https://repo.maven.apache.org/maven2/org/sonatype/oss/oss-parent/4/oss-parent-4.pom
(4 KB at 134.7 KB/sec)
2017-04-24T22:37:28.752 [INFO] Downloading: https://repository.apache.org/content/repositories/snapshots/io/netty/netty-codec-http2/maven-metadata.xml
2017-04-24T22:37:28.756 [INFO] Downloading: https://oss.sonatype.org/content/repositories/snapshots/io/netty/netty-codec-http2/maven-metadata.xml
2017-04-24T22:37:28.978 [INFO] Downloaded: https://oss.sonatype.org/content/repositories/snapshots/io/netty/netty-codec-http2/maven-metadata.xml
(406 B at 1.8 KB/sec)
2017-04-24T22:37:28.979 [INFO] Downloading: https://repo.maven.apache.org/maven2/io/dropwizard/metrics/metrics-core/3.1.2/metrics-core-3.1.2.pom
2017-04-24T22:37:29.005 [INFO] Downloaded: https://repo.maven.apache.org/maven2/io/dropwizard/metrics/metrics-core/3.1.2/metrics-core-3.1.2.pom
(846 B at 31.8 KB/sec)
2017-04-24T22:37:29.007 [INFO] Downloading: https://repo.maven.apache.org/maven2/io/dropwizard/metrics/metrics-parent/3.1.2/metrics-parent-3.1.2.pom
2017-04-24T22:37:29.034 [INFO] Downloaded: https://repo.maven.apache.org/maven2/io/dropwizard/metrics/metrics-parent/3.1.2/metrics-parent-3.1.2.pom
(12 KB at 434.1 KB/sec)
2017-04-24T22:37:29.040 [INFO] Downloading: https://repo.maven.apache.org/maven2/io/netty/netty-tcnative-boringssl-static/1.1.33.Fork26/netty-tcnative-boringssl-static-1.1.33.Fork26.pom
2017-04-24T22:37:29.071 [INFO] Downloaded: https://repo.maven.apache.org/maven2/io/netty/netty-tcnative-boringssl-static/1.1.33.Fork26/netty-tcnative-boringssl-static-1.1.33.Fork26.pom
(17 KB at 543.9 KB/sec)
2017-04-24T22:37:29.073 [INFO] Downloading: https://repo.maven.apache.org/maven2/io/netty/netty-tcnative-parent/1.1.33.Fork26/netty-tcnative-parent-1.1.33.Fork26.pom
2017-04-24T22:37:29.102 [INFO] Downloaded: https://repo.maven.apache.org/maven2/io/netty/netty-tcnative-parent/1.1.33.Fork26/netty-tcnative-parent-1.1.33.Fork26.pom
(20 KB at 680.7 KB/sec)
2017-04-24T22:37:29.104 [INFO] Downloading: https://repo.maven.apache.org/maven2/io/netty/netty-parent/4.0.18.Final/netty-parent-4.0.18.Final.pom
2017-04-24T22:37:29.135 [INFO] Downloaded: https://repo.maven.apache.org/maven2/io/netty/netty-parent/4.0.18.Final/netty-parent-4.0.18.Final.pom
(31 KB at 992.8 KB/sec)
2017-04-24T22:37:29.171 [INFO] Downloading: https://repo.maven.apache.org/maven2/com/google/api/grpc/grpc-google-pubsub-v1/0.1.0/grpc-google-pubsub-v1-0.1.0.jar
2017-04-24T22:37:29.171 [INFO] Downloading: https://repo.maven.apache.org/maven2/com/google/api/grpc/grpc-google-iam-v1/0.1.0/grpc-google-iam-v1-0.1.0.jar
2017-04-24T22:37:29.180 [INFO] Downloading: https://repo.maven.apache.org/maven2/com/google/cloud/datastore/datastore-v1-protos/1.3.0/datastore-v1-protos-1.3.0.jar
2017-04-24T22:37:29.187 [INFO] Downloading: https://repo.maven.apache.org/maven2/com/google/cloud/datastore/datastore-v1-proto-client/1.4.0/datastore-v1-proto-client-1.4.0.jar
2017-04-24T22:37:29.188 [INFO] Downloading: https://repo.maven.apache.org/maven2/io/grpc/grpc-auth/1.2.0/grpc-auth-1.2.0.jar
2017-04-24T22:37:29.221 [INFO] Downloaded: https://repo.maven.apache.org/maven2/com/google/cloud/datastore/datastore-v1-proto-client/1.4.0/datastore-v1-proto-client-1.4.0.jar
(40 KB at 795.9 KB/sec)
2017-04-24T22:37:29.221 [INFO] Downloading: https://repo.maven.apache.org/maven2/io/grpc/grpc-netty/1.2.0/grpc-netty-1.2.0.jar
2017-04-24T22:37:29.229 [INFO] Downloaded: https://repo.maven.apache.org/maven2/io/grpc/grpc-auth/1.2.0/grpc-auth-1.2.0.jar
(13 KB at 245.3 KB/sec)
2017-04-24T22:37:29.229 [INFO] Downloading: https://repo.maven.apache.org/maven2/io/netty/netty-codec-http2/4.1.8.Final/netty-codec-http2-4.1.8.Final.jar
2017-04-24T22:37:29.239 [INFO] Downloaded: https://repo.maven.apache.org/maven2/com/google/api/grpc/grpc-google-iam-v1/0.1.0/grpc-google-iam-v1-0.1.0.jar
(78 KB at 1136.0 KB/sec)
2017-04-24T22:37:29.239 [INFO] Downloading: https://repo.maven.apache.org/maven2/io/netty/netty-codec-http/4.1.8.Final/netty-codec-http-4.1.8.Final.jar
2017-04-24T22:37:29.269 [INFO] Downloaded: https://repo.maven.apache.org/maven2/com/google/api/grpc/grpc-google-pubsub-v1/0.1.0/grpc-google-pubsub-v1-0.1.0.jar
(262 KB at 2671.8 KB/sec)
2017-04-24T22:37:29.270 [INFO] Downloading: https://repo.maven.apache.org/maven2/io/netty/netty-handler-proxy/4.1.8.Final/netty-handler-proxy-4.1.8.Final.jar
2017-04-24T22:37:29.293 [INFO] Downloaded: https://repo.maven.apache.org/maven2/io/grpc/grpc-netty/1.2.0/grpc-netty-1.2.0.jar
(162 KB at 1525.9 KB/sec)
2017-04-24T22:37:29.295 [INFO] Downloading: https://repo.maven.apache.org/maven2/io/netty/netty-codec-socks/4.1.8.Final/netty-codec-socks-4.1.8.Final.jar
2017-04-24T22:37:29.300 [INFO] Downloaded: https://repo.maven.apache.org/maven2/com/google/cloud/datastore/datastore-v1-protos/1.3.0/datastore-v1-protos-1.3.0.jar
(437 KB at 3641.0 KB/sec)
2017-04-24T22:37:29.300 [INFO] Downloading: https://repo.maven.apache.org/maven2/io/netty/netty-handler/4.1.8.Final/netty-handler-4.1.8.Final.jar
2017-04-24T22:37:29.302 [INFO] Downloaded: https://repo.maven.apache.org/maven2/io/netty/netty-handler-proxy/4.1.8.Final/netty-handler-proxy-4.1.8.Final.jar
(20 KB at 175.2 KB/sec)
2017-04-24T22:37:29.302 [INFO] Downloading: https://repo.maven.apache.org/maven2/io/netty/netty-buffer/4.1.8.Final/netty-buffer-4.1.8.Final.jar
2017-04-24T22:37:29.392 [INFO] Downloaded: https://repo.maven.apache.org/maven2/io/netty/netty-codec-http2/4.1.8.Final/netty-codec-http2-4.1.8.Final.jar
(355 KB at 1731.7 KB/sec)
2017-04-24T22:37:29.392 [INFO] Downloading: https://repo.maven.apache.org/maven2/io/netty/netty-common/4.1.8.Final/netty-common-4.1.8.Final.jar
2017-04-24T22:37:29.396 [INFO] Downloaded: https://repo.maven.apache.org/maven2/io/netty/netty-codec-socks/4.1.8.Final/netty-codec-socks-4.1.8.Final.jar
(118 KB at 561.3 KB/sec)
2017-04-24T22:37:29.396 [INFO] Downloading: https://repo.maven.apache.org/maven2/io/netty/netty-transport/4.1.8.Final/netty-transport-4.1.8.Final.jar
2017-04-24T22:37:29.397 [INFO] Downloaded: https://repo.maven.apache.org/maven2/io/netty/netty-buffer/4.1.8.Final/netty-buffer-4.1.8.Final.jar
(254 KB at 1210.6 KB/sec)
2017-04-24T22:37:29.397 [INFO] Downloading: https://repo.maven.apache.org/maven2/io/netty/netty-resolver/4.1.8.Final/netty-resolver-4.1.8.Final.jar
2017-04-24T22:37:29.416 [INFO] Downloaded: https://repo.maven.apache.org/maven2/io/netty/netty-codec-http/4.1.8.Final/netty-codec-http-4.1.8.Final.jar
(533 KB at 2323.6 KB/sec)
2017-04-24T22:37:29.416 [INFO] Downloading: https://repo.maven.apache.org/maven2/io/netty/netty-codec/4.1.8.Final/netty-codec-4.1.8.Final.jar
2017-04-24T22:37:29.431 [INFO] Downloaded: https://repo.maven.apache.org/maven2/io/netty/netty-resolver/4.1.8.Final/netty-resolver-4.1.8.Final.jar
(29 KB at 119.3 KB/sec)
2017-04-24T22:37:29.437 [INFO] Downloaded: https://repo.maven.apache.org/maven2/io/netty/netty-handler/4.1.8.Final/netty-handler-4.1.8.Final.jar
(325 KB at 1307.0 KB/sec)
2017-04-24T22:37:29.439 [INFO] Downloading: https://repo.maven.apache.org/maven2/io/grpc/grpc-okhttp/1.2.0/grpc-okhttp-1.2.0.jar
2017-04-24T22:37:29.439 [INFO] Downloading: https://repo.maven.apache.org/maven2/io/grpc/grpc-all/1.2.0/grpc-all-1.2.0.jar
2017-04-24T22:37:29.466 [INFO] Downloaded: https://repo.maven.apache.org/maven2/io/grpc/grpc-all/1.2.0/grpc-all-1.2.0.jar
(359 B at 1.3 KB/sec)
2017-04-24T22:37:29.466 [INFO] Downloading: https://repo.maven.apache.org/maven2/com/squareup/okhttp/okhttp/2.5.0/okhttp-2.5.0.jar
2017-04-24T22:37:29.479 [INFO] Downloaded: https://repo.maven.apache.org/maven2/io/netty/netty-transport/4.1.8.Final/netty-transport-4.1.8.Final.jar
(418 KB at 1434.4 KB/sec)
2017-04-24T22:37:29.479 [INFO] Downloading: https://repo.maven.apache.org/maven2/com/squareup/okio/okio/1.6.0/okio-1.6.0.jar
2017-04-24T22:37:29.498 [INFO] Downloaded: https://repo.maven.apache.org/maven2/io/grpc/grpc-okhttp/1.2.0/grpc-okhttp-1.2.0.jar
(138 KB at 443.5 KB/sec)
2017-04-24T22:37:29.498 [INFO] Downloading: https://repo.maven.apache.org/maven2/io/grpc/grpc-protobuf-nano/1.2.0/grpc-protobuf-nano-1.2.0.jar
2017-04-24T22:37:29.522 [INFO] Downloaded: https://repo.maven.apache.org/maven2/com/squareup/okio/okio/1.6.0/okio-1.6.0.jar
(65 KB at 192.8 KB/sec)
2017-04-24T22:37:29.522 [INFO] Downloading: https://repo.maven.apache.org/maven2/com/google/protobuf/nano/protobuf-javanano/3.0.0-alpha-5/protobuf-javanano-3.0.0-alpha-5.jar
2017-04-24T22:37:29.528 [INFO] Downloaded: https://repo.maven.apache.org/maven2/io/grpc/grpc-protobuf-nano/1.2.0/grpc-protobuf-nano-1.2.0.jar
(5 KB at 12.1 KB/sec)
2017-04-24T22:37:29.528 [INFO] Downloading: https://repo.maven.apache.org/maven2/com/google/cloud/bigtable/bigtable-protos/0.9.6/bigtable-protos-0.9.6.jar
2017-04-24T22:37:29.531 [INFO] Downloaded: https://repo.maven.apache.org/maven2/io/netty/netty-common/4.1.8.Final/netty-common-4.1.8.Final.jar
(680 KB at 1981.6 KB/sec)
2017-04-24T22:37:29.531 [INFO] Downloading: https://repo.maven.apache.org/maven2/com/google/cloud/bigtable/bigtable-client-core/0.9.6/bigtable-client-core-0.9.6.jar
2017-04-24T22:37:29.544 [INFO] Downloaded: https://repo.maven.apache.org/maven2/io/netty/netty-codec/4.1.8.Final/netty-codec-4.1.8.Final.jar
(302 KB at 847.1 KB/sec)
2017-04-24T22:37:29.544 [INFO] Downloading: https://repo.maven.apache.org/maven2/commons-logging/commons-logging/1.2/commons-logging-1.2.jar
2017-04-24T22:37:29.581 [INFO] Downloaded: https://repo.maven.apache.org/maven2/com/google/protobuf/nano/protobuf-javanano/3.0.0-alpha-5/protobuf-javanano-3.0.0-alpha-5.jar
(50 KB at 124.7 KB/sec)
2017-04-24T22:37:29.581 [INFO] Downloading: https://repo.maven.apache.org/maven2/com/google/auth/google-auth-library-appengine/0.6.0/google-auth-library-appengine-0.6.0.jar
2017-04-24T22:37:29.613 [INFO] Downloaded: https://repo.maven.apache.org/maven2/com/google/auth/google-auth-library-appengine/0.6.0/google-auth-library-appengine-0.6.0.jar
(5 KB at 10.9 KB/sec)
2017-04-24T22:37:29.613 [INFO] Downloading: https://repo.maven.apache.org/maven2/com/google/appengine/appengine-api-1.0-sdk/1.9.34/appengine-api-1.0-sdk-1.9.34.jar
2017-04-24T22:37:29.642 [INFO] Downloaded: https://repo.maven.apache.org/maven2/com/squareup/okhttp/okhttp/2.5.0/okhttp-2.5.0.jar
(311 KB at 685.3 KB/sec)
2017-04-24T22:37:29.642 [INFO] Downloading: https://repo.maven.apache.org/maven2/io/dropwizard/metrics/metrics-core/3.1.2/metrics-core-3.1.2.jar
2017-04-24T22:37:29.647 [INFO] Downloaded: https://repo.maven.apache.org/maven2/commons-logging/commons-logging/1.2/commons-logging-1.2.jar
(61 KB at 131.5 KB/sec)
2017-04-24T22:37:29.647 [INFO] Downloading: https://repo.maven.apache.org/maven2/com/google/api/grpc/grpc-google-common-protos/0.1.0/grpc-google-common-protos-0.1.0.jar
2017-04-24T22:37:29.652 [INFO] Downloaded: https://repo.maven.apache.org/maven2/com/google/cloud/bigtable/bigtable-client-core/0.9.6/bigtable-client-core-0.9.6.jar
(209 KB at 448.6 KB/sec)
2017-04-24T22:37:29.652 [INFO] Downloading: https://repo.maven.apache.org/maven2/io/netty/netty-tcnative-boringssl-static/1.1.33.Fork26/netty-tcnative-boringssl-static-1.1.33.Fork26.jar
2017-04-24T22:37:29.684 [INFO] Downloaded: https://repo.maven.apache.org/maven2/io/dropwizard/metrics/metrics-core/3.1.2/metrics-core-3.1.2.jar
(110 KB at 221.6 KB/sec)
2017-04-24T22:37:29.750 [INFO] Downloaded: https://repo.maven.apache.org/maven2/com/google/cloud/bigtable/bigtable-protos/0.9.6/bigtable-protos-0.9.6.jar
(792 KB at 1408.0 KB/sec)
2017-04-24T22:37:29.919 [INFO] Downloaded: https://repo.maven.apache.org/maven2/com/google/api/grpc/grpc-google-common-protos/0.1.0/grpc-google-common-protos-0.1.0.jar
(974 KB at 1331.8 KB/sec)
2017-04-24T22:37:30.125 [INFO] Downloaded: https://repo.maven.apache.org/maven2/io/netty/netty-tcnative-boringssl-static/1.1.33.Fork26/netty-tcnative-boringssl-static-1.1.33.Fork26.jar
(2552 KB at 2723.0 KB/sec)
2017-04-24T22:37:31.868 [INFO] Downloaded: https://repo.maven.apache.org/maven2/com/google/appengine/appengine-api-1.0-sdk/1.9.34/appengine-api-1.0-sdk-1.9.34.jar
(17206 KB at 6419.8 KB/sec)
2017-04-24T22:37:31.880 [INFO] 
2017-04-24T22:37:31.881 [INFO] --- maven-clean-plugin:3.0.0:clean (default-clean) @ beam-sdks-java-io-google-cloud-platform
---
2017-04-24T22:37:31.890 [INFO] Deleting <https://builds.apache.org/job/beam_PostCommit_Java_ValidatesRunner_Dataflow/ws/sdks/java/io/google-cloud-platform>
(includes = [**/*.pyc, **/*.egg-info/], excludes = [])
2017-04-24T22:37:31.970 [INFO] 
2017-04-24T22:37:31.970 [INFO] --- maven-enforcer-plugin:1.4.1:enforce (enforce) @ beam-sdks-java-io-google-cloud-platform
---
2017-04-24T22:37:32.106 [INFO] artifact io.netty:netty-codec-http2: checking for updates from
central
2017-04-24T22:37:33.890 [INFO] 
2017-04-24T22:37:33.890 [INFO] --- maven-remote-resources-plugin:1.5:process (process-resource-bundles)
@ beam-sdks-java-io-google-cloud-platform ---
2017-04-24T22:37:35.181 [INFO] 
2017-04-24T22:37:35.181 [INFO] --- maven-resources-plugin:2.7:resources (default-resources)
@ beam-sdks-java-io-google-cloud-platform ---
2017-04-24T22:37:35.182 [INFO] Using 'UTF-8' encoding to copy filtered resources.
2017-04-24T22:37:35.183 [INFO] skip non existing resourceDirectory <https://builds.apache.org/job/beam_PostCommit_Java_ValidatesRunner_Dataflow/ws/sdks/java/io/google-cloud-platform/src/main/resources>
2017-04-24T22:37:35.183 [INFO] Copying 3 resources
2017-04-24T22:37:35.272 [INFO] 
2017-04-24T22:37:35.272 [INFO] --- maven-compiler-plugin:3.6.1:compile (default-compile) @
beam-sdks-java-io-google-cloud-platform ---
2017-04-24T22:37:35.285 [INFO] Changes detected - recompiling the module!
2017-04-24T22:37:35.285 [INFO] Compiling 53 source files to <https://builds.apache.org/job/beam_PostCommit_Java_ValidatesRunner_Dataflow/ws/sdks/java/io/google-cloud-platform/target/classes>
2017-04-24T22:37:37.784 [INFO] -------------------------------------------------------------
2017-04-24T22:37:37.784 [WARNING] COMPILATION WARNING : 
2017-04-24T22:37:37.785 [INFO] -------------------------------------------------------------
2017-04-24T22:37:37.785 [WARNING] bootstrap class path not set in conjunction with -source
1.7
2017-04-24T22:37:37.785 [INFO] 1 warning
2017-04-24T22:37:37.785 [INFO] -------------------------------------------------------------
2017-04-24T22:37:37.785 [INFO] -------------------------------------------------------------
2017-04-24T22:37:37.785 [ERROR] COMPILATION ERROR : 
2017-04-24T22:37:37.785 [INFO] -------------------------------------------------------------
2017-04-24T22:37:37.785 [ERROR] <https://builds.apache.org/job/beam_PostCommit_Java_ValidatesRunner_Dataflow/ws/sdks/java/io/google-cloud-platform/src/main/java/org/apache/beam/sdk/io/gcp/bigtable/BigtableIO.java>:[47,43]
package org.apache.beam.sdk.coders.protobuf does not exist
2017-04-24T22:37:37.785 [INFO] 1 error
2017-04-24T22:37:37.785 [INFO] -------------------------------------------------------------
[JENKINS] Archiving disabled
[JENKINS] Archiving disabled
[JENKINS] Archiving disabled
[JENKINS] Archiving disabled
[JENKINS] Archiving disabled
[JENKINS] Archiving disabled
[JENKINS] Archiving disabled
[JENKINS] Archiving disabled
[JENKINS] Archiving disabled
[JENKINS] Archiving disabled
[JENKINS] Archiving disabled
[JENKINS] Archiving disabled
[JENKINS] Archiving disabled
[JENKINS] Archiving disabled
[JENKINS] Archiving disabled
[JENKINS] Archiving disabled
[JENKINS] Archiving disabled
2017-04-24T22:37:44.127 [INFO] ------------------------------------------------------------------------
2017-04-24T22:37:44.127 [INFO] Reactor Summary:
2017-04-24T22:37:44.127 [INFO] 
[JENKINS] Archiving disabled2017-04-24T22:37:44.127 [INFO] Apache Beam :: Parent ..............................
SUCCESS [ 19.823 s]
2017-04-24T22:37:44.127 [INFO] Apache Beam :: SDKs :: Java :: Build Tools ......... SUCCESS
[ 10.834 s]
2017-04-24T22:37:44.127 [INFO] Apache Beam :: SDKs ................................ SUCCESS
[  1.118 s]
2017-04-24T22:37:44.127 [INFO] Apache Beam :: SDKs :: Common ...................... SUCCESS
[  1.013 s]
2017-04-24T22:37:44.127 [INFO] Apache Beam :: SDKs :: Common :: Fn API ............ SUCCESS
[ 11.515 s]
2017-04-24T22:37:44.128 [INFO] Apache Beam :: SDKs :: Common :: Runner API ........ SUCCESS
[  3.804 s]
2017-04-24T22:37:44.128 [INFO] Apache Beam :: SDKs :: Java ........................ SUCCESS
[  0.966 s]
2017-04-24T22:37:44.128 [INFO] Apache Beam :: SDKs :: Java :: Core ................ SUCCESS
[01:35 min]
2017-04-24T22:37:44.128 [INFO] Apache Beam :: SDKs :: Java :: IO .................. SUCCESS
[  1.324 s]
2017-04-24T22:37:44.128 [INFO] Apache Beam :: Runners ............................. SUCCESS
[  1.575 s]
2017-04-24T22:37:44.128 [INFO] Apache Beam :: Runners :: Core Construction Java ... SUCCESS
[  9.679 s]
2017-04-24T22:37:44.128 [INFO] Apache Beam :: Runners :: Core Java ................ SUCCESS
[ 28.337 s]
2017-04-24T22:37:44.128 [INFO] Apache Beam :: Runners :: Direct Java .............. SUCCESS
[03:30 min]
2017-04-24T22:37:44.128 [INFO] Apache Beam :: SDKs :: Java :: Extensions .......... SUCCESS
[  1.325 s]
2017-04-24T22:37:44.128 [INFO] Apache Beam :: SDKs :: Java :: Extensions :: Google Cloud Platform
Core SUCCESS [ 17.233 s]
2017-04-24T22:37:44.128 [INFO] Apache Beam :: SDKs :: Java :: IO :: Google Cloud Platform
FAILURE [ 10.805 s]
2017-04-24T22:37:44.128 [INFO] Apache Beam :: Runners :: Google Cloud Dataflow .... SKIPPED
2017-04-24T22:37:44.128 [INFO] ------------------------------------------------------------------------
2017-04-24T22:37:44.128 [INFO] BUILD FAILURE
2017-04-24T22:37:44.128 [INFO] ------------------------------------------------------------------------
2017-04-24T22:37:44.128 [INFO] Total time: 07:39 min
2017-04-24T22:37:44.128 [INFO] Finished at: 2017-04-24T22:37:44+00:00

2017-04-24T22:37:45.556 [INFO] Final Memory: 152M/1645M
2017-04-24T22:37:45.556 [INFO] ------------------------------------------------------------------------
Waiting for Jenkins to finish collecting data
2017-04-24T22:37:46.600 [ERROR] Failed to execute goal org.apache.maven.plugins:maven-compiler-plugin:3.6.1:compile
(default-compile) on project beam-sdks-java-io-google-cloud-platform: Compilation failure
2017-04-24T22:37:46.601 [ERROR] <https://builds.apache.org/job/beam_PostCommit_Java_ValidatesRunner_Dataflow/ws/sdks/java/io/google-cloud-platform/src/main/java/org/apache/beam/sdk/io/gcp/bigtable/BigtableIO.java>:[47,43]
package org.apache.beam.sdk.coders.protobuf does not exist
2017-04-24T22:37:46.601 [ERROR] -> [Help 1]
org.apache.maven.lifecycle.LifecycleExecutionException: Failed to execute goal org.apache.maven.plugins:maven-compiler-plugin:3.6.1:compile
(default-compile) on project beam-sdks-java-io-google-cloud-platform: Compilation failure
<https://builds.apache.org/job/beam_PostCommit_Java_ValidatesRunner_Dataflow/ws/sdks/java/io/google-cloud-platform/src/main/java/org/apache/beam/sdk/io/gcp/bigtable/BigtableIO.java>:[47,43]
package org.apache.beam.sdk.coders.protobuf does not exist

	at org.apache.maven.lifecycle.internal.MojoExecutor.execute(MojoExecutor.java:212)
	at org.apache.maven.lifecycle.internal.MojoExecutor.execute(MojoExecutor.java:153)
	at org.apache.maven.lifecycle.internal.MojoExecutor.execute(MojoExecutor.java:145)
	at org.apache.maven.lifecycle.internal.LifecycleModuleBuilder.buildProject(LifecycleModuleBuilder.java:116)
	at org.apache.maven.lifecycle.internal.LifecycleModuleBuilder.buildProject(LifecycleModuleBuilder.java:80)
	at org.apache.maven.lifecycle.internal.builder.singlethreaded.SingleThreadedBuilder.build(SingleThreadedBuilder.java:51)
	at org.apache.maven.lifecycle.internal.LifecycleStarter.execute(LifecycleStarter.java:128)
	at org.apache.maven.DefaultMaven.doExecute(DefaultMaven.java:307)
	at org.apache.maven.DefaultMaven.doExecute(DefaultMaven.java:193)
	at org.apache.maven.DefaultMaven.execute(DefaultMaven.java:106)
	at org.jvnet.hudson.maven3.launcher.Maven33Launcher.main(Maven33Launcher.java:129)
	at sun.reflect.NativeMethodAccessorImpl.invoke0(Native Method)
	at sun.reflect.NativeMethodAccessorImpl.invoke(NativeMethodAccessorImpl.java:62)
	at sun.reflect.DelegatingMethodAccessorImpl.invoke(DelegatingMethodAccessorImpl.java:43)
	at java.lang.reflect.Method.invoke(Method.java:498)
	at org.codehaus.plexus.classworlds.launcher.Launcher.launchStandard(Launcher.java:330)
	at org.codehaus.plexus.classworlds.launcher.Launcher.launch(Launcher.java:238)
	at jenkins.maven3.agent.Maven33Main.launch(Maven33Main.java:176)
	at sun.reflect.NativeMethodAccessorImpl.invoke0(Native Method)
	at sun.reflect.NativeMethodAccessorImpl.invoke(NativeMethodAccessorImpl.java:62)
	at sun.reflect.DelegatingMethodAccessorImpl.invoke(DelegatingMethodAccessorImpl.java:43)
	at java.lang.reflect.Method.invoke(Method.java:498)
	at hudson.maven.Maven3Builder.call(Maven3Builder.java:139)
	at hudson.maven.Maven3Builder.call(Maven3Builder.java:70)
	at hudson.remoting.UserRequest.perform(UserRequest.java:153)
	at hudson.remoting.UserRequest.perform(UserRequest.java:50)
	at hudson.remoting.Request$2.run(Request.java:336)
	at hudson.remoting.InterceptingExecutorService$1.call(InterceptingExecutorService.java:68)
	at java.util.concurrent.FutureTask.run(FutureTask.java:266)
	at java.util.concurrent.ThreadPoolExecutor.runWorker(ThreadPoolExecutor.java:1142)
	at java.util.concurrent.ThreadPoolExecutor$Worker.run(ThreadPoolExecutor.java:617)
	at java.lang.Thread.run(Thread.java:745)
Caused by: org.apache.maven.plugin.compiler.CompilationFailureException: Compilation failure
<https://builds.apache.org/job/beam_PostCommit_Java_ValidatesRunner_Dataflow/ws/sdks/java/io/google-cloud-platform/src/main/java/org/apache/beam/sdk/io/gcp/bigtable/BigtableIO.java>:[47,43]
package org.apache.beam.sdk.coders.protobuf does not exist

	at org.apache.maven.plugin.compiler.AbstractCompilerMojo.execute(AbstractCompilerMojo.java:1029)
	at org.apache.maven.plugin.compiler.CompilerMojo.execute(CompilerMojo.java:137)
	at org.apache.maven.plugin.DefaultBuildPluginManager.executeMojo(DefaultBuildPluginManager.java:134)
	at org.apache.maven.lifecycle.internal.MojoExecutor.execute(MojoExecutor.java:208)
	... 31 more
2017-04-24T22:37:46.603 [ERROR] 
2017-04-24T22:37:46.603 [ERROR] Re-run Maven using the -X switch to enable full debug logging.
2017-04-24T22:37:46.603 [ERROR] 
2017-04-24T22:37:46.603 [ERROR] For more information about the errors and possible solutions,
please read the following articles:
2017-04-24T22:37:46.603 [ERROR] [Help 1] http://cwiki.apache.org/confluence/display/MAVEN/MojoFailureException
2017-04-24T22:37:46.604 [ERROR] 
2017-04-24T22:37:46.604 [ERROR] After correcting the problems, you can resume the build with
the command
2017-04-24T22:37:46.604 [ERROR]   mvn <goals> -rf :beam-sdks-java-io-google-cloud-platform
channel stopped

Mime
View raw message