beam-commits mailing list archives

Site index · List index
Message view « Date » · « Thread »
Top « Date » · « Thread »
From Apache Jenkins Server <jenk...@builds.apache.org>
Subject Build failed in Jenkins: beam_PostCommit_Java_ValidatesRunner_Spark #1514
Date Wed, 05 Apr 2017 07:32:36 GMT
See <https://builds.apache.org/job/beam_PostCommit_Java_ValidatesRunner_Spark/1514/display/redirect?page=changes>

Changes:

[staslevin] [BEAM-1777] In certain circumstances PipelineEnforcement shades

------------------------------------------
[...truncated 495.03 KB...]
2017-04-05T07:32:23.156 [INFO] Downloading: https://repo.maven.apache.org/maven2/org/ow2/asm/asm/5.0.2/asm-5.0.2.jar
2017-04-05T07:32:23.167 [INFO] Downloaded: https://repo.maven.apache.org/maven2/org/apache/maven/shared/maven-shared-io/1.1/maven-shared-io-1.1.jar
(39 KB at 219.1 KB/sec)
2017-04-05T07:32:23.167 [INFO] Downloading: https://repo.maven.apache.org/maven2/org/apache/maven/shared/maven-dependency-tree/3.0/maven-dependency-tree-3.0.jar
2017-04-05T07:32:23.173 [INFO] Downloaded: https://repo.maven.apache.org/maven2/org/apache/maven/wagon/wagon-provider-api/1.0-alpha-6/wagon-provider-api-1.0-alpha-6.jar
(42 KB at 229.3 KB/sec)
2017-04-05T07:32:23.173 [INFO] Downloading: https://repo.maven.apache.org/maven2/commons-lang/commons-lang/2.6/commons-lang-2.6.jar
2017-04-05T07:32:23.173 [INFO] Downloaded: https://repo.maven.apache.org/maven2/org/apache/commons/commons-compress/1.11/commons-compress-1.11.jar
(416 KB at 2283.9 KB/sec)
2017-04-05T07:32:23.173 [INFO] Downloading: https://repo.maven.apache.org/maven2/commons-collections/commons-collections/3.2.2/commons-collections-3.2.2.jar
2017-04-05T07:32:23.177 [INFO] Downloaded: https://repo.maven.apache.org/maven2/org/apache/maven/shared/maven-dependency-analyzer/1.6/maven-dependency-analyzer-1.6.jar
(31 KB at 165.4 KB/sec)
2017-04-05T07:32:23.183 [INFO] Downloaded: https://repo.maven.apache.org/maven2/org/ow2/asm/asm/5.0.2/asm-5.0.2.jar
(52 KB at 270.8 KB/sec)
2017-04-05T07:32:23.195 [INFO] Downloaded: https://repo.maven.apache.org/maven2/org/apache/maven/shared/maven-dependency-tree/3.0/maven-dependency-tree-3.0.jar
(36 KB at 175.1 KB/sec)
2017-04-05T07:32:23.219 [INFO] Downloaded: https://repo.maven.apache.org/maven2/commons-lang/commons-lang/2.6/commons-lang-2.6.jar
(278 KB at 1217.4 KB/sec)
2017-04-05T07:32:23.264 [INFO] Downloaded: https://repo.maven.apache.org/maven2/commons-collections/commons-collections/3.2.2/commons-collections-3.2.2.jar
(575 KB at 2104.6 KB/sec)
2017-04-05T07:32:23.464 [INFO] Skipping pom project
[JENKINS] Archiving disabled
2017-04-05T07:32:25.139 [INFO]                                                           
             
2017-04-05T07:32:25.139 [INFO] ------------------------------------------------------------------------
2017-04-05T07:32:25.139 [INFO] Building Apache Beam :: SDKs :: Java :: Build Tools 0.7.0-SNAPSHOT
2017-04-05T07:32:25.139 [INFO] ------------------------------------------------------------------------
2017-04-05T07:32:25.141 [INFO] Downloading: https://repo.maven.apache.org/maven2/org/apache/maven/plugins/maven-jar-plugin/3.0.2/maven-jar-plugin-3.0.2.pom
2017-04-05T07:32:25.166 [INFO] Downloaded: https://repo.maven.apache.org/maven2/org/apache/maven/plugins/maven-jar-plugin/3.0.2/maven-jar-plugin-3.0.2.pom
(7 KB at 232.0 KB/sec)
2017-04-05T07:32:25.169 [INFO] Downloading: https://repo.maven.apache.org/maven2/org/apache/maven/plugins/maven-jar-plugin/3.0.2/maven-jar-plugin-3.0.2.jar
2017-04-05T07:32:25.197 [INFO] Downloaded: https://repo.maven.apache.org/maven2/org/apache/maven/plugins/maven-jar-plugin/3.0.2/maven-jar-plugin-3.0.2.jar
(27 KB at 941.5 KB/sec)
2017-04-05T07:32:25.200 [INFO] Downloading: https://repo.maven.apache.org/maven2/org/apache/maven/plugins/maven-resources-plugin/2.7/maven-resources-plugin-2.7.pom
2017-04-05T07:32:25.236 [INFO] Downloaded: https://repo.maven.apache.org/maven2/org/apache/maven/plugins/maven-resources-plugin/2.7/maven-resources-plugin-2.7.pom
(8 KB at 209.1 KB/sec)
2017-04-05T07:32:25.238 [INFO] Downloading: https://repo.maven.apache.org/maven2/org/apache/maven/plugins/maven-plugins/25/maven-plugins-25.pom
2017-04-05T07:32:25.264 [INFO] Downloaded: https://repo.maven.apache.org/maven2/org/apache/maven/plugins/maven-plugins/25/maven-plugins-25.pom
(10 KB at 358.7 KB/sec)
2017-04-05T07:32:25.266 [INFO] Downloading: https://repo.maven.apache.org/maven2/org/apache/maven/plugins/maven-resources-plugin/2.7/maven-resources-plugin-2.7.jar
2017-04-05T07:32:25.295 [INFO] Downloaded: https://repo.maven.apache.org/maven2/org/apache/maven/plugins/maven-resources-plugin/2.7/maven-resources-plugin-2.7.jar
(31 KB at 1059.5 KB/sec)
2017-04-05T07:32:25.298 [INFO] Downloading: https://repo.maven.apache.org/maven2/org/apache/maven/plugins/maven-compiler-plugin/3.6.1/maven-compiler-plugin-3.6.1.pom
2017-04-05T07:32:25.323 [INFO] Downloaded: https://repo.maven.apache.org/maven2/org/apache/maven/plugins/maven-compiler-plugin/3.6.1/maven-compiler-plugin-3.6.1.pom
(11 KB at 437.5 KB/sec)
2017-04-05T07:32:25.326 [INFO] Downloading: https://repo.maven.apache.org/maven2/org/apache/maven/plugins/maven-compiler-plugin/3.6.1/maven-compiler-plugin-3.6.1.jar
2017-04-05T07:32:25.358 [INFO] Downloaded: https://repo.maven.apache.org/maven2/org/apache/maven/plugins/maven-compiler-plugin/3.6.1/maven-compiler-plugin-3.6.1.jar
(58 KB at 1789.0 KB/sec)
2017-04-05T07:32:25.361 [INFO] Downloading: https://repo.maven.apache.org/maven2/net/revelc/code/formatter/formatter-maven-plugin/2.0.1/formatter-maven-plugin-2.0.1.pom
2017-04-05T07:32:25.386 [INFO] Downloaded: https://repo.maven.apache.org/maven2/net/revelc/code/formatter/formatter-maven-plugin/2.0.1/formatter-maven-plugin-2.0.1.pom
(4 KB at 136.2 KB/sec)
2017-04-05T07:32:25.388 [INFO] Downloading: https://repo.maven.apache.org/maven2/net/revelc/code/formatter/parent/2.0.1/parent-2.0.1.pom
2017-04-05T07:32:25.416 [INFO] Downloaded: https://repo.maven.apache.org/maven2/net/revelc/code/formatter/parent/2.0.1/parent-2.0.1.pom
(35 KB at 1239.6 KB/sec)
2017-04-05T07:32:25.419 [INFO] Downloading: https://repo.maven.apache.org/maven2/io/takari/tycho/tycho-support/1.1.0/tycho-support-1.1.0.pom
2017-04-05T07:32:25.445 [INFO] Downloaded: https://repo.maven.apache.org/maven2/io/takari/tycho/tycho-support/1.1.0/tycho-support-1.1.0.pom
(10 KB at 362.3 KB/sec)
2017-04-05T07:32:25.447 [INFO] Downloading: https://repo.maven.apache.org/maven2/io/takari/takari/14/takari-14.pom
2017-04-05T07:32:25.473 [INFO] Downloaded: https://repo.maven.apache.org/maven2/io/takari/takari/14/takari-14.pom
(14 KB at 500.8 KB/sec)
2017-04-05T07:32:25.476 [INFO] Downloading: https://repo.maven.apache.org/maven2/net/revelc/code/formatter/formatter-maven-plugin/2.0.1/formatter-maven-plugin-2.0.1.jar
2017-04-05T07:32:25.504 [INFO] Downloaded: https://repo.maven.apache.org/maven2/net/revelc/code/formatter/formatter-maven-plugin/2.0.1/formatter-maven-plugin-2.0.1.jar
(32 KB at 1131.3 KB/sec)
2017-04-05T07:32:25.507 [INFO] Downloading: https://repo.maven.apache.org/maven2/org/apache/maven/plugins/maven-checkstyle-plugin/2.17/maven-checkstyle-plugin-2.17.pom
2017-04-05T07:32:25.534 [INFO] Downloaded: https://repo.maven.apache.org/maven2/org/apache/maven/plugins/maven-checkstyle-plugin/2.17/maven-checkstyle-plugin-2.17.pom
(14 KB at 482.8 KB/sec)
2017-04-05T07:32:25.537 [INFO] Downloading: https://repo.maven.apache.org/maven2/org/apache/maven/plugins/maven-checkstyle-plugin/2.17/maven-checkstyle-plugin-2.17.jar
2017-04-05T07:32:25.574 [INFO] Downloaded: https://repo.maven.apache.org/maven2/org/apache/maven/plugins/maven-checkstyle-plugin/2.17/maven-checkstyle-plugin-2.17.jar
(107 KB at 2865.6 KB/sec)
2017-04-05T07:32:25.579 [INFO] Downloading: https://repo.maven.apache.org/maven2/org/apache/maven/plugins/maven-surefire-plugin/2.19.1/maven-surefire-plugin-2.19.1.pom
2017-04-05T07:32:25.606 [INFO] Downloaded: https://repo.maven.apache.org/maven2/org/apache/maven/plugins/maven-surefire-plugin/2.19.1/maven-surefire-plugin-2.19.1.pom
(6 KB at 201.2 KB/sec)
2017-04-05T07:32:25.607 [INFO] Downloading: https://repo.maven.apache.org/maven2/org/apache/maven/surefire/surefire/2.19.1/surefire-2.19.1.pom
2017-04-05T07:32:25.634 [INFO] Downloaded: https://repo.maven.apache.org/maven2/org/apache/maven/surefire/surefire/2.19.1/surefire-2.19.1.pom
(19 KB at 667.4 KB/sec)
2017-04-05T07:32:25.637 [INFO] Downloading: https://repo.maven.apache.org/maven2/org/apache/maven/plugins/maven-surefire-plugin/2.19.1/maven-surefire-plugin-2.19.1.jar
2017-04-05T07:32:25.667 [INFO] Downloaded: https://repo.maven.apache.org/maven2/org/apache/maven/plugins/maven-surefire-plugin/2.19.1/maven-surefire-plugin-2.19.1.jar
(38 KB at 1250.1 KB/sec)
2017-04-05T07:32:25.672 [INFO] 
2017-04-05T07:32:25.672 [INFO] --- maven-clean-plugin:3.0.0:clean (default-clean) @ beam-sdks-java-build-tools
---
2017-04-05T07:32:25.673 [INFO] Deleting <https://builds.apache.org/job/beam_PostCommit_Java_ValidatesRunner_Spark/ws/sdks/java/build-tools>
(includes = [**/*.pyc, **/*.egg-info/], excludes = [])
2017-04-05T07:32:25.736 [INFO] 
2017-04-05T07:32:25.736 [INFO] --- maven-enforcer-plugin:1.4.1:enforce (enforce) @ beam-sdks-java-build-tools
---
2017-04-05T07:32:25.800 [INFO] 
2017-04-05T07:32:25.800 [INFO] --- maven-remote-resources-plugin:1.5:process (process-resource-bundles)
@ beam-sdks-java-build-tools ---
2017-04-05T07:32:25.875 [INFO] 
2017-04-05T07:32:25.875 [INFO] --- maven-resources-plugin:2.7:resources (default-resources)
@ beam-sdks-java-build-tools ---
2017-04-05T07:32:25.879 [INFO] Downloading: https://repo.maven.apache.org/maven2/org/apache/maven/shared/maven-filtering/1.2/maven-filtering-1.2.pom
2017-04-05T07:32:25.906 [INFO] Downloaded: https://repo.maven.apache.org/maven2/org/apache/maven/shared/maven-filtering/1.2/maven-filtering-1.2.pom
(7 KB at 235.5 KB/sec)
2017-04-05T07:32:25.909 [INFO] Downloading: https://repo.maven.apache.org/maven2/org/codehaus/plexus/plexus-interpolation/1.19/plexus-interpolation-1.19.pom
2017-04-05T07:32:25.933 [INFO] Downloaded: https://repo.maven.apache.org/maven2/org/codehaus/plexus/plexus-interpolation/1.19/plexus-interpolation-1.19.pom
(2 KB at 41.9 KB/sec)
2017-04-05T07:32:25.934 [INFO] Downloading: https://repo.maven.apache.org/maven2/org/codehaus/plexus/plexus-components/1.3.1/plexus-components-1.3.1.pom
2017-04-05T07:32:25.959 [INFO] Downloaded: https://repo.maven.apache.org/maven2/org/codehaus/plexus/plexus-components/1.3.1/plexus-components-1.3.1.pom
(3 KB at 119.7 KB/sec)
2017-04-05T07:32:25.965 [INFO] Downloading: https://repo.maven.apache.org/maven2/org/codehaus/plexus/plexus-utils/3.0.15/plexus-utils-3.0.15.jar
2017-04-05T07:32:25.965 [INFO] Downloading: https://repo.maven.apache.org/maven2/org/apache/maven/shared/maven-filtering/1.2/maven-filtering-1.2.jar
2017-04-05T07:32:25.965 [INFO] Downloading: https://repo.maven.apache.org/maven2/org/codehaus/plexus/plexus-interpolation/1.19/plexus-interpolation-1.19.jar
2017-04-05T07:32:25.998 [INFO] Downloaded: https://repo.maven.apache.org/maven2/org/codehaus/plexus/plexus-interpolation/1.19/plexus-interpolation-1.19.jar
(61 KB at 1825.8 KB/sec)
2017-04-05T07:32:26.004 [INFO] Downloaded: https://repo.maven.apache.org/maven2/org/apache/maven/shared/maven-filtering/1.2/maven-filtering-1.2.jar
(44 KB at 1106.2 KB/sec)
2017-04-05T07:32:26.018 [INFO] Downloaded: https://repo.maven.apache.org/maven2/org/codehaus/plexus/plexus-utils/3.0.15/plexus-utils-3.0.15.jar
(234 KB at 4321.3 KB/sec)
2017-04-05T07:32:26.056 [INFO] Using 'UTF-8' encoding to copy filtered resources.
2017-04-05T07:32:26.060 [INFO] Copying 4 resources
2017-04-05T07:32:26.068 [INFO] Copying 3 resources
2017-04-05T07:32:26.131 [INFO] 
2017-04-05T07:32:26.131 [INFO] --- maven-compiler-plugin:3.6.1:compile (default-compile) @
beam-sdks-java-build-tools ---
2017-04-05T07:32:26.135 [INFO] Downloading: https://repo.maven.apache.org/maven2/org/apache/maven/shared/maven-shared-utils/3.1.0/maven-shared-utils-3.1.0.pom
2017-04-05T07:32:26.160 [INFO] Downloaded: https://repo.maven.apache.org/maven2/org/apache/maven/shared/maven-shared-utils/3.1.0/maven-shared-utils-3.1.0.pom
(5 KB at 194.5 KB/sec)
2017-04-05T07:32:26.209 [INFO] Downloading: https://repo.maven.apache.org/maven2/org/apache/maven/shared/maven-shared-incremental/1.1/maven-shared-incremental-1.1.pom
2017-04-05T07:32:26.237 [INFO] Downloaded: https://repo.maven.apache.org/maven2/org/apache/maven/shared/maven-shared-incremental/1.1/maven-shared-incremental-1.1.pom
(5 KB at 165.4 KB/sec)
2017-04-05T07:32:26.240 [INFO] Downloading: https://repo.maven.apache.org/maven2/org/apache/maven/shared/maven-shared-utils/0.1/maven-shared-utils-0.1.pom
2017-04-05T07:32:26.268 [INFO] Downloaded: https://repo.maven.apache.org/maven2/org/apache/maven/shared/maven-shared-utils/0.1/maven-shared-utils-0.1.pom
(4 KB at 141.1 KB/sec)
2017-04-05T07:32:26.271 [INFO] Downloading: https://repo.maven.apache.org/maven2/org/ow2/asm/asm/6.0_ALPHA/asm-6.0_ALPHA.pom
2017-04-05T07:32:26.334 [INFO] Downloaded: https://repo.maven.apache.org/maven2/org/ow2/asm/asm/6.0_ALPHA/asm-6.0_ALPHA.pom
(2 KB at 30.1 KB/sec)
2017-04-05T07:32:26.335 [INFO] Downloading: https://repo.maven.apache.org/maven2/org/ow2/asm/asm-parent/6.0_ALPHA/asm-parent-6.0_ALPHA.pom
2017-04-05T07:32:26.361 [INFO] Downloaded: https://repo.maven.apache.org/maven2/org/ow2/asm/asm-parent/6.0_ALPHA/asm-parent-6.0_ALPHA.pom
(6 KB at 206.5 KB/sec)
2017-04-05T07:32:26.363 [INFO] Downloading: https://repo.maven.apache.org/maven2/com/thoughtworks/qdox/qdox/2.0-M5/qdox-2.0-M5.pom
2017-04-05T07:32:26.389 [INFO] Downloaded: https://repo.maven.apache.org/maven2/com/thoughtworks/qdox/qdox/2.0-M5/qdox-2.0-M5.pom
(16 KB at 585.5 KB/sec)
2017-04-05T07:32:26.392 [INFO] Downloading: https://repo.maven.apache.org/maven2/org/codehaus/plexus/plexus-compiler-api/2.8.1/plexus-compiler-api-2.8.1.pom
2017-04-05T07:32:26.417 [INFO] Downloaded: https://repo.maven.apache.org/maven2/org/codehaus/plexus/plexus-compiler-api/2.8.1/plexus-compiler-api-2.8.1.pom
(893 B at 34.9 KB/sec)
2017-04-05T07:32:26.419 [INFO] Downloading: https://repo.maven.apache.org/maven2/org/codehaus/plexus/plexus-compiler/2.8.1/plexus-compiler-2.8.1.pom
2017-04-05T07:32:26.483 [INFO] Downloaded: https://repo.maven.apache.org/maven2/org/codehaus/plexus/plexus-compiler/2.8.1/plexus-compiler-2.8.1.pom
(5 KB at 77.6 KB/sec)
2017-04-05T07:32:26.485 [INFO] Downloading: https://repo.maven.apache.org/maven2/org/codehaus/plexus/plexus-compiler-manager/2.8.1/plexus-compiler-manager-2.8.1.pom
2017-04-05T07:32:26.510 [INFO] Downloaded: https://repo.maven.apache.org/maven2/org/codehaus/plexus/plexus-compiler-manager/2.8.1/plexus-compiler-manager-2.8.1.pom
(713 B at 27.9 KB/sec)
2017-04-05T07:32:26.513 [INFO] Downloading: https://repo.maven.apache.org/maven2/org/codehaus/plexus/plexus-compiler-javac/2.8.1/plexus-compiler-javac-2.8.1.pom
2017-04-05T07:32:26.538 [INFO] Downloaded: https://repo.maven.apache.org/maven2/org/codehaus/plexus/plexus-compiler-javac/2.8.1/plexus-compiler-javac-2.8.1.pom
(794 B at 31.0 KB/sec)
2017-04-05T07:32:26.540 [INFO] Downloading: https://repo.maven.apache.org/maven2/org/codehaus/plexus/plexus-compilers/2.8.1/plexus-compilers-2.8.1.pom
2017-04-05T07:32:26.566 [INFO] Downloaded: https://repo.maven.apache.org/maven2/org/codehaus/plexus/plexus-compilers/2.8.1/plexus-compilers-2.8.1.pom
(2 KB at 52.0 KB/sec)
2017-04-05T07:32:26.649 [INFO] Downloading: https://repo.maven.apache.org/maven2/org/apache/maven/shared/maven-shared-utils/3.1.0/maven-shared-utils-3.1.0.jar
2017-04-05T07:32:26.687 [INFO] Downloading: https://repo.maven.apache.org/maven2/org/apache/maven/shared/maven-shared-incremental/1.1/maven-shared-incremental-1.1.jar
2017-04-05T07:32:26.688 [INFO] Downloading: https://repo.maven.apache.org/maven2/org/ow2/asm/asm/6.0_ALPHA/asm-6.0_ALPHA.jar
2017-04-05T07:32:26.726 [INFO] Downloading: https://repo.maven.apache.org/maven2/com/thoughtworks/qdox/qdox/2.0-M5/qdox-2.0-M5.jar
2017-04-05T07:32:26.728 [INFO] Downloading: https://repo.maven.apache.org/maven2/org/codehaus/plexus/plexus-compiler-api/2.8.1/plexus-compiler-api-2.8.1.jar
2017-04-05T07:32:26.740 [INFO] Downloaded: https://repo.maven.apache.org/maven2/org/apache/maven/shared/maven-shared-incremental/1.1/maven-shared-incremental-1.1.jar
(14 KB at 103.3 KB/sec)
2017-04-05T07:32:26.740 [INFO] Downloading: https://repo.maven.apache.org/maven2/org/codehaus/plexus/plexus-compiler-manager/2.8.1/plexus-compiler-manager-2.8.1.jar
2017-04-05T07:32:26.743 [INFO] Downloaded: https://repo.maven.apache.org/maven2/org/ow2/asm/asm/6.0_ALPHA/asm-6.0_ALPHA.jar
(55 KB at 425.9 KB/sec)
2017-04-05T07:32:26.743 [INFO] Downloading: https://repo.maven.apache.org/maven2/org/codehaus/plexus/plexus-compiler-javac/2.8.1/plexus-compiler-javac-2.8.1.jar
2017-04-05T07:32:26.754 [INFO] Downloaded: https://repo.maven.apache.org/maven2/org/apache/maven/shared/maven-shared-utils/3.1.0/maven-shared-utils-3.1.0.jar
(160 KB at 1110.1 KB/sec)
2017-04-05T07:32:26.755 [INFO] Downloaded: https://repo.maven.apache.org/maven2/org/codehaus/plexus/plexus-compiler-api/2.8.1/plexus-compiler-api-2.8.1.jar
(26 KB at 383.9 KB/sec)
2017-04-05T07:32:26.797 [INFO] Downloaded: https://repo.maven.apache.org/maven2/org/codehaus/plexus/plexus-compiler-manager/2.8.1/plexus-compiler-manager-2.8.1.jar
(5 KB at 43.2 KB/sec)
2017-04-05T07:32:26.809 [INFO] Downloaded: https://repo.maven.apache.org/maven2/org/codehaus/plexus/plexus-compiler-javac/2.8.1/plexus-compiler-javac-2.8.1.jar
(20 KB at 234.6 KB/sec)
[WARNING] Failed to getClass for org.apache.maven.plugin.compiler.CompilerMojo
[JENKINS] Archiving disabled
[JENKINS] Archiving disabled
[JENKINS] Archiving disabled
[JENKINS] Archiving disabled
[JENKINS] Archiving disabled
[JENKINS] Archiving disabled
[JENKINS] Archiving disabled
[JENKINS] Archiving disabled
[JENKINS] Archiving disabled
[JENKINS] Archiving disabled
[JENKINS] Archiving disabled
[JENKINS] Archiving disabled
[JENKINS] Archiving disabled
[JENKINS] Archiving disabled
[JENKINS] Archiving disabled
[JENKINS] Archiving disabled
2017-04-05T07:32:30.980 [INFO] ------------------------------------------------------------------------
2017-04-05T07:32:30.980 [INFO] Reactor Summary:
2017-04-05T07:32:30.980 [INFO] 
2017-04-05T07:32:30.980 [INFO] Apache Beam :: Parent .............................. SUCCESS
[ 20.511 s]
2017-04-05T07:32:30.980 [INFO] Apache Beam :: SDKs :: Java :: Build Tools ......... FAILURE
[  1.916 s]
2017-04-05T07:32:30.980 [INFO] Apache Beam :: SDKs ................................ SKIPPED
2017-04-05T07:32:30.980 [INFO] Apache Beam :: SDKs :: Common ...................... SKIPPED
2017-04-05T07:32:30.980 [INFO] Apache Beam :: SDKs :: Common :: Fn API ............ SKIPPED
2017-04-05T07:32:30.980 [INFO] Apache Beam :: SDKs :: Common :: Runner API ........ SKIPPED
2017-04-05T07:32:30.980 [INFO] Apache Beam :: SDKs :: Java ........................ SKIPPED
2017-04-05T07:32:30.980 [INFO] Apache Beam :: SDKs :: Java :: Core ................ SKIPPED
2017-04-05T07:32:30.980 [INFO] Apache Beam :: SDKs :: Java :: IO .................. SKIPPED
2017-04-05T07:32:30.980 [INFO] Apache Beam :: Runners ............................. SKIPPED
2017-04-05T07:32:30.980 [INFO] Apache Beam :: Runners :: Core Java Construction ... SKIPPED
2017-04-05T07:32:30.980 [INFO] Apache Beam :: Runners :: Core Java ................ SKIPPED
2017-04-05T07:32:30.980 [INFO] Apache Beam :: Runners :: Direct Java .............. SKIPPED
2017-04-05T07:32:30.980 [INFO] Apache Beam :: SDKs :: Java :: IO :: Kafka ......... SKIPPED
2017-04-05T07:32:30.980 [INFO] Apache Beam :: Runners :: Spark .................... SKIPPED
2017-04-05T07:32:30.980 [INFO] ------------------------------------------------------------------------
2017-04-05T07:32:30.980 [INFO] BUILD FAILURE
2017-04-05T07:32:30.980 [INFO] ------------------------------------------------------------------------
2017-04-05T07:32:30.980 [INFO] Total time: 45.638 s
2017-04-05T07:32:30.980 [INFO] Finished at: 2017-04-05T07:32:30+00:00
2017-04-05T07:32:31.416 [INFO] Final Memory: 52M/545M
2017-04-05T07:32:31.416 [INFO] ------------------------------------------------------------------------
2017-04-05T07:32:31.420 [ERROR] Failed to execute goal org.apache.maven.plugins:maven-compiler-plugin:3.6.1:compile
(default-compile) on project beam-sdks-java-build-tools: Execution default-compile of goal
org.apache.maven.plugins:maven-compiler-plugin:3.6.1:compile failed: Plugin org.apache.maven.plugins:maven-compiler-plugin:3.6.1
or one of its dependencies could not be resolved: Could not transfer artifact com.thoughtworks.qdox:qdox:jar:2.0-M5
from/to central (https://repo.maven.apache.org/maven2): GET request of: com/thoughtworks/qdox/qdox/2.0-M5/qdox-2.0-M5.jar
from central failed: Connection reset -> [Help 1]
org.apache.maven.lifecycle.LifecycleExecutionException: Failed to execute goal org.apache.maven.plugins:maven-compiler-plugin:3.6.1:compile
(default-compile) on project beam-sdks-java-build-tools: Execution default-compile of goal
org.apache.maven.plugins:maven-compiler-plugin:3.6.1:compile failed: Plugin org.apache.maven.plugins:maven-compiler-plugin:3.6.1
or one of its dependencies could not be resolved: Could not transfer artifact com.thoughtworks.qdox:qdox:jar:2.0-M5
from/to central (https://repo.maven.apache.org/maven2): GET request of: com/thoughtworks/qdox/qdox/2.0-M5/qdox-2.0-M5.jar
from central failed
	at org.apache.maven.lifecycle.internal.MojoExecutor.execute(MojoExecutor.java:224)
	at org.apache.maven.lifecycle.internal.MojoExecutor.execute(MojoExecutor.java:153)
	at org.apache.maven.lifecycle.internal.MojoExecutor.execute(MojoExecutor.java:145)
	at org.apache.maven.lifecycle.internal.LifecycleModuleBuilder.buildProject(LifecycleModuleBuilder.java:116)
	at org.apache.maven.lifecycle.internal.LifecycleModuleBuilder.buildProject(LifecycleModuleBuilder.java:80)
	at org.apache.maven.lifecycle.internal.builder.singlethreaded.SingleThreadedBuilder.build(SingleThreadedBuilder.java:51)
	at org.apache.maven.lifecycle.internal.LifecycleStarter.execute(LifecycleStarter.java:128)
	at org.apache.maven.DefaultMaven.doExecute(DefaultMaven.java:307)
	at org.apache.maven.DefaultMaven.doExecute(DefaultMaven.java:193)
	at org.apache.maven.DefaultMaven.execute(DefaultMaven.java:106)
	at org.jvnet.hudson.maven3.launcher.Maven33Launcher.main(Maven33Launcher.java:129)
	at sun.reflect.NativeMethodAccessorImpl.invoke0(Native Method)
	at sun.reflect.NativeMethodAccessorImpl.invoke(NativeMethodAccessorImpl.java:62)
	at sun.reflect.DelegatingMethodAccessorImpl.invoke(DelegatingMethodAccessorImpl.java:43)
	at java.lang.reflect.Method.invoke(Method.java:498)
	at org.codehaus.plexus.classworlds.launcher.Launcher.launchStandard(Launcher.java:330)
	at org.codehaus.plexus.classworlds.launcher.Launcher.launch(Launcher.java:238)
	at jenkins.maven3.agent.Maven33Main.launch(Maven33Main.java:176)
	at sun.reflect.NativeMethodAccessorImpl.invoke0(Native Method)
	at sun.reflect.NativeMethodAccessorImpl.invoke(NativeMethodAccessorImpl.java:62)
	at sun.reflect.DelegatingMethodAccessorImpl.invoke(DelegatingMethodAccessorImpl.java:43)
	at java.lang.reflect.Method.invoke(Method.java:498)
	at hudson.maven.Maven3Builder.call(Maven3Builder.java:139)
	at hudson.maven.Maven3Builder.call(Maven3Builder.java:70)
	at hudson.remoting.UserRequest.perform(UserRequest.java:153)
	at hudson.remoting.UserRequest.perform(UserRequest.java:50)
	at hudson.remoting.Request$2.run(Request.java:336)
	at hudson.remoting.InterceptingExecutorService$1.call(InterceptingExecutorService.java:68)
	at java.util.concurrent.FutureTask.run(FutureTask.java:266)
	at java.util.concurrent.ThreadPoolExecutor.runWorker(ThreadPoolExecutor.java:1142)
	at java.util.concurrent.ThreadPoolExecutor$Worker.run(ThreadPoolExecutor.java:617)
	at java.lang.Thread.run(Thread.java:745)
Caused by: org.apache.maven.plugin.PluginExecutionException: Execution default-compile of
goal org.apache.maven.plugins:maven-compiler-plugin:3.6.1:compile failed: Plugin org.apache.maven.plugins:maven-compiler-plugin:3.6.1
or one of its dependencies could not be resolved: Could not transfer artifact com.thoughtworks.qdox:qdox:jar:2.0-M5
from/to central (https://repo.maven.apache.org/maven2): GET request of: com/thoughtworks/qdox/qdox/2.0-M5/qdox-2.0-M5.jar
from central failed
	at org.apache.maven.plugin.DefaultBuildPluginManager.executeMojo(DefaultBuildPluginManager.java:106)
	at org.apache.maven.lifecycle.internal.MojoExecutor.execute(MojoExecutor.java:208)
	... 31 more
Caused by: org.apache.maven.plugin.PluginResolutionException: Plugin org.apache.maven.plugins:maven-compiler-plugin:3.6.1
or one of its dependencies could not be resolved: Could not transfer artifact com.thoughtworks.qdox:qdox:jar:2.0-M5
from/to central (https://repo.maven.apache.org/maven2): GET request of: com/thoughtworks/qdox/qdox/2.0-M5/qdox-2.0-M5.jar
from central failed
	at org.apache.maven.plugin.internal.DefaultPluginDependenciesResolver.resolveInternal(DefaultPluginDependenciesResolver.java:218)
	at org.apache.maven.plugin.internal.DefaultPluginDependenciesResolver.resolve(DefaultPluginDependenciesResolver.java:149)
	at org.apache.maven.plugin.internal.DefaultMavenPluginManager.createPluginRealm(DefaultMavenPluginManager.java:422)
	at org.apache.maven.plugin.internal.DefaultMavenPluginManager.setupPluginRealm(DefaultMavenPluginManager.java:385)
	at org.apache.maven.plugin.DefaultBuildPluginManager.getPluginRealm(DefaultBuildPluginManager.java:231)
	at org.apache.maven.plugin.DefaultBuildPluginManager.executeMojo(DefaultBuildPluginManager.java:102)
	... 32 more
Caused by: org.eclipse.aether.resolution.ArtifactResolutionException: Could not transfer artifact
com.thoughtworks.qdox:qdox:jar:2.0-M5 from/to central (https://repo.maven.apache.org/maven2):
GET request of: com/thoughtworks/qdox/qdox/2.0-M5/qdox-2.0-M5.jar from central failed
	at org.eclipse.aether.internal.impl.DefaultArtifactResolver.resolve(DefaultArtifactResolver.java:444)
	at org.eclipse.aether.internal.impl.DefaultArtifactResolver.resolveArtifacts(DefaultArtifactResolver.java:246)
	at org.eclipse.aether.internal.impl.DefaultRepositorySystem.resolveDependencies(DefaultRepositorySystem.java:367)
	at org.apache.maven.plugin.internal.DefaultPluginDependenciesResolver.resolveInternal(DefaultPluginDependenciesResolver.java:210)
	... 37 more
Caused by: org.eclipse.aether.transfer.ArtifactTransferException: Could not transfer artifact
com.thoughtworks.qdox:qdox:jar:2.0-M5 from/to central (https://repo.maven.apache.org/maven2):
GET request of: com/thoughtworks/qdox/qdox/2.0-M5/qdox-2.0-M5.jar from central failed
	at org.eclipse.aether.connector.basic.ArtifactTransportListener.transferFailed(ArtifactTransportListener.java:43)
	at org.eclipse.aether.connector.basic.BasicRepositoryConnector$TaskRunner.run(BasicRepositoryConnector.java:355)
	at org.eclipse.aether.util.concurrency.RunnableErrorForwarder$1.run(RunnableErrorForwarder.java:67)
	... 3 more
Caused by: org.apache.maven.wagon.TransferFailedException: GET request of: com/thoughtworks/qdox/qdox/2.0-M5/qdox-2.0-M5.jar
from central failed
	at org.apache.maven.wagon.AbstractWagon.getTransfer(AbstractWagon.java:363)
	at org.apache.maven.wagon.AbstractWagon.getTransfer(AbstractWagon.java:316)
	at org.apache.maven.wagon.AbstractWagon.getTransfer(AbstractWagon.java:285)
	at org.apache.maven.wagon.StreamWagon.getIfNewer(StreamWagon.java:97)
	at org.apache.maven.wagon.StreamWagon.get(StreamWagon.java:61)
	at org.eclipse.aether.transport.wagon.WagonTransporter$GetTaskRunner.run(WagonTransporter.java:560)
	at org.eclipse.aether.transport.wagon.WagonTransporter.execute(WagonTransporter.java:427)
	at org.eclipse.aether.transport.wagon.WagonTransporter.get(WagonTransporter.java:404)
	at org.eclipse.aether.connector.basic.BasicRepositoryConnector$GetTaskRunner.runTask(BasicRepositoryConnector.java:447)
	at org.eclipse.aether.connector.basic.BasicRepositoryConnector$TaskRunner.run(BasicRepositoryConnector.java:350)
	... 4 more
Caused by: java.net.SocketException: Connection reset
	at java.net.SocketInputStream.read(SocketInputStream.java:210)
	at java.net.SocketInputStream.read(SocketInputStream.java:141)
	at sun.security.ssl.InputRecord.readFully(InputRecord.java:465)
	at sun.security.ssl.InputRecord.readV3Record(InputRecord.java:593)
	at sun.security.ssl.InputRecord.read(InputRecord.java:532)
	at sun.security.ssl.SSLSocketImpl.readRecord(SSLSocketImpl.java:973)
	at sun.security.ssl.SSLSocketImpl.readDataRecord(SSLSocketImpl.java:930)
	at sun.security.ssl.AppInputStream.read(AppInputStream.java:105)
	at org.apache.maven.wagon.providers.http.httpclient.impl.io.SessionInputBufferImpl.streamRead(SessionInputBufferImpl.java:136)
	at org.apache.maven.wagon.providers.http.httpclient.impl.io.SessionInputBufferImpl.read(SessionInputBufferImpl.java:195)
	at org.apache.maven.wagon.providers.http.httpclient.impl.io.ContentLengthInputStream.read(ContentLengthInputStream.java:178)
	at org.apache.maven.wagon.providers.http.httpclient.conn.EofSensorInputStream.read(EofSensorInputStream.java:137)
	at org.apache.maven.wagon.AbstractWagon.transfer(AbstractWagon.java:531)
	at org.apache.maven.wagon.AbstractWagon.getTransfer(AbstractWagon.java:353)
	... 13 more
2017-04-05T07:32:31.423 [ERROR] 
2017-04-05T07:32:31.423 [ERROR] Re-run Maven using the -X switch to enable full debug logging.
2017-04-05T07:32:31.423 [ERROR] 
2017-04-05T07:32:31.423 [ERROR] For more information about the errors and possible solutions,
please read the following articles:
2017-04-05T07:32:31.423 [ERROR] [Help 1] http://cwiki.apache.org/confluence/display/MAVEN/PluginResolutionException
2017-04-05T07:32:31.423 [ERROR] 
2017-04-05T07:32:31.423 [ERROR] After correcting the problems, you can resume the build with
the command
2017-04-05T07:32:31.423 [ERROR]   mvn <goals> -rf :beam-sdks-java-build-tools
channel stopped

Mime
View raw message