beam-commits mailing list archives

Site index · List index
Message view « Date » · « Thread »
Top « Date » · « Thread »
From Apache Jenkins Server <jenk...@builds.apache.org>
Subject Build failed in Jenkins: beam_PostCommit_Python_Verify #1774
Date Fri, 07 Apr 2017 15:38:53 GMT
See <https://builds.apache.org/job/beam_PostCommit_Python_Verify/1774/display/redirect>

------------------------------------------
[...truncated 885.09 KB...]
  File "/usr/lib/python2.7/pickle.py", line 419, in save_reduce
    save(state)
  File "/usr/lib/python2.7/pickle.py", line 286, in save
    f(self, obj) # Call unbound method with explicit self
  File "<https://builds.apache.org/job/beam_PostCommit_Python_Verify/ws/sdks/python/apache_beam/internal/pickler.py",>
line 160, in new_save_module_dict
    return old_save_module_dict(pickler, obj)
  File "<https://builds.apache.org/job/beam_PostCommit_Python_Verify/ws/sdks/python/local/lib/python2.7/site-packages/dill/dill.py",>
line 841, in save_module_dict
    StockPickler.save_dict(pickler, obj)
  File "/usr/lib/python2.7/pickle.py", line 649, in save_dict
    self._batch_setitems(obj.iteritems())
  File "/usr/lib/python2.7/pickle.py", line 681, in _batch_setitems
    save(v)
  File "/usr/lib/python2.7/pickle.py", line 331, in save
    self.save_reduce(obj=obj, *rv)
  File "/usr/lib/python2.7/pickle.py", line 419, in save_reduce
    save(state)
  File "/usr/lib/python2.7/pickle.py", line 286, in save
    f(self, obj) # Call unbound method with explicit self
  File "/usr/lib/python2.7/pickle.py", line 548, in save_tuple
    save(element)
  File "/usr/lib/python2.7/pickle.py", line 286, in save
    f(self, obj) # Call unbound method with explicit self
  File "<https://builds.apache.org/job/beam_PostCommit_Python_Verify/ws/sdks/python/apache_beam/internal/pickler.py",>
line 160, in new_save_module_dict
    return old_save_module_dict(pickler, obj)
  File "<https://builds.apache.org/job/beam_PostCommit_Python_Verify/ws/sdks/python/local/lib/python2.7/site-packages/dill/dill.py",>
line 841, in save_module_dict
    StockPickler.save_dict(pickler, obj)
  File "/usr/lib/python2.7/pickle.py", line 649, in save_dict
    self._batch_setitems(obj.iteritems())
  File "/usr/lib/python2.7/pickle.py", line 669, in _batch_setitems
    tmp = []
  File "<https://builds.apache.org/job/beam_PostCommit_Python_Verify/ws/sdks/python/nose-1.3.7-py2.7.egg/nose/plugins/multiprocess.py",>
line 276, in signalhandler
    raise TimedOutException()
TimedOutException: 'test_empty_singleton_side_input (apache_beam.transforms.sideinputs_test.SideInputsTest)'

======================================================================
ERROR: test_flattened_side_input (apache_beam.transforms.sideinputs_test.SideInputsTest)
----------------------------------------------------------------------
Traceback (most recent call last):
  File "<https://builds.apache.org/job/beam_PostCommit_Python_Verify/ws/sdks/python/nose-1.3.7-py2.7.egg/nose/plugins/multiprocess.py",>
line 812, in run
    test(orig)
  File "<https://builds.apache.org/job/beam_PostCommit_Python_Verify/ws/sdks/python/nose-1.3.7-py2.7.egg/nose/case.py",>
line 45, in __call__
    return self.run(*arg, **kwarg)
  File "<https://builds.apache.org/job/beam_PostCommit_Python_Verify/ws/sdks/python/nose-1.3.7-py2.7.egg/nose/case.py",>
line 133, in run
    self.runTest(result)
  File "<https://builds.apache.org/job/beam_PostCommit_Python_Verify/ws/sdks/python/nose-1.3.7-py2.7.egg/nose/case.py",>
line 151, in runTest
    test(result)
  File "/usr/lib/python2.7/unittest/case.py", line 395, in __call__
    return self.run(*args, **kwds)
  File "/usr/lib/python2.7/unittest/case.py", line 331, in run
    testMethod()
  File "<https://builds.apache.org/job/beam_PostCommit_Python_Verify/ws/sdks/python/apache_beam/transforms/sideinputs_test.py",>
line 307, in test_flattened_side_input
    pipeline.run()
  File "<https://builds.apache.org/job/beam_PostCommit_Python_Verify/ws/sdks/python/apache_beam/test_pipeline.py",>
line 91, in run
    result = super(TestPipeline, self).run()
  File "<https://builds.apache.org/job/beam_PostCommit_Python_Verify/ws/sdks/python/apache_beam/pipeline.py",>
line 158, in run
    if test_runner_api and self._verify_runner_api_compatible():
  File "<https://builds.apache.org/job/beam_PostCommit_Python_Verify/ws/sdks/python/apache_beam/pipeline.py",>
line 326, in _verify_runner_api_compatible
    self.visit(Visitor())
  File "<https://builds.apache.org/job/beam_PostCommit_Python_Verify/ws/sdks/python/apache_beam/pipeline.py",>
line 192, in visit
    self._root_transform().visit(visitor, self, visited)
  File "<https://builds.apache.org/job/beam_PostCommit_Python_Verify/ws/sdks/python/apache_beam/pipeline.py",>
line 482, in visit
    part.visit(visitor, pipeline, visited)
  File "<https://builds.apache.org/job/beam_PostCommit_Python_Verify/ws/sdks/python/apache_beam/pipeline.py",>
line 485, in visit
    visitor.visit_transform(self)
  File "<https://builds.apache.org/job/beam_PostCommit_Python_Verify/ws/sdks/python/apache_beam/pipeline.py",>
line 318, in visit_transform
    pickler.loads(pickler.dumps(transform_node.transform))
  File "<https://builds.apache.org/job/beam_PostCommit_Python_Verify/ws/sdks/python/apache_beam/internal/pickler.py",>
line 186, in dumps
    s = dill.dumps(o)
  File "<https://builds.apache.org/job/beam_PostCommit_Python_Verify/ws/sdks/python/local/lib/python2.7/site-packages/dill/dill.py",>
line 259, in dumps
    dump(obj, file, protocol, byref, fmode, recurse)#, strictio)
  File "<https://builds.apache.org/job/beam_PostCommit_Python_Verify/ws/sdks/python/local/lib/python2.7/site-packages/dill/dill.py",>
line 252, in dump
    pik.dump(obj)
  File "/usr/lib/python2.7/pickle.py", line 224, in dump
    self.save(obj)
  File "/usr/lib/python2.7/pickle.py", line 331, in save
    self.save_reduce(obj=obj, *rv)
  File "/usr/lib/python2.7/pickle.py", line 419, in save_reduce
    save(state)
  File "/usr/lib/python2.7/pickle.py", line 286, in save
    f(self, obj) # Call unbound method with explicit self
  File "<https://builds.apache.org/job/beam_PostCommit_Python_Verify/ws/sdks/python/apache_beam/internal/pickler.py",>
line 160, in new_save_module_dict
    return old_save_module_dict(pickler, obj)
  File "<https://builds.apache.org/job/beam_PostCommit_Python_Verify/ws/sdks/python/local/lib/python2.7/site-packages/dill/dill.py",>
line 841, in save_module_dict
    StockPickler.save_dict(pickler, obj)
  File "/usr/lib/python2.7/pickle.py", line 649, in save_dict
    self._batch_setitems(obj.iteritems())
  File "/usr/lib/python2.7/pickle.py", line 681, in _batch_setitems
    save(v)
  File "/usr/lib/python2.7/pickle.py", line 331, in save
    self.save_reduce(obj=obj, *rv)
  File "/usr/lib/python2.7/pickle.py", line 419, in save_reduce
    save(state)
  File "/usr/lib/python2.7/pickle.py", line 286, in save
    f(self, obj) # Call unbound method with explicit self
  File "<https://builds.apache.org/job/beam_PostCommit_Python_Verify/ws/sdks/python/apache_beam/internal/pickler.py",>
line 160, in new_save_module_dict
    return old_save_module_dict(pickler, obj)
  File "<https://builds.apache.org/job/beam_PostCommit_Python_Verify/ws/sdks/python/local/lib/python2.7/site-packages/dill/dill.py",>
line 841, in save_module_dict
    StockPickler.save_dict(pickler, obj)
  File "/usr/lib/python2.7/pickle.py", line 649, in save_dict
    self._batch_setitems(obj.iteritems())
  File "/usr/lib/python2.7/pickle.py", line 681, in _batch_setitems
    save(v)
  File "/usr/lib/python2.7/pickle.py", line 286, in save
    f(self, obj) # Call unbound method with explicit self
  File "/usr/lib/python2.7/pickle.py", line 600, in save_list
    self._batch_appends(iter(obj))
  File "/usr/lib/python2.7/pickle.py", line 636, in _batch_appends
    save(tmp[0])
  File "/usr/lib/python2.7/pickle.py", line 331, in save
    self.save_reduce(obj=obj, *rv)
  File "/usr/lib/python2.7/pickle.py", line 419, in save_reduce
    save(state)
  File "/usr/lib/python2.7/pickle.py", line 286, in save
    f(self, obj) # Call unbound method with explicit self
  File "<https://builds.apache.org/job/beam_PostCommit_Python_Verify/ws/sdks/python/apache_beam/internal/pickler.py",>
line 160, in new_save_module_dict
    return old_save_module_dict(pickler, obj)
  File "<https://builds.apache.org/job/beam_PostCommit_Python_Verify/ws/sdks/python/local/lib/python2.7/site-packages/dill/dill.py",>
line 841, in save_module_dict
    StockPickler.save_dict(pickler, obj)
  File "/usr/lib/python2.7/pickle.py", line 649, in save_dict
    self._batch_setitems(obj.iteritems())
  File "/usr/lib/python2.7/pickle.py", line 681, in _batch_setitems
    save(v)
  File "/usr/lib/python2.7/pickle.py", line 286, in save
    f(self, obj) # Call unbound method with explicit self
  File "/usr/lib/python2.7/pickle.py", line 600, in save_list
    self._batch_appends(iter(obj))
  File "/usr/lib/python2.7/pickle.py", line 633, in _batch_appends
    save(x)
  File "/usr/lib/python2.7/pickle.py", line 331, in save
    self.save_reduce(obj=obj, *rv)
  File "/usr/lib/python2.7/pickle.py", line 419, in save_reduce
    save(state)
  File "/usr/lib/python2.7/pickle.py", line 286, in save
    f(self, obj) # Call unbound method with explicit self
  File "<https://builds.apache.org/job/beam_PostCommit_Python_Verify/ws/sdks/python/apache_beam/internal/pickler.py",>
line 160, in new_save_module_dict
    return old_save_module_dict(pickler, obj)
  File "<https://builds.apache.org/job/beam_PostCommit_Python_Verify/ws/sdks/python/local/lib/python2.7/site-packages/dill/dill.py",>
line 841, in save_module_dict
    StockPickler.save_dict(pickler, obj)
  File "/usr/lib/python2.7/pickle.py", line 649, in save_dict
    self._batch_setitems(obj.iteritems())
  File "/usr/lib/python2.7/pickle.py", line 681, in _batch_setitems
    save(v)
  File "/usr/lib/python2.7/pickle.py", line 286, in save
    f(self, obj) # Call unbound method with explicit self
  File "/usr/lib/python2.7/pickle.py", line 600, in save_list
    self._batch_appends(iter(obj))
  File "/usr/lib/python2.7/pickle.py", line 633, in _batch_appends
    save(x)
  File "/usr/lib/python2.7/pickle.py", line 331, in save
    self.save_reduce(obj=obj, *rv)
  File "/usr/lib/python2.7/pickle.py", line 419, in save_reduce
    save(state)
  File "/usr/lib/python2.7/pickle.py", line 286, in save
    f(self, obj) # Call unbound method with explicit self
  File "<https://builds.apache.org/job/beam_PostCommit_Python_Verify/ws/sdks/python/apache_beam/internal/pickler.py",>
line 160, in new_save_module_dict
    return old_save_module_dict(pickler, obj)
  File "<https://builds.apache.org/job/beam_PostCommit_Python_Verify/ws/sdks/python/local/lib/python2.7/site-packages/dill/dill.py",>
line 841, in save_module_dict
    StockPickler.save_dict(pickler, obj)
  File "/usr/lib/python2.7/pickle.py", line 649, in save_dict
    self._batch_setitems(obj.iteritems())
  File "/usr/lib/python2.7/pickle.py", line 681, in _batch_setitems
    save(v)
  File "/usr/lib/python2.7/pickle.py", line 286, in save
    f(self, obj) # Call unbound method with explicit self
  File "/usr/lib/python2.7/pickle.py", line 600, in save_list
    self._batch_appends(iter(obj))
  File "/usr/lib/python2.7/pickle.py", line 633, in _batch_appends
    save(x)
  File "/usr/lib/python2.7/pickle.py", line 331, in save
    self.save_reduce(obj=obj, *rv)
  File "/usr/lib/python2.7/pickle.py", line 419, in save_reduce
    save(state)
  File "/usr/lib/python2.7/pickle.py", line 286, in save
    f(self, obj) # Call unbound method with explicit self
  File "<https://builds.apache.org/job/beam_PostCommit_Python_Verify/ws/sdks/python/apache_beam/internal/pickler.py",>
line 160, in new_save_module_dict
    return old_save_module_dict(pickler, obj)
  File "<https://builds.apache.org/job/beam_PostCommit_Python_Verify/ws/sdks/python/local/lib/python2.7/site-packages/dill/dill.py",>
line 841, in save_module_dict
    StockPickler.save_dict(pickler, obj)
  File "/usr/lib/python2.7/pickle.py", line 649, in save_dict
    self._batch_setitems(obj.iteritems())
  File "/usr/lib/python2.7/pickle.py", line 681, in _batch_setitems
    save(v)
  File "/usr/lib/python2.7/pickle.py", line 331, in save
    self.save_reduce(obj=obj, *rv)
  File "/usr/lib/python2.7/pickle.py", line 419, in save_reduce
    save(state)
  File "/usr/lib/python2.7/pickle.py", line 286, in save
    f(self, obj) # Call unbound method with explicit self
  File "<https://builds.apache.org/job/beam_PostCommit_Python_Verify/ws/sdks/python/apache_beam/internal/pickler.py",>
line 160, in new_save_module_dict
    return old_save_module_dict(pickler, obj)
  File "<https://builds.apache.org/job/beam_PostCommit_Python_Verify/ws/sdks/python/local/lib/python2.7/site-packages/dill/dill.py",>
line 841, in save_module_dict
    StockPickler.save_dict(pickler, obj)
  File "/usr/lib/python2.7/pickle.py", line 649, in save_dict
    self._batch_setitems(obj.iteritems())
  File "/usr/lib/python2.7/pickle.py", line 680, in _batch_setitems
    save(k)
  File "/usr/lib/python2.7/pickle.py", line 279, in save
    self.write(self.get(x[0]))
  File "/usr/lib/python2.7/pickle.py", line 263, in get
    return BINGET + chr(i)
  File "<https://builds.apache.org/job/beam_PostCommit_Python_Verify/ws/sdks/python/nose-1.3.7-py2.7.egg/nose/plugins/multiprocess.py",>
line 276, in signalhandler
    raise TimedOutException()
TimedOutException: 'test_flattened_side_input (apache_beam.transforms.sideinputs_test.SideInputsTest)'

======================================================================
ERROR: test_iterable_side_input (apache_beam.transforms.sideinputs_test.SideInputsTest)
----------------------------------------------------------------------
Traceback (most recent call last):
  File "<https://builds.apache.org/job/beam_PostCommit_Python_Verify/ws/sdks/python/nose-1.3.7-py2.7.egg/nose/plugins/multiprocess.py",>
line 812, in run
    test(orig)
  File "<https://builds.apache.org/job/beam_PostCommit_Python_Verify/ws/sdks/python/nose-1.3.7-py2.7.egg/nose/case.py",>
line 45, in __call__
    return self.run(*arg, **kwarg)
  File "<https://builds.apache.org/job/beam_PostCommit_Python_Verify/ws/sdks/python/nose-1.3.7-py2.7.egg/nose/case.py",>
line 133, in run
    self.runTest(result)
  File "<https://builds.apache.org/job/beam_PostCommit_Python_Verify/ws/sdks/python/nose-1.3.7-py2.7.egg/nose/case.py",>
line 151, in runTest
    test(result)
  File "/usr/lib/python2.7/unittest/case.py", line 395, in __call__
    return self.run(*args, **kwds)
  File "/usr/lib/python2.7/unittest/case.py", line 331, in run
    testMethod()
  File "<https://builds.apache.org/job/beam_PostCommit_Python_Verify/ws/sdks/python/apache_beam/transforms/sideinputs_test.py",>
line 179, in test_iterable_side_input
    pipeline.run()
  File "<https://builds.apache.org/job/beam_PostCommit_Python_Verify/ws/sdks/python/apache_beam/test_pipeline.py",>
line 91, in run
    result = super(TestPipeline, self).run()
  File "<https://builds.apache.org/job/beam_PostCommit_Python_Verify/ws/sdks/python/apache_beam/pipeline.py",>
line 158, in run
    if test_runner_api and self._verify_runner_api_compatible():
  File "<https://builds.apache.org/job/beam_PostCommit_Python_Verify/ws/sdks/python/apache_beam/pipeline.py",>
line 326, in _verify_runner_api_compatible
    self.visit(Visitor())
  File "<https://builds.apache.org/job/beam_PostCommit_Python_Verify/ws/sdks/python/apache_beam/pipeline.py",>
line 192, in visit
    self._root_transform().visit(visitor, self, visited)
  File "<https://builds.apache.org/job/beam_PostCommit_Python_Verify/ws/sdks/python/apache_beam/pipeline.py",>
line 482, in visit
    part.visit(visitor, pipeline, visited)
  File "<https://builds.apache.org/job/beam_PostCommit_Python_Verify/ws/sdks/python/apache_beam/pipeline.py",>
line 485, in visit
    visitor.visit_transform(self)
  File "<https://builds.apache.org/job/beam_PostCommit_Python_Verify/ws/sdks/python/apache_beam/pipeline.py",>
line 318, in visit_transform
    pickler.loads(pickler.dumps(transform_node.transform))
  File "<https://builds.apache.org/job/beam_PostCommit_Python_Verify/ws/sdks/python/apache_beam/internal/pickler.py",>
line 203, in loads
    c = base64.b64decode(encoded)
  File "/usr/lib/python2.7/base64.py", line 73, in b64decode
    return binascii.a2b_base64(s)
  File "<https://builds.apache.org/job/beam_PostCommit_Python_Verify/ws/sdks/python/nose-1.3.7-py2.7.egg/nose/plugins/multiprocess.py",>
line 276, in signalhandler
    raise TimedOutException()
TimedOutException: 'test_iterable_side_input (apache_beam.transforms.sideinputs_test.SideInputsTest)'

----------------------------------------------------------------------
Ran 13 tests in 888.956s

FAILED (errors=7)
Build step 'Execute shell' marked build as failure

Mime
View raw message