beam-commits mailing list archives

Site index · List index
Message view « Date » · « Thread »
Top « Date » · « Thread »
From Apache Jenkins Server <jenk...@builds.apache.org>
Subject Build failed in Jenkins: beam_PostCommit_Python_Verify #1967
Date Mon, 24 Apr 2017 16:54:51 GMT
See <https://builds.apache.org/job/beam_PostCommit_Python_Verify/1967/display/redirect?page=changes>

Changes:

[lcwik] Update pom.xml

------------------------------------------
[...truncated 713.12 KB...]
  File was already downloaded /tmp/dataflow-requirements-cache/setuptools-35.0.1.zip
Collecting six (from pyhamcrest->-r postcommit_requirements.txt (line 1))
  File was already downloaded /tmp/dataflow-requirements-cache/six-1.10.0.tar.gz
test_par_do_with_multiple_outputs_and_using_yield (apache_beam.transforms.ptransform_test.PTransformTest)
... ok
<https://builds.apache.org/job/beam_PostCommit_Python_Verify/ws/sdks/python/apache_beam/coders/typecoders.py>:132:
UserWarning: Using fallback coder for typehint: List[Any].
  warnings.warn('Using fallback coder for typehint: %r.' % typehint)
<https://builds.apache.org/job/beam_PostCommit_Python_Verify/ws/sdks/python/apache_beam/coders/typecoders.py>:132:
UserWarning: Using fallback coder for typehint: Union[].
  warnings.warn('Using fallback coder for typehint: %r.' % typehint)
Collecting funcsigs>=1 (from mock->-r postcommit_requirements.txt (line 2))
  File was already downloaded /tmp/dataflow-requirements-cache/funcsigs-1.0.2.tar.gz
Collecting pbr>=0.11 (from mock->-r postcommit_requirements.txt (line 2))
  File was already downloaded /tmp/dataflow-requirements-cache/pbr-3.0.0.tar.gz
Collecting packaging>=16.8 (from setuptools->pyhamcrest->-r postcommit_requirements.txt
(line 1))
  File was already downloaded /tmp/dataflow-requirements-cache/packaging-16.8.tar.gz
Collecting appdirs>=1.4.0 (from setuptools->pyhamcrest->-r postcommit_requirements.txt
(line 1))
  File was already downloaded /tmp/dataflow-requirements-cache/appdirs-1.4.3.tar.gz
Collecting pyparsing (from packaging>=16.8->setuptools->pyhamcrest->-r postcommit_requirements.txt
(line 1))
  File was already downloaded /tmp/dataflow-requirements-cache/pyparsing-2.2.0.tar.gz
DEPRECATION: pip install --download has been deprecated and will be removed in the future.
Pip now has a download command that should be used instead.
Successfully downloaded pyhamcrest mock setuptools six funcsigs pbr packaging appdirs pyparsing
Collecting pyhamcrest (from -r postcommit_requirements.txt (line 1))
  File was already downloaded /tmp/dataflow-requirements-cache/PyHamcrest-1.9.0.tar.gz
Collecting mock (from -r postcommit_requirements.txt (line 2))
  File was already downloaded /tmp/dataflow-requirements-cache/mock-2.0.0.tar.gz
Collecting setuptools (from pyhamcrest->-r postcommit_requirements.txt (line 1))
  File was already downloaded /tmp/dataflow-requirements-cache/setuptools-35.0.1.zip
Collecting six (from pyhamcrest->-r postcommit_requirements.txt (line 1))
  File was already downloaded /tmp/dataflow-requirements-cache/six-1.10.0.tar.gz
Collecting funcsigs>=1 (from mock->-r postcommit_requirements.txt (line 2))
  File was already downloaded /tmp/dataflow-requirements-cache/funcsigs-1.0.2.tar.gz
Collecting pbr>=0.11 (from mock->-r postcommit_requirements.txt (line 2))
  File was already downloaded /tmp/dataflow-requirements-cache/pbr-3.0.0.tar.gz
Collecting packaging>=16.8 (from setuptools->pyhamcrest->-r postcommit_requirements.txt
(line 1))
  File was already downloaded /tmp/dataflow-requirements-cache/packaging-16.8.tar.gz
Collecting appdirs>=1.4.0 (from setuptools->pyhamcrest->-r postcommit_requirements.txt
(line 1))
  File was already downloaded /tmp/dataflow-requirements-cache/appdirs-1.4.3.tar.gz
Collecting pyparsing (from packaging>=16.8->setuptools->pyhamcrest->-r postcommit_requirements.txt
(line 1))
  File was already downloaded /tmp/dataflow-requirements-cache/pyparsing-2.2.0.tar.gz
Successfully downloaded pyhamcrest mock setuptools six funcsigs pbr packaging appdirs pyparsing
test_undeclared_outputs (apache_beam.transforms.ptransform_test.PTransformTest) ... ok
<https://builds.apache.org/job/beam_PostCommit_Python_Verify/ws/sdks/python/apache_beam/coders/typecoders.py>:132:
UserWarning: Using fallback coder for typehint: List[Any].
  warnings.warn('Using fallback coder for typehint: %r.' % typehint)
<https://builds.apache.org/job/beam_PostCommit_Python_Verify/ws/sdks/python/apache_beam/coders/typecoders.py>:132:
UserWarning: Using fallback coder for typehint: Union[].
  warnings.warn('Using fallback coder for typehint: %r.' % typehint)
DEPRECATION: pip install --download has been deprecated and will be removed in the future.
Pip now has a download command that should be used instead.
Collecting pyhamcrest (from -r postcommit_requirements.txt (line 1))
  File was already downloaded /tmp/dataflow-requirements-cache/PyHamcrest-1.9.0.tar.gz
Collecting mock (from -r postcommit_requirements.txt (line 2))
  File was already downloaded /tmp/dataflow-requirements-cache/mock-2.0.0.tar.gz
Collecting setuptools (from pyhamcrest->-r postcommit_requirements.txt (line 1))
  File was already downloaded /tmp/dataflow-requirements-cache/setuptools-35.0.1.zip
Collecting six (from pyhamcrest->-r postcommit_requirements.txt (line 1))
  File was already downloaded /tmp/dataflow-requirements-cache/six-1.10.0.tar.gz
Collecting funcsigs>=1 (from mock->-r postcommit_requirements.txt (line 2))
  File was already downloaded /tmp/dataflow-requirements-cache/funcsigs-1.0.2.tar.gz
Collecting pbr>=0.11 (from mock->-r postcommit_requirements.txt (line 2))
  File was already downloaded /tmp/dataflow-requirements-cache/pbr-3.0.0.tar.gz
test_as_dict_twice (apache_beam.transforms.sideinputs_test.SideInputsTest) ... ok
Collecting packaging>=16.8 (from setuptools->pyhamcrest->-r postcommit_requirements.txt
(line 1))
  File was already downloaded /tmp/dataflow-requirements-cache/packaging-16.8.tar.gz
Collecting appdirs>=1.4.0 (from setuptools->pyhamcrest->-r postcommit_requirements.txt
(line 1))
  File was already downloaded /tmp/dataflow-requirements-cache/appdirs-1.4.3.tar.gz
Collecting pyparsing (from packaging>=16.8->setuptools->pyhamcrest->-r postcommit_requirements.txt
(line 1))
  File was already downloaded /tmp/dataflow-requirements-cache/pyparsing-2.2.0.tar.gz
DEPRECATION: pip install --download has been deprecated and will be removed in the future.
Pip now has a download command that should be used instead.
Collecting pyhamcrest (from -r postcommit_requirements.txt (line 1))
  File was already downloaded /tmp/dataflow-requirements-cache/PyHamcrest-1.9.0.tar.gz
Successfully downloaded pyhamcrest mock setuptools six funcsigs pbr packaging appdirs pyparsing
Collecting mock (from -r postcommit_requirements.txt (line 2))
  File was already downloaded /tmp/dataflow-requirements-cache/mock-2.0.0.tar.gz
Collecting setuptools (from pyhamcrest->-r postcommit_requirements.txt (line 1))
  File was already downloaded /tmp/dataflow-requirements-cache/setuptools-35.0.1.zip
Collecting six (from pyhamcrest->-r postcommit_requirements.txt (line 1))
  File was already downloaded /tmp/dataflow-requirements-cache/six-1.10.0.tar.gz
Collecting funcsigs>=1 (from mock->-r postcommit_requirements.txt (line 2))
  File was already downloaded /tmp/dataflow-requirements-cache/funcsigs-1.0.2.tar.gz
Collecting pbr>=0.11 (from mock->-r postcommit_requirements.txt (line 2))
  File was already downloaded /tmp/dataflow-requirements-cache/pbr-3.0.0.tar.gz
Collecting packaging>=16.8 (from setuptools->pyhamcrest->-r postcommit_requirements.txt
(line 1))
  File was already downloaded /tmp/dataflow-requirements-cache/packaging-16.8.tar.gz
Collecting appdirs>=1.4.0 (from setuptools->pyhamcrest->-r postcommit_requirements.txt
(line 1))
  File was already downloaded /tmp/dataflow-requirements-cache/appdirs-1.4.3.tar.gz
Collecting pyparsing (from packaging>=16.8->setuptools->pyhamcrest->-r postcommit_requirements.txt
(line 1))
  File was already downloaded /tmp/dataflow-requirements-cache/pyparsing-2.2.0.tar.gz
Successfully downloaded pyhamcrest mock setuptools six funcsigs pbr packaging appdirs pyparsing
test_as_list_and_as_dict_side_inputs (apache_beam.transforms.sideinputs_test.SideInputsTest)
... ok
DEPRECATION: pip install --download has been deprecated and will be removed in the future.
Pip now has a download command that should be used instead.
Collecting pyhamcrest (from -r postcommit_requirements.txt (line 1))
  File was already downloaded /tmp/dataflow-requirements-cache/PyHamcrest-1.9.0.tar.gz
Collecting mock (from -r postcommit_requirements.txt (line 2))
  File was already downloaded /tmp/dataflow-requirements-cache/mock-2.0.0.tar.gz
Collecting setuptools (from pyhamcrest->-r postcommit_requirements.txt (line 1))
  File was already downloaded /tmp/dataflow-requirements-cache/setuptools-35.0.1.zip
Collecting six (from pyhamcrest->-r postcommit_requirements.txt (line 1))
  File was already downloaded /tmp/dataflow-requirements-cache/six-1.10.0.tar.gz
Collecting funcsigs>=1 (from mock->-r postcommit_requirements.txt (line 2))
  File was already downloaded /tmp/dataflow-requirements-cache/funcsigs-1.0.2.tar.gz
Collecting pbr>=0.11 (from mock->-r postcommit_requirements.txt (line 2))
  File was already downloaded /tmp/dataflow-requirements-cache/pbr-3.0.0.tar.gz
Collecting packaging>=16.8 (from setuptools->pyhamcrest->-r postcommit_requirements.txt
(line 1))
  File was already downloaded /tmp/dataflow-requirements-cache/packaging-16.8.tar.gz
Collecting appdirs>=1.4.0 (from setuptools->pyhamcrest->-r postcommit_requirements.txt
(line 1))
  File was already downloaded /tmp/dataflow-requirements-cache/appdirs-1.4.3.tar.gz
Collecting pyparsing (from packaging>=16.8->setuptools->pyhamcrest->-r postcommit_requirements.txt
(line 1))
  File was already downloaded /tmp/dataflow-requirements-cache/pyparsing-2.2.0.tar.gz
Successfully downloaded pyhamcrest mock setuptools six funcsigs pbr packaging appdirs pyparsing
test_as_list_twice (apache_beam.transforms.sideinputs_test.SideInputsTest) ... ok
DEPRECATION: pip install --download has been deprecated and will be removed in the future.
Pip now has a download command that should be used instead.
Collecting pyhamcrest (from -r postcommit_requirements.txt (line 1))
  File was already downloaded /tmp/dataflow-requirements-cache/PyHamcrest-1.9.0.tar.gz
Collecting mock (from -r postcommit_requirements.txt (line 2))
  File was already downloaded /tmp/dataflow-requirements-cache/mock-2.0.0.tar.gz
Collecting setuptools (from pyhamcrest->-r postcommit_requirements.txt (line 1))
  File was already downloaded /tmp/dataflow-requirements-cache/setuptools-35.0.1.zip
Collecting six (from pyhamcrest->-r postcommit_requirements.txt (line 1))
  File was already downloaded /tmp/dataflow-requirements-cache/six-1.10.0.tar.gz
Collecting funcsigs>=1 (from mock->-r postcommit_requirements.txt (line 2))
  File was already downloaded /tmp/dataflow-requirements-cache/funcsigs-1.0.2.tar.gz
Collecting pbr>=0.11 (from mock->-r postcommit_requirements.txt (line 2))
  File was already downloaded /tmp/dataflow-requirements-cache/pbr-3.0.0.tar.gz
Collecting packaging>=16.8 (from setuptools->pyhamcrest->-r postcommit_requirements.txt
(line 1))
  File was already downloaded /tmp/dataflow-requirements-cache/packaging-16.8.tar.gz
Collecting appdirs>=1.4.0 (from setuptools->pyhamcrest->-r postcommit_requirements.txt
(line 1))
  File was already downloaded /tmp/dataflow-requirements-cache/appdirs-1.4.3.tar.gz
Collecting pyparsing (from packaging>=16.8->setuptools->pyhamcrest->-r postcommit_requirements.txt
(line 1))
  File was already downloaded /tmp/dataflow-requirements-cache/pyparsing-2.2.0.tar.gz
Successfully downloaded pyhamcrest mock setuptools six funcsigs pbr packaging appdirs pyparsing
test_as_singleton_without_unique_labels (apache_beam.transforms.sideinputs_test.SideInputsTest)
... ok
DEPRECATION: pip install --download has been deprecated and will be removed in the future.
Pip now has a download command that should be used instead.
Collecting pyhamcrest (from -r postcommit_requirements.txt (line 1))
<https://builds.apache.org/job/beam_PostCommit_Python_Verify/ws/sdks/python/local/lib/python2.7/site-packages/pip/_vendor/requests/packages/urllib3/util/ssl_.py>:318:
SNIMissingWarning: An HTTPS request has been made, but the SNI (Subject Name Indication) extension
to TLS is not available on this platform. This may cause the server to present an incorrect
TLS certificate, which can cause validation failures. You can upgrade to a newer version of
Python to solve this. For more information, see https://urllib3.readthedocs.io/en/latest/security.html#snimissingwarning.
  SNIMissingWarning
<https://builds.apache.org/job/beam_PostCommit_Python_Verify/ws/sdks/python/local/lib/python2.7/site-packages/pip/_vendor/requests/packages/urllib3/util/ssl_.py>:122:
InsecurePlatformWarning: A true SSLContext object is not available. This prevents urllib3
from configuring SSL appropriately and may cause certain SSL connections to fail. You can
upgrade to a newer version of Python to solve this. For more information, see https://urllib3.readthedocs.io/en/latest/security.html#insecureplatformwarning.
  InsecurePlatformWarning
  File was already downloaded /tmp/dataflow-requirements-cache/PyHamcrest-1.9.0.tar.gz
Collecting mock (from -r postcommit_requirements.txt (line 2))
  File was already downloaded /tmp/dataflow-requirements-cache/mock-2.0.0.tar.gz
Collecting setuptools (from pyhamcrest->-r postcommit_requirements.txt (line 1))
  File was already downloaded /tmp/dataflow-requirements-cache/setuptools-35.0.1.zip
Collecting six (from pyhamcrest->-r postcommit_requirements.txt (line 1))
  File was already downloaded /tmp/dataflow-requirements-cache/six-1.10.0.tar.gz
Collecting funcsigs>=1 (from mock->-r postcommit_requirements.txt (line 2))
  File was already downloaded /tmp/dataflow-requirements-cache/funcsigs-1.0.2.tar.gz
Collecting pbr>=0.11 (from mock->-r postcommit_requirements.txt (line 2))
  File was already downloaded /tmp/dataflow-requirements-cache/pbr-3.0.0.tar.gz
Collecting packaging>=16.8 (from setuptools->pyhamcrest->-r postcommit_requirements.txt
(line 1))
  File was already downloaded /tmp/dataflow-requirements-cache/packaging-16.8.tar.gz
Collecting appdirs>=1.4.0 (from setuptools->pyhamcrest->-r postcommit_requirements.txt
(line 1))
  File was already downloaded /tmp/dataflow-requirements-cache/appdirs-1.4.3.tar.gz
Collecting pyparsing (from packaging>=16.8->setuptools->pyhamcrest->-r postcommit_requirements.txt
(line 1))
  File was already downloaded /tmp/dataflow-requirements-cache/pyparsing-2.2.0.tar.gz
Successfully downloaded pyhamcrest mock setuptools six funcsigs pbr packaging appdirs pyparsing
test_as_singleton_with_different_defaults (apache_beam.transforms.sideinputs_test.SideInputsTest)
... ok
DEPRECATION: pip install --download has been deprecated and will be removed in the future.
Pip now has a download command that should be used instead.
Collecting pyhamcrest (from -r postcommit_requirements.txt (line 1))
  File was already downloaded /tmp/dataflow-requirements-cache/PyHamcrest-1.9.0.tar.gz
Collecting mock (from -r postcommit_requirements.txt (line 2))
  File was already downloaded /tmp/dataflow-requirements-cache/mock-2.0.0.tar.gz
Collecting setuptools (from pyhamcrest->-r postcommit_requirements.txt (line 1))
  File was already downloaded /tmp/dataflow-requirements-cache/setuptools-35.0.1.zip
Collecting six (from pyhamcrest->-r postcommit_requirements.txt (line 1))
  File was already downloaded /tmp/dataflow-requirements-cache/six-1.10.0.tar.gz
Collecting funcsigs>=1 (from mock->-r postcommit_requirements.txt (line 2))
  File was already downloaded /tmp/dataflow-requirements-cache/funcsigs-1.0.2.tar.gz
Collecting pbr>=0.11 (from mock->-r postcommit_requirements.txt (line 2))
  File was already downloaded /tmp/dataflow-requirements-cache/pbr-3.0.0.tar.gz
Collecting packaging>=16.8 (from setuptools->pyhamcrest->-r postcommit_requirements.txt
(line 1))
  File was already downloaded /tmp/dataflow-requirements-cache/packaging-16.8.tar.gz
Collecting appdirs>=1.4.0 (from setuptools->pyhamcrest->-r postcommit_requirements.txt
(line 1))
  File was already downloaded /tmp/dataflow-requirements-cache/appdirs-1.4.3.tar.gz
Collecting pyparsing (from packaging>=16.8->setuptools->pyhamcrest->-r postcommit_requirements.txt
(line 1))
  File was already downloaded /tmp/dataflow-requirements-cache/pyparsing-2.2.0.tar.gz
Successfully downloaded pyhamcrest mock setuptools six funcsigs pbr packaging appdirs pyparsing
test_empty_singleton_side_input (apache_beam.transforms.sideinputs_test.SideInputsTest) ...
ok
DEPRECATION: pip install --download has been deprecated and will be removed in the future.
Pip now has a download command that should be used instead.
Collecting pyhamcrest (from -r postcommit_requirements.txt (line 1))
  File was already downloaded /tmp/dataflow-requirements-cache/PyHamcrest-1.9.0.tar.gz
Collecting mock (from -r postcommit_requirements.txt (line 2))
  File was already downloaded /tmp/dataflow-requirements-cache/mock-2.0.0.tar.gz
Collecting setuptools (from pyhamcrest->-r postcommit_requirements.txt (line 1))
  File was already downloaded /tmp/dataflow-requirements-cache/setuptools-35.0.1.zip
Collecting six (from pyhamcrest->-r postcommit_requirements.txt (line 1))
  File was already downloaded /tmp/dataflow-requirements-cache/six-1.10.0.tar.gz
test_default_value_singleton_side_input (apache_beam.transforms.sideinputs_test.SideInputsTest)
... ok
Collecting funcsigs>=1 (from mock->-r postcommit_requirements.txt (line 2))
  File was already downloaded /tmp/dataflow-requirements-cache/funcsigs-1.0.2.tar.gz
Collecting pbr>=0.11 (from mock->-r postcommit_requirements.txt (line 2))
  File was already downloaded /tmp/dataflow-requirements-cache/pbr-3.0.0.tar.gz
Collecting packaging>=16.8 (from setuptools->pyhamcrest->-r postcommit_requirements.txt
(line 1))
  File was already downloaded /tmp/dataflow-requirements-cache/packaging-16.8.tar.gz
Collecting appdirs>=1.4.0 (from setuptools->pyhamcrest->-r postcommit_requirements.txt
(line 1))
  File was already downloaded /tmp/dataflow-requirements-cache/appdirs-1.4.3.tar.gz
Collecting pyparsing (from packaging>=16.8->setuptools->pyhamcrest->-r postcommit_requirements.txt
(line 1))
  File was already downloaded /tmp/dataflow-requirements-cache/pyparsing-2.2.0.tar.gz
Successfully downloaded pyhamcrest mock setuptools six funcsigs pbr packaging appdirs pyparsing
test_flattened_side_input (apache_beam.transforms.sideinputs_test.SideInputsTest) ... ok
test_multi_valued_singleton_side_input (apache_beam.transforms.sideinputs_test.SideInputsTest)
... ok
Found: https://console.cloud.google.com/dataflow/job/2017-04-24_09_27_15-1447858430203104571?project=apache-beam-testing
Found: https://console.cloud.google.com/dataflow/job/2017-04-24_09_32_51-12780601037986760581?project=apache-beam-testing
Found: https://console.cloud.google.com/dataflow/job/2017-04-24_09_39_10-15165930142318056336?project=apache-beam-testing
Found: https://console.cloud.google.com/dataflow/job/2017-04-24_09_45_03-15483343830765175686?project=apache-beam-testing
test_iterable_side_input (apache_beam.transforms.sideinputs_test.SideInputsTest) ... ERROR

======================================================================
ERROR: test_iterable_side_input (apache_beam.transforms.sideinputs_test.SideInputsTest)
----------------------------------------------------------------------
Traceback (most recent call last):
  File "<https://builds.apache.org/job/beam_PostCommit_Python_Verify/ws/sdks/python/nose-1.3.7-py2.7.egg/nose/plugins/multiprocess.py",>
line 812, in run
    test(orig)
  File "<https://builds.apache.org/job/beam_PostCommit_Python_Verify/ws/sdks/python/nose-1.3.7-py2.7.egg/nose/case.py",>
line 45, in __call__
    return self.run(*arg, **kwarg)
  File "<https://builds.apache.org/job/beam_PostCommit_Python_Verify/ws/sdks/python/nose-1.3.7-py2.7.egg/nose/case.py",>
line 133, in run
    self.runTest(result)
  File "<https://builds.apache.org/job/beam_PostCommit_Python_Verify/ws/sdks/python/nose-1.3.7-py2.7.egg/nose/case.py",>
line 151, in runTest
    test(result)
  File "/usr/lib/python2.7/unittest/case.py", line 395, in __call__
    return self.run(*args, **kwds)
  File "/usr/lib/python2.7/unittest/case.py", line 331, in run
    testMethod()
  File "<https://builds.apache.org/job/beam_PostCommit_Python_Verify/ws/sdks/python/apache_beam/transforms/sideinputs_test.py",>
line 177, in test_iterable_side_input
    pipeline.run()
  File "<https://builds.apache.org/job/beam_PostCommit_Python_Verify/ws/sdks/python/apache_beam/test_pipeline.py",>
line 91, in run
    result = super(TestPipeline, self).run()
  File "<https://builds.apache.org/job/beam_PostCommit_Python_Verify/ws/sdks/python/apache_beam/pipeline.py",>
line 169, in run
    return self.runner.run(self)
  File "<https://builds.apache.org/job/beam_PostCommit_Python_Verify/ws/sdks/python/apache_beam/runners/dataflow/test_dataflow_runner.py",>
line 44, in run
    self.result.wait_until_finish()
  File "<https://builds.apache.org/job/beam_PostCommit_Python_Verify/ws/sdks/python/apache_beam/runners/dataflow/dataflow_runner.py",>
line 767, in wait_until_finish
    time.sleep(5.0)
  File "<https://builds.apache.org/job/beam_PostCommit_Python_Verify/ws/sdks/python/nose-1.3.7-py2.7.egg/nose/plugins/multiprocess.py",>
line 276, in signalhandler
    raise TimedOutException()
TimedOutException: 'test_iterable_side_input (apache_beam.transforms.sideinputs_test.SideInputsTest)'

----------------------------------------------------------------------
Ran 15 tests in 1672.048s

FAILED (errors=1)
Found: https://console.cloud.google.com/dataflow/job/2017-04-24_09_27_17-8931555019593920820?project=apache-beam-testing
Found: https://console.cloud.google.com/dataflow/job/2017-04-24_09_34_16-5386775104077819566?project=apache-beam-testing
Found: https://console.cloud.google.com/dataflow/job/2017-04-24_09_40_00-6430638576598230989?project=apache-beam-testing
Found: https://console.cloud.google.com/dataflow/job/2017-04-24_09_27_15-7772132983195317?project=apache-beam-testing
Found: https://console.cloud.google.com/dataflow/job/2017-04-24_09_34_19-2322881459776022987?project=apache-beam-testing
Found: https://console.cloud.google.com/dataflow/job/2017-04-24_09_40_12-7844401909749152990?project=apache-beam-testing
Found: https://console.cloud.google.com/dataflow/job/2017-04-24_09_45_25-15493713881869926169?project=apache-beam-testing
Found: https://console.cloud.google.com/dataflow/job/2017-04-24_09_27_15-16141426371676248895?project=apache-beam-testing
Found: https://console.cloud.google.com/dataflow/job/2017-04-24_09_33_49-10257973247554496012?project=apache-beam-testing
Found: https://console.cloud.google.com/dataflow/job/2017-04-24_09_39_11-4647341642732794154?project=apache-beam-testing
Found: https://console.cloud.google.com/dataflow/job/2017-04-24_09_44_50-8334453433585634298?project=apache-beam-testing
Build step 'Execute shell' marked build as failure

Mime
View raw message