beam-commits mailing list archives

Site index · List index
Message view « Date » · « Thread »
Top « Date » · « Thread »
From Apache Jenkins Server <jenk...@builds.apache.org>
Subject Build failed in Jenkins: beam_PostCommit_Java_ValidatesRunner_Apex #995
Date Thu, 06 Apr 2017 01:25:05 GMT
See <https://builds.apache.org/job/beam_PostCommit_Java_ValidatesRunner_Apex/995/display/redirect?page=changes>

Changes:

[tgroh] Remove unused import in ViewFn

------------------------------------------
[...truncated 676.45 KB...]
Tests run: 2, Failures: 0, Errors: 0, Skipped: 0, Time elapsed: 0.003 sec - in org.apache.beam.sdk.util.UploadIdResponseInterceptorTest
Running org.apache.beam.sdk.util.NumberedShardedFileTest
Tests run: 9, Failures: 0, Errors: 0, Skipped: 0, Time elapsed: 0.03 sec - in org.apache.beam.sdk.util.NumberedShardedFileTest
Running org.apache.beam.sdk.util.FileIOChannelFactoryRegistrarTest
Tests run: 1, Failures: 0, Errors: 0, Skipped: 0, Time elapsed: 0.001 sec - in org.apache.beam.sdk.util.FileIOChannelFactoryRegistrarTest
Running org.apache.beam.sdk.util.PTupleTest
Tests run: 1, Failures: 0, Errors: 0, Skipped: 0, Time elapsed: 0.001 sec - in org.apache.beam.sdk.util.PTupleTest
Running org.apache.beam.sdk.util.UnownedOutputStreamTest
Tests run: 2, Failures: 0, Errors: 0, Skipped: 0, Time elapsed: 0.002 sec - in org.apache.beam.sdk.util.UnownedOutputStreamTest
Running org.apache.beam.sdk.util.gcsfs.GcsPathTest
Tests run: 22, Failures: 0, Errors: 0, Skipped: 0, Time elapsed: 0.008 sec - in org.apache.beam.sdk.util.gcsfs.GcsPathTest
Running org.apache.beam.sdk.util.CombineFnUtilTest
Tests run: 3, Failures: 0, Errors: 0, Skipped: 0, Time elapsed: 0.011 sec - in org.apache.beam.sdk.util.CombineFnUtilTest
Running org.apache.beam.sdk.util.ReshuffleTriggerTest
Tests run: 1, Failures: 0, Errors: 0, Skipped: 0, Time elapsed: 0.001 sec - in org.apache.beam.sdk.util.ReshuffleTriggerTest
Running org.apache.beam.sdk.util.BucketingFunctionTest
Tests run: 4, Failures: 0, Errors: 0, Skipped: 0, Time elapsed: 0.003 sec - in org.apache.beam.sdk.util.BucketingFunctionTest
Running org.apache.beam.sdk.util.NameUtilsTest
Tests run: 11, Failures: 0, Errors: 0, Skipped: 0, Time elapsed: 0.008 sec - in org.apache.beam.sdk.util.NameUtilsTest
Running org.apache.beam.sdk.util.UserCodeExceptionTest
Tests run: 8, Failures: 0, Errors: 0, Skipped: 0, Time elapsed: 0.004 sec - in org.apache.beam.sdk.util.UserCodeExceptionTest
Running org.apache.beam.sdk.util.SerializerTest
Tests run: 4, Failures: 0, Errors: 0, Skipped: 0, Time elapsed: 0.013 sec - in org.apache.beam.sdk.util.SerializerTest
Running org.apache.beam.sdk.util.MovingFunctionTest
Tests run: 5, Failures: 0, Errors: 0, Skipped: 0, Time elapsed: 0.002 sec - in org.apache.beam.sdk.util.MovingFunctionTest
Running org.apache.beam.sdk.util.AttemptBoundedExponentialBackOffTest
Tests run: 5, Failures: 0, Errors: 0, Skipped: 0, Time elapsed: 0.002 sec - in org.apache.beam.sdk.util.AttemptBoundedExponentialBackOffTest
Running org.apache.beam.sdk.util.IOChannelUtilsTest
Tests run: 10, Failures: 0, Errors: 0, Skipped: 0, Time elapsed: 0.012 sec - in org.apache.beam.sdk.util.IOChannelUtilsTest

Results :

Tests run: 2673, Failures: 0, Errors: 0, Skipped: 3

[JENKINS] Recording test results
2017-04-06T01:24:49.372 [INFO] 
2017-04-06T01:24:49.373 [INFO] --- jacoco-maven-plugin:0.7.8:report (report) @ beam-sdks-java-core
---
2017-04-06T01:24:49.445 [INFO] Loading execution data file <https://builds.apache.org/job/beam_PostCommit_Java_ValidatesRunner_Apex/ws/sdks/java/core/target/jacoco.exec>
2017-04-06T01:24:49.765 [INFO] Analyzed bundle 'Apache Beam :: SDKs :: Java :: Core' with
1194 classes
2017-04-06T01:24:51.211 [INFO] 
2017-04-06T01:24:51.211 [INFO] --- build-helper-maven-plugin:3.0.0:regex-properties (render-artifact-id)
@ beam-sdks-java-core ---
2017-04-06T01:24:51.350 [INFO] 
2017-04-06T01:24:51.351 [INFO] --- maven-jar-plugin:3.0.2:jar (default-jar) @ beam-sdks-java-core
---
2017-04-06T01:24:51.498 [INFO] Building jar: <https://builds.apache.org/job/beam_PostCommit_Java_ValidatesRunner_Apex/ws/sdks/java/core/target/beam-sdks-java-core-0.7.0-SNAPSHOT.jar>
2017-04-06T01:24:51.651 [INFO] 
2017-04-06T01:24:51.651 [INFO] --- maven-site-plugin:3.5.1:attach-descriptor (attach-descriptor)
@ beam-sdks-java-core ---
2017-04-06T01:24:51.751 [INFO] 
2017-04-06T01:24:51.751 [INFO] --- maven-jar-plugin:3.0.2:test-jar (default-test-jar) @ beam-sdks-java-core
---
2017-04-06T01:24:51.884 [INFO] Building jar: <https://builds.apache.org/job/beam_PostCommit_Java_ValidatesRunner_Apex/ws/sdks/java/core/target/beam-sdks-java-core-0.7.0-SNAPSHOT-tests.jar>
2017-04-06T01:24:52.009 [INFO] 
2017-04-06T01:24:52.009 [INFO] --- maven-shade-plugin:3.0.0:shade (bundle-and-repackage) @
beam-sdks-java-core ---
2017-04-06T01:24:52.013 [INFO] Excluding org.apache.beam:beam-sdks-common-runner-api:jar:0.7.0-SNAPSHOT
from the shaded jar.
2017-04-06T01:24:52.013 [INFO] Excluding io.grpc:grpc-auth:jar:1.2.0 from the shaded jar.
2017-04-06T01:24:52.013 [INFO] Excluding io.grpc:grpc-core:jar:1.2.0 from the shaded jar.
2017-04-06T01:24:52.013 [INFO] Excluding com.google.errorprone:error_prone_annotations:jar:2.0.15
from the shaded jar.
2017-04-06T01:24:52.013 [INFO] Excluding io.grpc:grpc-context:jar:1.2.0 from the shaded jar.
2017-04-06T01:24:52.013 [INFO] Excluding com.google.instrumentation:instrumentation-api:jar:0.3.0
from the shaded jar.
2017-04-06T01:24:52.013 [INFO] Excluding io.grpc:grpc-netty:jar:1.2.0 from the shaded jar.
2017-04-06T01:24:52.013 [INFO] Excluding io.netty:netty-codec-http2:jar:4.1.8.Final from the
shaded jar.
2017-04-06T01:24:52.013 [INFO] Excluding io.netty:netty-codec-http:jar:4.1.8.Final from the
shaded jar.
2017-04-06T01:24:52.013 [INFO] Excluding io.netty:netty-handler-proxy:jar:4.1.8.Final from
the shaded jar.
2017-04-06T01:24:52.013 [INFO] Excluding io.netty:netty-codec-socks:jar:4.1.8.Final from the
shaded jar.
2017-04-06T01:24:52.013 [INFO] Excluding io.grpc:grpc-stub:jar:1.2.0 from the shaded jar.
2017-04-06T01:24:52.013 [INFO] Excluding io.grpc:grpc-all:jar:1.2.0 from the shaded jar.
2017-04-06T01:24:52.013 [INFO] Excluding io.grpc:grpc-okhttp:jar:1.2.0 from the shaded jar.
2017-04-06T01:24:52.013 [INFO] Excluding com.squareup.okhttp:okhttp:jar:2.5.0 from the shaded
jar.
2017-04-06T01:24:52.013 [INFO] Excluding com.squareup.okio:okio:jar:1.6.0 from the shaded
jar.
2017-04-06T01:24:52.013 [INFO] Excluding io.grpc:grpc-protobuf-lite:jar:1.2.0 from the shaded
jar.
2017-04-06T01:24:52.013 [INFO] Excluding io.grpc:grpc-protobuf-nano:jar:1.2.0 from the shaded
jar.
2017-04-06T01:24:52.013 [INFO] Excluding com.google.protobuf.nano:protobuf-javanano:jar:3.0.0-alpha-5
from the shaded jar.
2017-04-06T01:24:52.013 [INFO] Excluding io.grpc:grpc-protobuf:jar:1.2.0 from the shaded jar.
2017-04-06T01:24:52.013 [INFO] Excluding com.google.protobuf:protobuf-java-util:jar:3.2.0
from the shaded jar.
2017-04-06T01:24:52.013 [INFO] Excluding com.google.code.gson:gson:jar:2.7 from the shaded
jar.
2017-04-06T01:24:52.013 [INFO] Excluding com.google.auth:google-auth-library-credentials:jar:0.6.0
from the shaded jar.
2017-04-06T01:24:52.013 [INFO] Excluding com.google.auth:google-auth-library-oauth2-http:jar:0.6.0
from the shaded jar.
2017-04-06T01:24:52.013 [INFO] Excluding io.netty:netty-handler:jar:4.1.8.Final from the shaded
jar.
2017-04-06T01:24:52.013 [INFO] Excluding io.netty:netty-buffer:jar:4.1.8.Final from the shaded
jar.
2017-04-06T01:24:52.013 [INFO] Excluding io.netty:netty-common:jar:4.1.8.Final from the shaded
jar.
2017-04-06T01:24:52.013 [INFO] Excluding io.netty:netty-transport:jar:4.1.8.Final from the
shaded jar.
2017-04-06T01:24:52.013 [INFO] Excluding io.netty:netty-resolver:jar:4.1.8.Final from the
shaded jar.
2017-04-06T01:24:52.013 [INFO] Excluding io.netty:netty-codec:jar:4.1.8.Final from the shaded
jar.
2017-04-06T01:24:52.013 [INFO] Excluding com.google.api.grpc:grpc-google-pubsub-v1:jar:0.1.0
from the shaded jar.
2017-04-06T01:24:52.013 [INFO] Excluding com.google.api.grpc:grpc-google-common-protos:jar:0.1.0
from the shaded jar.
2017-04-06T01:24:52.013 [INFO] Excluding com.google.api.grpc:grpc-google-iam-v1:jar:0.1.0
from the shaded jar.
2017-04-06T01:24:52.013 [INFO] Excluding com.google.api-client:google-api-client:jar:1.22.0
from the shaded jar.
2017-04-06T01:24:52.013 [INFO] Excluding com.google.apis:google-api-services-bigquery:jar:v2-rev295-1.22.0
from the shaded jar.
2017-04-06T01:24:52.014 [INFO] Excluding com.google.apis:google-api-services-cloudresourcemanager:jar:v1-rev6-1.22.0
from the shaded jar.
2017-04-06T01:24:52.014 [INFO] Excluding com.google.apis:google-api-services-pubsub:jar:v1-rev10-1.22.0
from the shaded jar.
2017-04-06T01:24:52.014 [INFO] Excluding com.google.apis:google-api-services-storage:jar:v1-rev71-1.22.0
from the shaded jar.
2017-04-06T01:24:52.014 [INFO] Excluding com.google.http-client:google-http-client:jar:1.22.0
from the shaded jar.
2017-04-06T01:24:52.014 [INFO] Excluding org.apache.httpcomponents:httpclient:jar:4.0.1 from
the shaded jar.
2017-04-06T01:24:52.014 [INFO] Excluding org.apache.httpcomponents:httpcore:jar:4.0.1 from
the shaded jar.
2017-04-06T01:24:52.014 [INFO] Excluding commons-logging:commons-logging:jar:1.1.1 from the
shaded jar.
2017-04-06T01:24:52.014 [INFO] Excluding commons-codec:commons-codec:jar:1.3 from the shaded
jar.
2017-04-06T01:24:52.014 [INFO] Excluding com.google.http-client:google-http-client-jackson:jar:1.22.0
from the shaded jar.
2017-04-06T01:24:52.014 [INFO] Excluding com.google.http-client:google-http-client-jackson2:jar:1.22.0
from the shaded jar.
2017-04-06T01:24:52.014 [INFO] Excluding com.google.http-client:google-http-client-protobuf:jar:1.22.0
from the shaded jar.
2017-04-06T01:24:52.014 [INFO] Excluding com.google.oauth-client:google-oauth-client:jar:1.22.0
from the shaded jar.
2017-04-06T01:24:52.014 [INFO] Excluding com.google.cloud.bigdataoss:gcsio:jar:1.4.5 from
the shaded jar.
2017-04-06T01:24:52.014 [INFO] Excluding com.google.api-client:google-api-client-java6:jar:1.22.0
from the shaded jar.
2017-04-06T01:24:52.014 [INFO] Excluding com.google.api-client:google-api-client-jackson2:jar:1.22.0
from the shaded jar.
2017-04-06T01:24:52.014 [INFO] Excluding com.google.oauth-client:google-oauth-client-java6:jar:1.22.0
from the shaded jar.
2017-04-06T01:24:52.014 [INFO] Excluding com.google.cloud.bigdataoss:util:jar:1.4.5 from the
shaded jar.
2017-04-06T01:24:52.014 [INFO] Including com.google.guava:guava:jar:20.0 in the shaded jar.
2017-04-06T01:24:52.014 [INFO] Excluding com.google.protobuf:protobuf-java:jar:3.2.0 from
the shaded jar.
2017-04-06T01:24:52.014 [INFO] Excluding com.google.code.findbugs:jsr305:jar:3.0.1 from the
shaded jar.
2017-04-06T01:24:52.014 [INFO] Excluding com.fasterxml.jackson.core:jackson-core:jar:2.7.2
from the shaded jar.
2017-04-06T01:24:52.014 [INFO] Excluding com.fasterxml.jackson.core:jackson-annotations:jar:2.7.2
from the shaded jar.
2017-04-06T01:24:52.014 [INFO] Excluding com.fasterxml.jackson.core:jackson-databind:jar:2.7.2
from the shaded jar.
2017-04-06T01:24:52.014 [INFO] Excluding org.slf4j:slf4j-api:jar:1.7.14 from the shaded jar.
2017-04-06T01:24:52.014 [INFO] Excluding net.bytebuddy:byte-buddy:jar:1.6.8 from the shaded
jar.
2017-04-06T01:24:52.014 [INFO] Excluding org.apache.avro:avro:jar:1.8.1 from the shaded jar.
2017-04-06T01:24:52.014 [INFO] Excluding org.codehaus.jackson:jackson-core-asl:jar:1.9.13
from the shaded jar.
2017-04-06T01:24:52.014 [INFO] Excluding org.codehaus.jackson:jackson-mapper-asl:jar:1.9.13
from the shaded jar.
2017-04-06T01:24:52.014 [INFO] Excluding com.thoughtworks.paranamer:paranamer:jar:2.7 from
the shaded jar.
2017-04-06T01:24:52.014 [INFO] Excluding org.xerial.snappy:snappy-java:jar:1.1.2.1 from the
shaded jar.
2017-04-06T01:24:52.014 [INFO] Excluding org.apache.commons:commons-compress:jar:1.9 from
the shaded jar.
2017-04-06T01:24:52.014 [INFO] Excluding org.apache.commons:commons-lang3:jar:3.5 from the
shaded jar.
2017-04-06T01:24:52.014 [INFO] Excluding joda-time:joda-time:jar:2.4 from the shaded jar.
2017-04-06T01:24:52.014 [INFO] Excluding org.codehaus.woodstox:stax2-api:jar:3.1.4 from the
shaded jar.
2017-04-06T01:24:52.014 [INFO] Excluding org.codehaus.woodstox:woodstox-core-asl:jar:4.4.1
from the shaded jar.
2017-04-06T01:24:52.014 [INFO] Excluding org.tukaani:xz:jar:1.5 from the shaded jar.
2017-04-06T01:24:52.014 [INFO] Excluding com.google.auto.service:auto-service:jar:1.0-rc2
from the shaded jar.
2017-04-06T01:24:52.014 [INFO] Excluding com.google.auto:auto-common:jar:0.3 from the shaded
jar.
2017-04-06T01:24:53.638 [INFO] Replacing original artifact with shaded artifact.
2017-04-06T01:24:53.638 [INFO] Replacing <https://builds.apache.org/job/beam_PostCommit_Java_ValidatesRunner_Apex/ws/sdks/java/core/target/beam-sdks-java-core-0.7.0-SNAPSHOT.jar>
with <https://builds.apache.org/job/beam_PostCommit_Java_ValidatesRunner_Apex/ws/sdks/java/core/target/beam-sdks-java-core-0.7.0-SNAPSHOT-shaded.jar>
2017-04-06T01:24:53.638 [INFO] Dependency-reduced POM written at: <https://builds.apache.org/job/beam_PostCommit_Java_ValidatesRunner_Apex/ws/sdks/java/core/dependency-reduced-pom.xml>
2017-04-06T01:24:53.794 [INFO] 
2017-04-06T01:24:53.794 [INFO] --- maven-dependency-plugin:3.0.0:analyze-only (default) @
beam-sdks-java-core ---
2017-04-06T01:24:54.052 [INFO] No dependency problems found
[JENKINS] Archiving disabled
2017-04-06T01:24:55.036 [INFO]                                                           
             
2017-04-06T01:24:55.036 [INFO] ------------------------------------------------------------------------
2017-04-06T01:24:55.036 [INFO] Building Apache Beam :: Runners 0.7.0-SNAPSHOT
2017-04-06T01:24:55.036 [INFO] ------------------------------------------------------------------------
2017-04-06T01:24:55.038 [INFO] 
2017-04-06T01:24:55.038 [INFO] --- maven-clean-plugin:3.0.0:clean (default-clean) @ beam-runners-parent
---
2017-04-06T01:24:55.040 [INFO] Deleting <https://builds.apache.org/job/beam_PostCommit_Java_ValidatesRunner_Apex/ws/runners>
(includes = [**/*.pyc, **/*.egg-info/], excludes = [])
2017-04-06T01:24:55.102 [INFO] 
2017-04-06T01:24:55.102 [INFO] --- maven-enforcer-plugin:1.4.1:enforce (enforce) @ beam-runners-parent
---
2017-04-06T01:24:55.156 [INFO] 
2017-04-06T01:24:55.156 [INFO] --- maven-remote-resources-plugin:1.5:process (process-resource-bundles)
@ beam-runners-parent ---
2017-04-06T01:24:55.214 [INFO] 
2017-04-06T01:24:55.214 [INFO] --- maven-checkstyle-plugin:2.17:check (default) @ beam-runners-parent
---
2017-04-06T01:24:55.634 [INFO] Starting audit...
Audit done.
2017-04-06T01:24:55.720 [INFO] 
2017-04-06T01:24:55.720 [INFO] --- build-helper-maven-plugin:3.0.0:regex-properties (render-artifact-id)
@ beam-runners-parent ---
2017-04-06T01:24:55.770 [INFO] 
2017-04-06T01:24:55.770 [INFO] --- maven-site-plugin:3.5.1:attach-descriptor (attach-descriptor)
@ beam-runners-parent ---
2017-04-06T01:24:55.820 [INFO] 
2017-04-06T01:24:55.820 [INFO] --- maven-shade-plugin:3.0.0:shade (bundle-and-repackage) @
beam-runners-parent ---
2017-04-06T01:24:55.823 [INFO] Replacing original artifact with shaded artifact.
2017-04-06T01:24:55.897 [INFO] 
2017-04-06T01:24:55.897 [INFO] --- maven-dependency-plugin:3.0.0:analyze-only (default) @
beam-runners-parent ---
2017-04-06T01:24:55.898 [INFO] Skipping pom project
[JENKINS] Archiving disabled
2017-04-06T01:24:56.663 [INFO]                                                           
             
2017-04-06T01:24:56.663 [INFO] ------------------------------------------------------------------------
2017-04-06T01:24:56.663 [INFO] Building Apache Beam :: Runners :: Core Java Construction 0.7.0-SNAPSHOT
2017-04-06T01:24:56.663 [INFO] ------------------------------------------------------------------------
2017-04-06T01:24:56.676 [INFO] 
2017-04-06T01:24:56.676 [INFO] --- maven-clean-plugin:3.0.0:clean (default-clean) @ beam-runners-core-construction-java
---
2017-04-06T01:24:56.677 [INFO] Deleting <https://builds.apache.org/job/beam_PostCommit_Java_ValidatesRunner_Apex/ws/runners/core-construction-java>
(includes = [**/*.pyc, **/*.egg-info/], excludes = [])
2017-04-06T01:24:56.795 [INFO] 
2017-04-06T01:24:56.795 [INFO] --- maven-enforcer-plugin:1.4.1:enforce (enforce) @ beam-runners-core-construction-java
---
2017-04-06T01:24:57.290 [INFO] 
2017-04-06T01:24:57.290 [INFO] --- maven-remote-resources-plugin:1.5:process (process-resource-bundles)
@ beam-runners-core-construction-java ---
2017-04-06T01:24:57.815 [INFO] 
2017-04-06T01:24:57.815 [INFO] --- maven-resources-plugin:2.7:resources (default-resources)
@ beam-runners-core-construction-java ---
2017-04-06T01:24:57.816 [INFO] Using 'UTF-8' encoding to copy filtered resources.
2017-04-06T01:24:57.817 [INFO] skip non existing resourceDirectory <https://builds.apache.org/job/beam_PostCommit_Java_ValidatesRunner_Apex/ws/runners/core-construction-java/src/main/resources>
2017-04-06T01:24:57.817 [INFO] Copying 3 resources
2017-04-06T01:24:57.866 [INFO] 
2017-04-06T01:24:57.866 [INFO] --- maven-compiler-plugin:3.6.1:compile (default-compile) @
beam-runners-core-construction-java ---
2017-04-06T01:24:57.870 [INFO] Changes detected - recompiling the module!
2017-04-06T01:24:57.871 [INFO] Compiling 9 source files to <https://builds.apache.org/job/beam_PostCommit_Java_ValidatesRunner_Apex/ws/runners/core-construction-java/target/classes>
2017-04-06T01:24:57.965 [WARNING] bootstrap class path not set in conjunction with -source
1.7
2017-04-06T01:24:57.965 [INFO] <https://builds.apache.org/job/beam_PostCommit_Java_ValidatesRunner_Apex/ws/runners/core-construction-java/src/main/java/org/apache/beam/runners/core/construction/PTransformMatchers.java>:
Some input files use or override a deprecated API.
2017-04-06T01:24:57.965 [INFO] <https://builds.apache.org/job/beam_PostCommit_Java_ValidatesRunner_Apex/ws/runners/core-construction-java/src/main/java/org/apache/beam/runners/core/construction/PTransformMatchers.java>:
Recompile with -Xlint:deprecation for details.
2017-04-06T01:24:57.965 [INFO] <https://builds.apache.org/job/beam_PostCommit_Java_ValidatesRunner_Apex/ws/runners/core-construction-java/src/main/java/org/apache/beam/runners/core/construction/SingleInputOutputOverrideFactory.java>:
Some input files use unchecked or unsafe operations.
2017-04-06T01:24:57.965 [INFO] <https://builds.apache.org/job/beam_PostCommit_Java_ValidatesRunner_Apex/ws/runners/core-construction-java/src/main/java/org/apache/beam/runners/core/construction/SingleInputOutputOverrideFactory.java>:
Recompile with -Xlint:unchecked for details.
2017-04-06T01:24:58.015 [INFO] 
2017-04-06T01:24:58.015 [INFO] --- maven-resources-plugin:2.7:testResources (default-testResources)
@ beam-runners-core-construction-java ---
2017-04-06T01:24:58.016 [INFO] Using 'UTF-8' encoding to copy filtered resources.
2017-04-06T01:24:58.016 [INFO] skip non existing resourceDirectory <https://builds.apache.org/job/beam_PostCommit_Java_ValidatesRunner_Apex/ws/runners/core-construction-java/src/test/resources>
2017-04-06T01:24:58.016 [INFO] Copying 3 resources
2017-04-06T01:24:58.067 [INFO] 
2017-04-06T01:24:58.067 [INFO] --- maven-compiler-plugin:3.6.1:testCompile (default-testCompile)
@ beam-runners-core-construction-java ---
2017-04-06T01:24:58.074 [INFO] Changes detected - recompiling the module!
2017-04-06T01:24:58.075 [INFO] Compiling 7 source files to <https://builds.apache.org/job/beam_PostCommit_Java_ValidatesRunner_Apex/ws/runners/core-construction-java/target/test-classes>
2017-04-06T01:24:58.231 [INFO] <https://builds.apache.org/job/beam_PostCommit_Java_ValidatesRunner_Apex/ws/runners/core-construction-java/src/test/java/org/apache/beam/runners/core/construction/PTransformMatchersTest.java>:
<https://builds.apache.org/job/beam_PostCommit_Java_ValidatesRunner_Apex/ws/runners/core-construction-java/src/test/java/org/apache/beam/runners/core/construction/PTransformMatchersTest.java>
uses or overrides a deprecated API.
2017-04-06T01:24:58.231 [INFO] <https://builds.apache.org/job/beam_PostCommit_Java_ValidatesRunner_Apex/ws/runners/core-construction-java/src/test/java/org/apache/beam/runners/core/construction/PTransformMatchersTest.java>:
Recompile with -Xlint:deprecation for details.
2017-04-06T01:24:58.231 [INFO] <https://builds.apache.org/job/beam_PostCommit_Java_ValidatesRunner_Apex/ws/runners/core-construction-java/src/test/java/org/apache/beam/runners/core/construction/UnsupportedOverrideFactoryTest.java>:
Some input files use unchecked or unsafe operations.
2017-04-06T01:24:58.231 [INFO] <https://builds.apache.org/job/beam_PostCommit_Java_ValidatesRunner_Apex/ws/runners/core-construction-java/src/test/java/org/apache/beam/runners/core/construction/UnsupportedOverrideFactoryTest.java>:
Recompile with -Xlint:unchecked for details.
2017-04-06T01:24:58.231 [INFO] -------------------------------------------------------------
2017-04-06T01:24:58.231 [ERROR] COMPILATION ERROR : 
2017-04-06T01:24:58.231 [INFO] -------------------------------------------------------------
2017-04-06T01:24:58.231 [ERROR] <https://builds.apache.org/job/beam_PostCommit_Java_ValidatesRunner_Apex/ws/runners/core-construction-java/src/test/java/org/apache/beam/runners/core/construction/PTransformMatchersTest.java>:[351,69]
<anonymous org.apache.beam.runners.core.construction.PTransformMatchersTest$9> is not
abstract and does not override abstract method getMaterialization() in org.apache.beam.sdk.transforms.ViewFn
2017-04-06T01:24:58.231 [INFO] 1 error
2017-04-06T01:24:58.231 [INFO] -------------------------------------------------------------
[JENKINS] Archiving disabled
[JENKINS] Archiving disabled
[JENKINS] Archiving disabled
[JENKINS] Archiving disabled
[JENKINS] Archiving disabled
[JENKINS] Archiving disabled
[JENKINS] Archiving disabled
[JENKINS] Archiving disabled
[JENKINS] Archiving disabled
[JENKINS] Archiving disabled
[JENKINS] Archiving disabled
[JENKINS] Archiving disabled
[JENKINS] Archiving disabled
2017-04-06T01:25:01.606 [INFO] ------------------------------------------------------------------------
2017-04-06T01:25:01.606 [INFO] Reactor Summary:
2017-04-06T01:25:01.606 [INFO] 
2017-04-06T01:25:01.606 [INFO] Apache Beam :: Parent .............................. SUCCESS
[ 21.135 s]
2017-04-06T01:25:01.606 [INFO] Apache Beam :: SDKs :: Java :: Build Tools ......... SUCCESS
[ 14.339 s]
2017-04-06T01:25:01.606 [INFO] Apache Beam :: SDKs ................................ SUCCESS
[  1.826 s]
2017-04-06T01:25:01.607 [INFO] Apache Beam :: SDKs :: Common ...................... SUCCESS
[  1.470 s]
2017-04-06T01:25:01.607 [INFO] Apache Beam :: SDKs :: Common :: Fn API ............ SUCCESS
[ 18.557 s]
2017-04-06T01:25:01.607 [INFO] Apache Beam :: SDKs :: Common :: Runner API ........ SUCCESS
[  6.031 s]
2017-04-06T01:25:01.607 [INFO] Apache Beam :: SDKs :: Java ........................ SUCCESS
[  1.457 s]
2017-04-06T01:25:01.607 [INFO] Apache Beam :: SDKs :: Java :: Core ................ SUCCESS
[02:38 min]
2017-04-06T01:25:01.607 [INFO] Apache Beam :: Runners ............................. SUCCESS
[  1.253 s]
2017-04-06T01:25:01.607 [INFO] Apache Beam :: Runners :: Core Java Construction ... FAILURE
[  1.758 s]
2017-04-06T01:25:01.607 [INFO] Apache Beam :: Runners :: Core Java ................ SKIPPED
2017-04-06T01:25:01.607 [INFO] Apache Beam :: Runners :: Apex ..................... SKIPPED
2017-04-06T01:25:01.607 [INFO] ------------------------------------------------------------------------
2017-04-06T01:25:01.607 [INFO] BUILD FAILURE
2017-04-06T01:25:01.607 [INFO] ------------------------------------------------------------------------
2017-04-06T01:25:01.607 [INFO] Total time: 04:11 min
2017-04-06T01:25:01.607 [INFO] Finished at: 2017-04-06T01:25:01+00:00
2017-04-06T01:25:02.127 [INFO] Final Memory: 180M/1514M
2017-04-06T01:25:02.128 [INFO] ------------------------------------------------------------------------
2017-04-06T01:25:02.132 [ERROR] Failed to execute goal org.apache.maven.plugins:maven-compiler-plugin:3.6.1:testCompile
(default-testCompile) on project beam-runners-core-construction-java: Compilation failure
2017-04-06T01:25:02.132 [ERROR] <https://builds.apache.org/job/beam_PostCommit_Java_ValidatesRunner_Apex/ws/runners/core-construction-java/src/test/java/org/apache/beam/runners/core/construction/PTransformMatchersTest.java>:[351,69]
<anonymous org.apache.beam.runners.core.construction.PTransformMatchersTest$9> is not
abstract and does not override abstract method getMaterialization() in org.apache.beam.sdk.transforms.ViewFn
2017-04-06T01:25:02.133 [ERROR] -> [Help 1]
2017-04-06T01:25:02.133 [ERROR] 
2017-04-06T01:25:02.133 [ERROR] To see the full stack trace of the errors, re-run Maven with
the -e switch.
2017-04-06T01:25:02.133 [ERROR] Re-run Maven using the -X switch to enable full debug logging.
2017-04-06T01:25:02.133 [ERROR] 
2017-04-06T01:25:02.133 [ERROR] For more information about the errors and possible solutions,
please read the following articles:
2017-04-06T01:25:02.134 [ERROR] [Help 1] http://cwiki.apache.org/confluence/display/MAVEN/MojoFailureException
2017-04-06T01:25:02.134 [ERROR] 
2017-04-06T01:25:02.134 [ERROR] After correcting the problems, you can resume the build with
the command
2017-04-06T01:25:02.134 [ERROR]   mvn <goals> -rf :beam-runners-core-construction-java
channel stopped

Mime
View raw message