beam-commits mailing list archives

Site index · List index
Message view « Date » · « Thread »
Top « Date » · « Thread »
From Apache Jenkins Server <jenk...@builds.apache.org>
Subject Build failed in Jenkins: beam_PostCommit_Java_MavenInstall #3191
Date Thu, 06 Apr 2017 01:24:38 GMT
See <https://builds.apache.org/job/beam_PostCommit_Java_MavenInstall/3191/display/redirect?page=changes>

Changes:

[tgroh] Remove unused import in ViewFn

------------------------------------------
[...truncated 761.42 KB...]
2017-04-06T01:24:18.812 [INFO] 
2017-04-06T01:24:18.812 [INFO] --- maven-shade-plugin:3.0.0:shade (bundle-and-repackage) @
beam-runners-parent ---
2017-04-06T01:24:18.815 [INFO] Replacing original artifact with shaded artifact.
2017-04-06T01:24:18.865 [INFO] 
2017-04-06T01:24:18.865 [INFO] --- maven-javadoc-plugin:2.10.4:jar (attach-javadocs) @ beam-runners-parent
---
2017-04-06T01:24:18.868 [INFO] Not executing Javadoc as the project is not a Java classpath-capable
package
2017-04-06T01:24:18.921 [INFO] 
2017-04-06T01:24:18.921 [INFO] --- maven-source-plugin:3.0.1:jar-no-fork (attach-sources)
@ beam-runners-parent ---
2017-04-06T01:24:18.972 [INFO] 
2017-04-06T01:24:18.972 [INFO] --- maven-source-plugin:3.0.1:test-jar-no-fork (attach-test-sources)
@ beam-runners-parent ---
2017-04-06T01:24:19.024 [INFO] 
2017-04-06T01:24:19.024 [INFO] --- maven-dependency-plugin:3.0.0:analyze-only (default) @
beam-runners-parent ---
2017-04-06T01:24:19.025 [INFO] Skipping pom project
2017-04-06T01:24:19.075 [INFO] 
2017-04-06T01:24:19.075 [INFO] --- apache-rat-plugin:0.12:check (default) @ beam-runners-parent
---
2017-04-06T01:24:19.080 [INFO] Enabled default license matchers.
2017-04-06T01:24:19.080 [INFO] Will parse SCM ignores for exclusions...
2017-04-06T01:24:19.080 [INFO] Finished adding exclusions from SCM ignore files.
2017-04-06T01:24:19.080 [INFO] 61 implicit excludes (use -debug for more details).
2017-04-06T01:24:19.080 [INFO] Exclude: **/target/**/*
2017-04-06T01:24:19.080 [INFO] Exclude: **/dependency-reduced-pom.xml
2017-04-06T01:24:19.080 [INFO] Exclude: **/hs_err_pid*.log
2017-04-06T01:24:19.080 [INFO] Exclude: .github/**/*
2017-04-06T01:24:19.080 [INFO] Exclude: **/*.iml
2017-04-06T01:24:19.080 [INFO] Exclude: **/.idea/**/*
2017-04-06T01:24:19.080 [INFO] Exclude: **/*.egg-info/**/*
2017-04-06T01:24:19.080 [INFO] Exclude: **/package-list
2017-04-06T01:24:19.080 [INFO] Exclude: **/user.avsc
2017-04-06T01:24:19.080 [INFO] Exclude: **/test/resources/**/*.txt
2017-04-06T01:24:19.080 [INFO] Exclude: **/test/**/.placeholder
2017-04-06T01:24:19.080 [INFO] Exclude: .repository/**/*
2017-04-06T01:24:19.080 [INFO] Exclude: **/nose-*.egg/**/*
2017-04-06T01:24:19.080 [INFO] Exclude: **/.eggs/**/*
2017-04-06T01:24:19.081 [INFO] Exclude: **/.tox/**/*
2017-04-06T01:24:19.081 [INFO] Exclude: **/.checkstyle
2017-04-06T01:24:19.081 [INFO] Exclude: **/.classpath
2017-04-06T01:24:19.081 [INFO] Exclude: **/.factorypath
2017-04-06T01:24:19.081 [INFO] Exclude: **/.project
2017-04-06T01:24:19.081 [INFO] Exclude: **/.settings/**/*
2017-04-06T01:24:19.094 [INFO] 601 resources included (use -debug for more details)
2017-04-06T01:24:19.321 [INFO] Rat check: Summary over all files. Unapproved: 0, unknown:
0, generated: 0, approved: 601 licenses.
2017-04-06T01:24:19.371 [INFO] 
2017-04-06T01:24:19.371 [INFO] --- maven-install-plugin:2.5.2:install (default-install) @
beam-runners-parent ---
2017-04-06T01:24:19.373 [INFO] Installing <https://builds.apache.org/job/beam_PostCommit_Java_MavenInstall/ws/runners/pom.xml>
to <https://builds.apache.org/job/beam_PostCommit_Java_MavenInstall/ws/.repository/org/apache/beam/beam-runners-parent/0.7.0-SNAPSHOT/beam-runners-parent-0.7.0-SNAPSHOT.pom>
[JENKINS] Archiving disabled
2017-04-06T01:24:19.985 [INFO]                                                           
             
2017-04-06T01:24:19.986 [INFO] ------------------------------------------------------------------------
2017-04-06T01:24:19.986 [INFO] Building Apache Beam :: Runners :: Core Java Construction 0.7.0-SNAPSHOT
2017-04-06T01:24:19.986 [INFO] ------------------------------------------------------------------------
2017-04-06T01:24:20.001 [INFO] 
2017-04-06T01:24:20.001 [INFO] --- maven-clean-plugin:3.0.0:clean (default-clean) @ beam-runners-core-construction-java
---
2017-04-06T01:24:20.002 [INFO] Deleting <https://builds.apache.org/job/beam_PostCommit_Java_MavenInstall/ws/runners/core-construction-java>
(includes = [**/*.pyc, **/*.egg-info/], excludes = [])
2017-04-06T01:24:20.052 [INFO] 
2017-04-06T01:24:20.052 [INFO] --- maven-enforcer-plugin:1.4.1:enforce (enforce) @ beam-runners-core-construction-java
---
2017-04-06T01:24:20.506 [INFO] 
2017-04-06T01:24:20.506 [INFO] --- maven-remote-resources-plugin:1.5:process (process-resource-bundles)
@ beam-runners-core-construction-java ---
2017-04-06T01:24:20.953 [INFO] 
2017-04-06T01:24:20.953 [INFO] --- maven-resources-plugin:2.7:resources (default-resources)
@ beam-runners-core-construction-java ---
2017-04-06T01:24:20.954 [INFO] Using 'UTF-8' encoding to copy filtered resources.
2017-04-06T01:24:20.954 [INFO] skip non existing resourceDirectory <https://builds.apache.org/job/beam_PostCommit_Java_MavenInstall/ws/runners/core-construction-java/src/main/resources>
2017-04-06T01:24:20.954 [INFO] Copying 3 resources
2017-04-06T01:24:21.005 [INFO] 
2017-04-06T01:24:21.005 [INFO] --- maven-compiler-plugin:3.6.1:compile (default-compile) @
beam-runners-core-construction-java ---
2017-04-06T01:24:21.009 [INFO] Changes detected - recompiling the module!
2017-04-06T01:24:21.009 [INFO] Compiling 9 source files to <https://builds.apache.org/job/beam_PostCommit_Java_MavenInstall/ws/runners/core-construction-java/target/classes>
2017-04-06T01:24:21.095 [WARNING] bootstrap class path not set in conjunction with -source
1.7
2017-04-06T01:24:21.095 [INFO] <https://builds.apache.org/job/beam_PostCommit_Java_MavenInstall/ws/runners/core-construction-java/src/main/java/org/apache/beam/runners/core/construction/ReplacementOutputs.java>:
Some input files use or override a deprecated API.
2017-04-06T01:24:21.095 [INFO] <https://builds.apache.org/job/beam_PostCommit_Java_MavenInstall/ws/runners/core-construction-java/src/main/java/org/apache/beam/runners/core/construction/ReplacementOutputs.java>:
Recompile with -Xlint:deprecation for details.
2017-04-06T01:24:21.095 [INFO] <https://builds.apache.org/job/beam_PostCommit_Java_MavenInstall/ws/runners/core-construction-java/src/main/java/org/apache/beam/runners/core/construction/EmptyFlattenAsCreateFactory.java>:
Some input files use unchecked or unsafe operations.
2017-04-06T01:24:21.095 [INFO] <https://builds.apache.org/job/beam_PostCommit_Java_MavenInstall/ws/runners/core-construction-java/src/main/java/org/apache/beam/runners/core/construction/EmptyFlattenAsCreateFactory.java>:
Recompile with -Xlint:unchecked for details.
2017-04-06T01:24:21.145 [INFO] 
2017-04-06T01:24:21.145 [INFO] --- maven-resources-plugin:2.7:testResources (default-testResources)
@ beam-runners-core-construction-java ---
2017-04-06T01:24:21.146 [INFO] Using 'UTF-8' encoding to copy filtered resources.
2017-04-06T01:24:21.146 [INFO] skip non existing resourceDirectory <https://builds.apache.org/job/beam_PostCommit_Java_MavenInstall/ws/runners/core-construction-java/src/test/resources>
2017-04-06T01:24:21.147 [INFO] Copying 3 resources
2017-04-06T01:24:21.197 [INFO] 
2017-04-06T01:24:21.197 [INFO] --- maven-compiler-plugin:3.6.1:testCompile (default-testCompile)
@ beam-runners-core-construction-java ---
2017-04-06T01:24:21.203 [INFO] Changes detected - recompiling the module!
2017-04-06T01:24:21.204 [INFO] Compiling 7 source files to <https://builds.apache.org/job/beam_PostCommit_Java_MavenInstall/ws/runners/core-construction-java/target/test-classes>
2017-04-06T01:24:21.346 [INFO] <https://builds.apache.org/job/beam_PostCommit_Java_MavenInstall/ws/runners/core-construction-java/src/test/java/org/apache/beam/runners/core/construction/PTransformMatchersTest.java>:
<https://builds.apache.org/job/beam_PostCommit_Java_MavenInstall/ws/runners/core-construction-java/src/test/java/org/apache/beam/runners/core/construction/PTransformMatchersTest.java>
uses or overrides a deprecated API.
2017-04-06T01:24:21.347 [INFO] <https://builds.apache.org/job/beam_PostCommit_Java_MavenInstall/ws/runners/core-construction-java/src/test/java/org/apache/beam/runners/core/construction/PTransformMatchersTest.java>:
Recompile with -Xlint:deprecation for details.
2017-04-06T01:24:21.347 [INFO] <https://builds.apache.org/job/beam_PostCommit_Java_MavenInstall/ws/runners/core-construction-java/src/test/java/org/apache/beam/runners/core/construction/PTransformMatchersTest.java>:
Some input files use unchecked or unsafe operations.
2017-04-06T01:24:21.347 [INFO] <https://builds.apache.org/job/beam_PostCommit_Java_MavenInstall/ws/runners/core-construction-java/src/test/java/org/apache/beam/runners/core/construction/PTransformMatchersTest.java>:
Recompile with -Xlint:unchecked for details.
2017-04-06T01:24:21.347 [INFO] -------------------------------------------------------------
2017-04-06T01:24:21.347 [ERROR] COMPILATION ERROR : 
2017-04-06T01:24:21.347 [INFO] -------------------------------------------------------------
2017-04-06T01:24:21.347 [ERROR] <https://builds.apache.org/job/beam_PostCommit_Java_MavenInstall/ws/runners/core-construction-java/src/test/java/org/apache/beam/runners/core/construction/PTransformMatchersTest.java>:[351,69]
<anonymous org.apache.beam.runners.core.construction.PTransformMatchersTest$9> is not
abstract and does not override abstract method getMaterialization() in org.apache.beam.sdk.transforms.ViewFn
2017-04-06T01:24:21.347 [INFO] 1 error
2017-04-06T01:24:21.347 [INFO] -------------------------------------------------------------
[JENKINS] Archiving disabled
2017-04-06T01:24:21.969 [INFO]                                                           
             
2017-04-06T01:24:21.969 [INFO] ------------------------------------------------------------------------
2017-04-06T01:24:21.969 [INFO] Skipping Apache Beam :: Parent
2017-04-06T01:24:21.969 [INFO] This project has been banned from the build due to previous
failures.
2017-04-06T01:24:21.969 [INFO] ------------------------------------------------------------------------
[JENKINS] Archiving disabled
[JENKINS] Archiving disabled
[JENKINS] Archiving disabled
[JENKINS] Archiving disabled
[JENKINS] Archiving disabled
[JENKINS] Archiving disabled
[JENKINS] Archiving disabled
[JENKINS] Archiving disabled
[JENKINS] Archiving disabled
[JENKINS] Archiving disabled
[JENKINS] Archiving disabled
[JENKINS] Archiving disabled
[JENKINS] Archiving disabled
[JENKINS] Archiving disabled
[JENKINS] Archiving disabled
[JENKINS] Archiving disabled
[JENKINS] Archiving disabled
[JENKINS] Archiving disabled
[JENKINS] Archiving disabled
[JENKINS] Archiving disabled
[JENKINS] Archiving disabled
[JENKINS] Archiving disabled
[JENKINS] Archiving disabled
[JENKINS] Archiving disabled
[JENKINS] Archiving disabled
[JENKINS] Archiving disabled
[JENKINS] Archiving disabled
[JENKINS] Archiving disabled
[JENKINS] Archiving disabled
[JENKINS] Archiving disabled
[JENKINS] Archiving disabled
[JENKINS] Archiving disabled
[JENKINS] Archiving disabled
[JENKINS] Archiving disabled
[JENKINS] Archiving disabled
[JENKINS] Archiving disabled
[JENKINS] Archiving disabled
[JENKINS] Archiving disabled
[JENKINS] Archiving disabled
[JENKINS] Archiving disabled
[JENKINS] Archiving disabled
[JENKINS] Archiving disabled
[JENKINS] Archiving disabled
2017-04-06T01:24:31.436 [INFO] ------------------------------------------------------------------------
2017-04-06T01:24:31.436 [INFO] Reactor Summary:
2017-04-06T01:24:31.436 [INFO] 
2017-04-06T01:24:31.436 [INFO] Apache Beam :: Parent .............................. SUCCESS
[ 23.445 s]
2017-04-06T01:24:31.436 [INFO] Apache Beam :: SDKs :: Java :: Build Tools ......... SUCCESS
[ 11.537 s]
2017-04-06T01:24:31.436 [INFO] Apache Beam :: SDKs ................................ SUCCESS
[  5.575 s]
2017-04-06T01:24:31.436 [INFO] Apache Beam :: SDKs :: Common ...................... SUCCESS
[  1.857 s]
2017-04-06T01:24:31.436 [INFO] Apache Beam :: SDKs :: Common :: Fn API ............ SUCCESS
[ 22.580 s]
2017-04-06T01:24:31.436 [INFO] Apache Beam :: SDKs :: Common :: Runner API ........ SUCCESS
[ 13.865 s]
2017-04-06T01:24:31.436 [INFO] Apache Beam :: SDKs :: Java ........................ SUCCESS
[  2.080 s]
2017-04-06T01:24:31.436 [INFO] Apache Beam :: SDKs :: Java :: Core ................ SUCCESS
[03:30 min]
2017-04-06T01:24:31.436 [INFO] Apache Beam :: SDKs :: Java :: IO .................. SUCCESS
[  2.209 s]
2017-04-06T01:24:31.436 [INFO] Apache Beam :: SDKs :: Java :: IO :: Common ........ SUCCESS
[  5.715 s]
2017-04-06T01:24:31.437 [INFO] Apache Beam :: Runners ............................. SUCCESS
[  1.691 s]
2017-04-06T01:24:31.437 [INFO] Apache Beam :: Runners :: Core Java Construction ... FAILURE
[  1.557 s]
2017-04-06T01:24:31.437 [INFO] Apache Beam :: Runners :: Core Java ................ SKIPPED
2017-04-06T01:24:31.437 [INFO] Apache Beam :: Runners :: Direct Java .............. SKIPPED
2017-04-06T01:24:31.437 [INFO] Apache Beam :: SDKs :: Java :: IO :: Elasticsearch . SKIPPED
2017-04-06T01:24:31.437 [INFO] Apache Beam :: Runners :: Google Cloud Dataflow .... SKIPPED
2017-04-06T01:24:31.437 [INFO] Apache Beam :: SDKs :: Java :: IO :: Google Cloud Platform
SKIPPED
2017-04-06T01:24:31.437 [INFO] Apache Beam :: SDKs :: Java :: IO :: Hadoop Common . SKIPPED
2017-04-06T01:24:31.437 [INFO] Apache Beam :: SDKs :: Java :: IO :: HBase ......... SKIPPED
2017-04-06T01:24:31.437 [INFO] Apache Beam :: SDKs :: Java :: IO :: HDFS .......... SKIPPED
2017-04-06T01:24:31.437 [INFO] Apache Beam :: SDKs :: Java :: IO :: JDBC .......... SKIPPED
2017-04-06T01:24:31.437 [INFO] Apache Beam :: SDKs :: Java :: IO :: JMS ........... SKIPPED
2017-04-06T01:24:31.437 [INFO] Apache Beam :: SDKs :: Java :: IO :: Kafka ......... SKIPPED
2017-04-06T01:24:31.437 [INFO] Apache Beam :: SDKs :: Java :: IO :: Kinesis ....... SKIPPED
2017-04-06T01:24:31.437 [INFO] Apache Beam :: SDKs :: Java :: IO :: MongoDB ....... SKIPPED
2017-04-06T01:24:31.437 [INFO] Apache Beam :: SDKs :: Java :: IO :: MQTT .......... SKIPPED
2017-04-06T01:24:31.437 [INFO] Apache Beam :: SDKs :: Java :: Maven Archetypes .... SKIPPED
2017-04-06T01:24:31.437 [INFO] Apache Beam :: SDKs :: Java :: Maven Archetypes :: Starter
SKIPPED
2017-04-06T01:24:31.437 [INFO] Apache Beam :: SDKs :: Java :: Maven Archetypes :: Examples
SKIPPED
2017-04-06T01:24:31.437 [INFO] Apache Beam :: SDKs :: Java :: Maven Archetypes :: Examples
- Java 8 SKIPPED
2017-04-06T01:24:31.437 [INFO] Apache Beam :: SDKs :: Java :: Extensions .......... SKIPPED
2017-04-06T01:24:31.437 [INFO] Apache Beam :: SDKs :: Java :: Extensions :: Jackson SKIPPED
2017-04-06T01:24:31.437 [INFO] Apache Beam :: SDKs :: Java :: Extensions :: Join library SKIPPED
2017-04-06T01:24:31.437 [INFO] Apache Beam :: SDKs :: Java :: Extensions :: Sorter  SKIPPED
2017-04-06T01:24:31.437 [INFO] Apache Beam :: SDKs :: Java :: Harness ............. SKIPPED
2017-04-06T01:24:31.437 [INFO] Apache Beam :: SDKs :: Java :: Java 8 Tests ........ SKIPPED
2017-04-06T01:24:31.437 [INFO] Apache Beam :: SDKs :: Python ...................... SKIPPED
2017-04-06T01:24:31.437 [INFO] Apache Beam :: Runners :: Flink .................... SKIPPED
2017-04-06T01:24:31.437 [INFO] Apache Beam :: Runners :: Flink :: Core ............ SKIPPED
2017-04-06T01:24:31.437 [INFO] Apache Beam :: Runners :: Flink :: Examples ........ SKIPPED
2017-04-06T01:24:31.437 [INFO] Apache Beam :: Runners :: Spark .................... SKIPPED
2017-04-06T01:24:31.437 [INFO] Apache Beam :: Runners :: Apex ..................... SKIPPED
2017-04-06T01:24:31.437 [INFO] Apache Beam :: Examples ............................ SKIPPED
2017-04-06T01:24:31.437 [INFO] Apache Beam :: Examples :: Java .................... SKIPPED
2017-04-06T01:24:31.437 [INFO] Apache Beam :: Examples :: Java 8 .................. SKIPPED
2017-04-06T01:24:31.437 [INFO] Apache Beam :: SDKs :: Java :: Aggregated Javadoc .. SKIPPED
2017-04-06T01:24:31.437 [INFO] ------------------------------------------------------------------------
2017-04-06T01:24:31.437 [INFO] BUILD FAILURE
2017-04-06T01:24:31.437 [INFO] ------------------------------------------------------------------------
2017-04-06T01:24:31.437 [INFO] Total time: 05:28 min
2017-04-06T01:24:31.437 [INFO] Finished at: 2017-04-06T01:24:31+00:00
2017-04-06T01:24:32.048 [INFO] Final Memory: 195M/1493M
2017-04-06T01:24:32.048 [INFO] ------------------------------------------------------------------------
2017-04-06T01:24:32.053 [ERROR] Failed to execute goal org.apache.maven.plugins:maven-compiler-plugin:3.6.1:testCompile
(default-testCompile) on project beam-runners-core-construction-java: Compilation failure
2017-04-06T01:24:32.053 [ERROR] <https://builds.apache.org/job/beam_PostCommit_Java_MavenInstall/ws/runners/core-construction-java/src/test/java/org/apache/beam/runners/core/construction/PTransformMatchersTest.java>:[351,69]
<anonymous org.apache.beam.runners.core.construction.PTransformMatchersTest$9> is not
abstract and does not override abstract method getMaterialization() in org.apache.beam.sdk.transforms.ViewFn
2017-04-06T01:24:32.053 [ERROR] -> [Help 1]
org.apache.maven.lifecycle.LifecycleExecutionException: Failed to execute goal org.apache.maven.plugins:maven-compiler-plugin:3.6.1:testCompile
(default-testCompile) on project beam-runners-core-construction-java: Compilation failure
<https://builds.apache.org/job/beam_PostCommit_Java_MavenInstall/ws/runners/core-construction-java/src/test/java/org/apache/beam/runners/core/construction/PTransformMatchersTest.java>:[351,69]
<anonymous org.apache.beam.runners.core.construction.PTransformMatchersTest$9> is not
abstract and does not override abstract method getMaterialization() in org.apache.beam.sdk.transforms.ViewFn

	at org.apache.maven.lifecycle.internal.MojoExecutor.execute(MojoExecutor.java:212)
	at org.apache.maven.lifecycle.internal.MojoExecutor.execute(MojoExecutor.java:153)
	at org.apache.maven.lifecycle.internal.MojoExecutor.execute(MojoExecutor.java:145)
	at org.apache.maven.lifecycle.internal.LifecycleModuleBuilder.buildProject(LifecycleModuleBuilder.java:116)
	at org.apache.maven.lifecycle.internal.LifecycleModuleBuilder.buildProject(LifecycleModuleBuilder.java:80)
	at org.apache.maven.lifecycle.internal.builder.singlethreaded.SingleThreadedBuilder.build(SingleThreadedBuilder.java:51)
	at org.apache.maven.lifecycle.internal.LifecycleStarter.execute(LifecycleStarter.java:128)
	at org.apache.maven.DefaultMaven.doExecute(DefaultMaven.java:307)
	at org.apache.maven.DefaultMaven.doExecute(DefaultMaven.java:193)
	at org.apache.maven.DefaultMaven.execute(DefaultMaven.java:106)
	at org.jvnet.hudson.maven3.launcher.Maven33Launcher.main(Maven33Launcher.java:129)
	at sun.reflect.NativeMethodAccessorImpl.invoke0(Native Method)
	at sun.reflect.NativeMethodAccessorImpl.invoke(NativeMethodAccessorImpl.java:62)
	at sun.reflect.DelegatingMethodAccessorImpl.invoke(DelegatingMethodAccessorImpl.java:43)
	at java.lang.reflect.Method.invoke(Method.java:498)
	at org.codehaus.plexus.classworlds.launcher.Launcher.launchStandard(Launcher.java:330)
	at org.codehaus.plexus.classworlds.launcher.Launcher.launch(Launcher.java:238)
	at jenkins.maven3.agent.Maven33Main.launch(Maven33Main.java:176)
	at sun.reflect.NativeMethodAccessorImpl.invoke0(Native Method)
	at sun.reflect.NativeMethodAccessorImpl.invoke(NativeMethodAccessorImpl.java:62)
	at sun.reflect.DelegatingMethodAccessorImpl.invoke(DelegatingMethodAccessorImpl.java:43)
	at java.lang.reflect.Method.invoke(Method.java:498)
	at hudson.maven.Maven3Builder.call(Maven3Builder.java:139)
	at hudson.maven.Maven3Builder.call(Maven3Builder.java:70)
	at hudson.remoting.UserRequest.perform(UserRequest.java:153)
	at hudson.remoting.UserRequest.perform(UserRequest.java:50)
	at hudson.remoting.Request$2.run(Request.java:336)
	at hudson.remoting.InterceptingExecutorService$1.call(InterceptingExecutorService.java:68)
	at java.util.concurrent.FutureTask.run(FutureTask.java:266)
	at java.util.concurrent.ThreadPoolExecutor.runWorker(ThreadPoolExecutor.java:1142)
	at java.util.concurrent.ThreadPoolExecutor$Worker.run(ThreadPoolExecutor.java:617)
	at java.lang.Thread.run(Thread.java:745)
Caused by: org.apache.maven.plugin.compiler.CompilationFailureException: Compilation failure
<https://builds.apache.org/job/beam_PostCommit_Java_MavenInstall/ws/runners/core-construction-java/src/test/java/org/apache/beam/runners/core/construction/PTransformMatchersTest.java>:[351,69]
<anonymous org.apache.beam.runners.core.construction.PTransformMatchersTest$9> is not
abstract and does not override abstract method getMaterialization() in org.apache.beam.sdk.transforms.ViewFn

	at org.apache.maven.plugin.compiler.AbstractCompilerMojo.execute(AbstractCompilerMojo.java:1029)
	at org.apache.maven.plugin.compiler.TestCompilerMojo.execute(TestCompilerMojo.java:170)
	at org.apache.maven.plugin.DefaultBuildPluginManager.executeMojo(DefaultBuildPluginManager.java:134)
	at org.apache.maven.lifecycle.internal.MojoExecutor.execute(MojoExecutor.java:208)
	... 31 more
2017-04-06T01:24:32.053 [ERROR] 
2017-04-06T01:24:32.053 [ERROR] Re-run Maven using the -X switch to enable full debug logging.
2017-04-06T01:24:32.054 [ERROR] 
2017-04-06T01:24:32.054 [ERROR] For more information about the errors and possible solutions,
please read the following articles:
2017-04-06T01:24:32.054 [ERROR] [Help 1] http://cwiki.apache.org/confluence/display/MAVEN/MojoFailureException
2017-04-06T01:24:32.054 [ERROR] 
2017-04-06T01:24:32.054 [ERROR] After correcting the problems, you can resume the build with
the command
2017-04-06T01:24:32.054 [ERROR]   mvn <goals> -rf :beam-runners-core-construction-java
channel stopped

Mime
View raw message