beam-commits mailing list archives

Site index · List index
Message view « Date » · « Thread »
Top « Date » · « Thread »
From Apache Jenkins Server <jenk...@builds.apache.org>
Subject Build failed in Jenkins: beam_PostCommit_Java_MavenInstall #3150
Date Tue, 04 Apr 2017 01:05:46 GMT
See <https://builds.apache.org/job/beam_PostCommit_Java_MavenInstall/3150/display/redirect?page=changes>

Changes:

[tgroh] Remove GetProducingTransformInternal

------------------------------------------
[...truncated 718.69 KB...]
-------------------------------------------------------
Running org.apache.beam.sdk.io.gcp.GcpApiSurfaceTest
Tests run: 1, Failures: 0, Errors: 0, Skipped: 0, Time elapsed: 3.62 sec - in org.apache.beam.sdk.io.gcp.GcpApiSurfaceTest
Running org.apache.beam.sdk.io.gcp.bigquery.BigQueryTableRowIteratorTest
Tests run: 3, Failures: 0, Errors: 0, Skipped: 0, Time elapsed: 5.538 sec - in org.apache.beam.sdk.io.gcp.bigquery.BigQueryTableRowIteratorTest
Running org.apache.beam.sdk.io.gcp.bigquery.BigQueryAvroUtilsTest
Tests run: 2, Failures: 0, Errors: 0, Skipped: 0, Time elapsed: 2.287 sec - in org.apache.beam.sdk.io.gcp.bigquery.BigQueryAvroUtilsTest
Running org.apache.beam.sdk.io.gcp.bigquery.BigQueryIOTest
Tests run: 71, Failures: 0, Errors: 0, Skipped: 4, Time elapsed: 6.228 sec - in org.apache.beam.sdk.io.gcp.bigquery.BigQueryIOTest
Running org.apache.beam.sdk.io.gcp.bigquery.BigQueryUtilTest
Tests run: 7, Failures: 0, Errors: 0, Skipped: 0, Time elapsed: 5.839 sec - in org.apache.beam.sdk.io.gcp.bigquery.BigQueryUtilTest
Running org.apache.beam.sdk.io.gcp.bigquery.BigQueryServicesImplTest
Tests run: 24, Failures: 0, Errors: 0, Skipped: 0, Time elapsed: 0.17 sec - in org.apache.beam.sdk.io.gcp.bigquery.BigQueryServicesImplTest
Running org.apache.beam.sdk.io.gcp.bigtable.BigtableIOTest
Tests run: 27, Failures: 0, Errors: 0, Skipped: 0, Time elapsed: 5.925 sec - in org.apache.beam.sdk.io.gcp.bigtable.BigtableIOTest
Running org.apache.beam.sdk.io.gcp.datastore.DatastoreV1Test
Tests run: 56, Failures: 0, Errors: 0, Skipped: 0, Time elapsed: 0.267 sec - in org.apache.beam.sdk.io.gcp.datastore.DatastoreV1Test
Running org.apache.beam.sdk.io.gcp.storage.GcsFileSystemRegistrarTest
Tests run: 1, Failures: 0, Errors: 0, Skipped: 0, Time elapsed: 0.002 sec - in org.apache.beam.sdk.io.gcp.storage.GcsFileSystemRegistrarTest
Running org.apache.beam.sdk.io.gcp.storage.GcsResourceIdTest
Tests run: 8, Failures: 0, Errors: 0, Skipped: 0, Time elapsed: 0 sec - in org.apache.beam.sdk.io.gcp.storage.GcsResourceIdTest
Running org.apache.beam.sdk.io.gcp.storage.GcsFileSystemTest
Tests run: 5, Failures: 0, Errors: 0, Skipped: 0, Time elapsed: 0.022 sec - in org.apache.beam.sdk.io.gcp.storage.GcsFileSystemTest

Results :

Tests run: 205, Failures: 0, Errors: 0, Skipped: 4

[JENKINS] Recording test results
2017-04-04T01:01:04.981 [INFO] 
2017-04-04T01:01:04.981 [INFO] --- build-helper-maven-plugin:3.0.0:regex-properties (render-artifact-id)
@ beam-sdks-java-io-google-cloud-platform ---
2017-04-04T01:01:05.213 [INFO] 
2017-04-04T01:01:05.213 [INFO] --- maven-jar-plugin:3.0.2:jar (default-jar) @ beam-sdks-java-io-google-cloud-platform
---
2017-04-04T01:01:05.234 [INFO] Building jar: <https://builds.apache.org/job/beam_PostCommit_Java_MavenInstall/ws/sdks/java/io/google-cloud-platform/target/beam-sdks-java-io-google-cloud-platform-0.7.0-SNAPSHOT.jar>
2017-04-04T01:01:05.300 [INFO] 
2017-04-04T01:01:05.300 [INFO] --- maven-site-plugin:3.5.1:attach-descriptor (attach-descriptor)
@ beam-sdks-java-io-google-cloud-platform ---
2017-04-04T01:01:05.350 [INFO] 
2017-04-04T01:01:05.350 [INFO] --- maven-javadoc-plugin:2.10.4:jar (attach-javadocs) @ beam-sdks-java-io-google-cloud-platform
---
2017-04-04T01:01:08.336 [INFO] Building jar: <https://builds.apache.org/job/beam_PostCommit_Java_MavenInstall/ws/sdks/java/io/google-cloud-platform/target/beam-sdks-java-io-google-cloud-platform-0.7.0-SNAPSHOT-javadoc.jar>
2017-04-04T01:01:08.400 [INFO] 
2017-04-04T01:01:08.400 [INFO] --- maven-source-plugin:3.0.1:jar-no-fork (attach-sources)
@ beam-sdks-java-io-google-cloud-platform ---
2017-04-04T01:01:08.404 [INFO] Building jar: <https://builds.apache.org/job/beam_PostCommit_Java_MavenInstall/ws/sdks/java/io/google-cloud-platform/target/beam-sdks-java-io-google-cloud-platform-0.7.0-SNAPSHOT-sources.jar>
2017-04-04T01:01:08.470 [INFO] 
2017-04-04T01:01:08.470 [INFO] --- maven-source-plugin:3.0.1:test-jar-no-fork (attach-test-sources)
@ beam-sdks-java-io-google-cloud-platform ---
2017-04-04T01:01:08.473 [INFO] Building jar: <https://builds.apache.org/job/beam_PostCommit_Java_MavenInstall/ws/sdks/java/io/google-cloud-platform/target/beam-sdks-java-io-google-cloud-platform-0.7.0-SNAPSHOT-test-sources.jar>
2017-04-04T01:01:08.587 [INFO] 
2017-04-04T01:01:08.587 [INFO] --- maven-jar-plugin:3.0.2:test-jar (default-test-jar) @ beam-sdks-java-io-google-cloud-platform
---
2017-04-04T01:01:08.626 [INFO] Building jar: <https://builds.apache.org/job/beam_PostCommit_Java_MavenInstall/ws/sdks/java/io/google-cloud-platform/target/beam-sdks-java-io-google-cloud-platform-0.7.0-SNAPSHOT-tests.jar>
2017-04-04T01:01:08.689 [INFO] 
2017-04-04T01:01:08.689 [INFO] --- maven-failsafe-plugin:2.19.1:integration-test (default)
@ beam-sdks-java-io-google-cloud-platform ---
2017-04-04T01:01:08.893 [INFO] Failsafe report directory: <https://builds.apache.org/job/beam_PostCommit_Java_MavenInstall/ws/sdks/java/io/google-cloud-platform/target/failsafe-reports>
2017-04-04T01:01:08.898 [INFO] parallel='all', perCoreThreadCount=true, threadCount=4, useUnlimitedThreads=false,
threadCountSuites=0, threadCountClasses=0, threadCountMethods=0, parallelOptimized=true

-------------------------------------------------------
 T E S T S
-------------------------------------------------------
Running org.apache.beam.sdk.io.gcp.bigtable.BigtableReadIT
Tests run: 1, Failures: 0, Errors: 0, Skipped: 0, Time elapsed: 257.071 sec - in org.apache.beam.sdk.io.gcp.bigtable.BigtableReadIT
Running org.apache.beam.sdk.io.gcp.datastore.SplitQueryFnIT
Tests run: 2, Failures: 0, Errors: 0, Skipped: 0, Time elapsed: 5.289 sec - in org.apache.beam.sdk.io.gcp.datastore.SplitQueryFnIT
Running org.apache.beam.sdk.io.gcp.datastore.V1WriteIT
Tests run: 1, Failures: 0, Errors: 0, Skipped: 0, Time elapsed: 225.865 sec - in org.apache.beam.sdk.io.gcp.datastore.V1WriteIT
Running org.apache.beam.sdk.io.gcp.bigtable.BigtableWriteIT
Tests run: 1, Failures: 0, Errors: 0, Skipped: 0, Time elapsed: 217.177 sec - in org.apache.beam.sdk.io.gcp.bigtable.BigtableWriteIT
Running org.apache.beam.sdk.io.gcp.datastore.V1ReadIT
Tests run: 3, Failures: 0, Errors: 0, Skipped: 0, Time elapsed: 253.765 sec - in org.apache.beam.sdk.io.gcp.datastore.V1ReadIT

Results :

Tests run: 8, Failures: 0, Errors: 0, Skipped: 0

[WARNING] Cannot calculate digest of mojo class, because mojo wasn't loaded from a jar, but
from: <https://builds.apache.org/job/beam_PostCommit_Java_MavenInstall/ws/.repository/org/apache/maven/plugins/maven-failsafe-plugin/2.19.1/maven-failsafe-plugin-2.19.1.jar>
[JENKINS] Recording test results
2017-04-04T01:05:27.737 [INFO] 
2017-04-04T01:05:27.737 [INFO] --- maven-failsafe-plugin:2.19.1:verify (default) @ beam-sdks-java-io-google-cloud-platform
---
2017-04-04T01:05:27.739 [INFO] Failsafe report directory: <https://builds.apache.org/job/beam_PostCommit_Java_MavenInstall/ws/sdks/java/io/google-cloud-platform/target/failsafe-reports>
[WARNING] Cannot calculate digest of mojo class, because mojo wasn't loaded from a jar, but
from: <https://builds.apache.org/job/beam_PostCommit_Java_MavenInstall/ws/.repository/org/apache/maven/plugins/maven-failsafe-plugin/2.19.1/maven-failsafe-plugin-2.19.1.jar>
[JENKINS] Recording test results2017-04-04T01:05:27.791 [INFO] 
2017-04-04T01:05:27.791 [INFO] --- maven-dependency-plugin:3.0.0:analyze-only (default) @
beam-sdks-java-io-google-cloud-platform ---
[WARNING] Cannot calculate digest of mojo class, because mojo wasn't loaded from a jar, but
from: <https://builds.apache.org/job/beam_PostCommit_Java_MavenInstall/ws/.repository/org/apache/maven/plugins/maven-dependency-plugin/3.0.0/maven-dependency-plugin-3.0.0.jar>

[JENKINS] Archiving disabled
2017-04-04T01:05:28.565 [INFO]                                                           
             
2017-04-04T01:05:28.565 [INFO] ------------------------------------------------------------------------
2017-04-04T01:05:28.565 [INFO] Skipping Apache Beam :: Parent
2017-04-04T01:05:28.565 [INFO] This project has been banned from the build due to previous
failures.
2017-04-04T01:05:28.565 [INFO] ------------------------------------------------------------------------
[JENKINS] Archiving disabled
[JENKINS] Archiving disabled
[JENKINS] Archiving disabled
[JENKINS] Archiving disabled
[JENKINS] Archiving disabled
[JENKINS] Archiving disabled
[JENKINS] Archiving disabled
[JENKINS] Archiving disabled
[JENKINS] Archiving disabled
[JENKINS] Archiving disabled
[JENKINS] Archiving disabled
[JENKINS] Archiving disabled
[JENKINS] Archiving disabled
[JENKINS] Archiving disabled
[JENKINS] Archiving disabled
[JENKINS] Archiving disabled
[JENKINS] Archiving disabled
[JENKINS] Archiving disabled
[JENKINS] Archiving disabled
[JENKINS] Archiving disabled
[JENKINS] Archiving disabled
[JENKINS] Archiving disabled
[JENKINS] Archiving disabled
[JENKINS] Archiving disabled
[JENKINS] Archiving disabled
[JENKINS] Archiving disabled
[JENKINS] Archiving disabled
[JENKINS] Archiving disabled
[JENKINS] Archiving disabled
[JENKINS] Archiving disabled
[JENKINS] Archiving disabled
[JENKINS] Archiving disabled
[JENKINS] Archiving disabled
[JENKINS] Archiving disabled
[JENKINS] Archiving disabled
[JENKINS] Archiving disabled
[JENKINS] Archiving disabled
[JENKINS] Archiving disabled
[JENKINS] Archiving disabled
[JENKINS] Archiving disabled
[JENKINS] Archiving disabled
[JENKINS] Archiving disabled
[JENKINS] Archiving disabled
2017-04-04T01:05:40.410 [INFO] ------------------------------------------------------------------------
2017-04-04T01:05:40.410 [INFO] Reactor Summary:
2017-04-04T01:05:40.410 [INFO] 
2017-04-04T01:05:40.410 [INFO] Apache Beam :: Parent .............................. SUCCESS
[ 37.185 s]
2017-04-04T01:05:40.410 [INFO] Apache Beam :: SDKs :: Java :: Build Tools ......... SUCCESS
[ 15.860 s]
2017-04-04T01:05:40.410 [INFO] Apache Beam :: SDKs ................................ SUCCESS
[  5.209 s]
2017-04-04T01:05:40.410 [INFO] Apache Beam :: SDKs :: Common ...................... SUCCESS
[  1.407 s]
2017-04-04T01:05:40.410 [INFO] Apache Beam :: SDKs :: Common :: Fn API ............ SUCCESS
[ 22.946 s]
2017-04-04T01:05:40.410 [INFO] Apache Beam :: SDKs :: Common :: Runner API ........ SUCCESS
[ 13.391 s]
2017-04-04T01:05:40.410 [INFO] Apache Beam :: SDKs :: Java ........................ SUCCESS
[  2.023 s]
2017-04-04T01:05:40.410 [INFO] Apache Beam :: SDKs :: Java :: Core ................ SUCCESS
[03:14 min]
2017-04-04T01:05:40.410 [INFO] Apache Beam :: SDKs :: Java :: IO .................. SUCCESS
[  1.642 s]
2017-04-04T01:05:40.410 [INFO] Apache Beam :: SDKs :: Java :: IO :: Common ........ SUCCESS
[  4.683 s]
2017-04-04T01:05:40.410 [INFO] Apache Beam :: Runners ............................. SUCCESS
[  3.535 s]
2017-04-04T01:05:40.410 [INFO] Apache Beam :: Runners :: Core Java Construction ... SUCCESS
[ 18.485 s]
2017-04-04T01:05:40.410 [INFO] Apache Beam :: Runners :: Core Java ................ SUCCESS
[01:04 min]
2017-04-04T01:05:40.410 [INFO] Apache Beam :: Runners :: Direct Java .............. SUCCESS
[03:19 min]
2017-04-04T01:05:40.410 [INFO] Apache Beam :: SDKs :: Java :: IO :: Elasticsearch . SUCCESS
[ 48.880 s]
2017-04-04T01:05:40.410 [INFO] Apache Beam :: Runners :: Google Cloud Dataflow .... SUCCESS
[ 46.135 s]
2017-04-04T01:05:40.410 [INFO] Apache Beam :: SDKs :: Java :: IO :: Google Cloud Platform
FAILURE [05:20 min]
2017-04-04T01:05:40.410 [INFO] Apache Beam :: SDKs :: Java :: IO :: Hadoop Common . SKIPPED
2017-04-04T01:05:40.410 [INFO] Apache Beam :: SDKs :: Java :: IO :: HBase ......... SKIPPED
2017-04-04T01:05:40.410 [INFO] Apache Beam :: SDKs :: Java :: IO :: HDFS .......... SKIPPED
2017-04-04T01:05:40.410 [INFO] Apache Beam :: SDKs :: Java :: IO :: JDBC .......... SKIPPED
2017-04-04T01:05:40.410 [INFO] Apache Beam :: SDKs :: Java :: IO :: JMS ........... SKIPPED
2017-04-04T01:05:40.410 [INFO] Apache Beam :: SDKs :: Java :: IO :: Kafka ......... SKIPPED
2017-04-04T01:05:40.410 [INFO] Apache Beam :: SDKs :: Java :: IO :: Kinesis ....... SKIPPED
2017-04-04T01:05:40.410 [INFO] Apache Beam :: SDKs :: Java :: IO :: MongoDB ....... SKIPPED
2017-04-04T01:05:40.410 [INFO] Apache Beam :: SDKs :: Java :: IO :: MQTT .......... SKIPPED
2017-04-04T01:05:40.410 [INFO] Apache Beam :: SDKs :: Java :: Maven Archetypes .... SKIPPED
2017-04-04T01:05:40.410 [INFO] Apache Beam :: SDKs :: Java :: Maven Archetypes :: Starter
SKIPPED
2017-04-04T01:05:40.410 [INFO] Apache Beam :: SDKs :: Java :: Maven Archetypes :: Examples
SKIPPED
2017-04-04T01:05:40.410 [INFO] Apache Beam :: SDKs :: Java :: Maven Archetypes :: Examples
- Java 8 SKIPPED
2017-04-04T01:05:40.410 [INFO] Apache Beam :: SDKs :: Java :: Extensions .......... SKIPPED
2017-04-04T01:05:40.410 [INFO] Apache Beam :: SDKs :: Java :: Extensions :: Jackson SKIPPED
2017-04-04T01:05:40.410 [INFO] Apache Beam :: SDKs :: Java :: Extensions :: Join library SKIPPED
2017-04-04T01:05:40.410 [INFO] Apache Beam :: SDKs :: Java :: Extensions :: Sorter  SKIPPED
2017-04-04T01:05:40.410 [INFO] Apache Beam :: SDKs :: Java :: Harness ............. SKIPPED
2017-04-04T01:05:40.410 [INFO] Apache Beam :: SDKs :: Java :: Java 8 Tests ........ SKIPPED
2017-04-04T01:05:40.410 [INFO] Apache Beam :: SDKs :: Python ...................... SKIPPED
2017-04-04T01:05:40.410 [INFO] Apache Beam :: Runners :: Flink .................... SKIPPED
2017-04-04T01:05:40.410 [INFO] Apache Beam :: Runners :: Flink :: Core ............ SKIPPED
2017-04-04T01:05:40.410 [INFO] Apache Beam :: Runners :: Flink :: Examples ........ SKIPPED
2017-04-04T01:05:40.410 [INFO] Apache Beam :: Runners :: Spark .................... SKIPPED
2017-04-04T01:05:40.410 [INFO] Apache Beam :: Runners :: Apex ..................... SKIPPED
2017-04-04T01:05:40.410 [INFO] Apache Beam :: Examples ............................ SKIPPED
2017-04-04T01:05:40.410 [INFO] Apache Beam :: Examples :: Java .................... SKIPPED
2017-04-04T01:05:40.410 [INFO] Apache Beam :: Examples :: Java 8 .................. SKIPPED
2017-04-04T01:05:40.411 [INFO] Apache Beam :: SDKs :: Java :: Aggregated Javadoc .. SKIPPED
2017-04-04T01:05:40.411 [INFO] ------------------------------------------------------------------------
2017-04-04T01:05:40.411 [INFO] BUILD FAILURE
2017-04-04T01:05:40.411 [INFO] ------------------------------------------------------------------------
2017-04-04T01:05:40.411 [INFO] Total time: 17:20 min
2017-04-04T01:05:40.411 [INFO] Finished at: 2017-04-04T01:05:40+00:00
2017-04-04T01:05:40.983 [INFO] Final Memory: 147M/1395M
2017-04-04T01:05:40.983 [INFO] ------------------------------------------------------------------------
Waiting for Jenkins to finish collecting data2017-04-04T01:05:41.139 [ERROR] Failed to execute
goal org.apache.maven.plugins:maven-dependency-plugin:3.0.0:analyze-only (default) on project
beam-sdks-java-io-google-cloud-platform: Cannot analyze dependencies: <https://builds.apache.org/job/beam_PostCommit_Java_MavenInstall/ws/.repository/io/grpc/grpc-auth/1.0.1/grpc-auth-1.0.1.jar>
(No such file or directory) -> [Help 1]
org.apache.maven.lifecycle.LifecycleExecutionException: Failed to execute goal org.apache.maven.plugins:maven-dependency-plugin:3.0.0:analyze-only
(default) on project beam-sdks-java-io-google-cloud-platform: Cannot analyze dependencies
	at org.apache.maven.lifecycle.internal.MojoExecutor.execute(MojoExecutor.java:216)
	at org.apache.maven.lifecycle.internal.MojoExecutor.execute(MojoExecutor.java:153)
	at org.apache.maven.lifecycle.internal.MojoExecutor.execute(MojoExecutor.java:145)
	at org.apache.maven.lifecycle.internal.LifecycleModuleBuilder.buildProject(LifecycleModuleBuilder.java:116)
	at org.apache.maven.lifecycle.internal.LifecycleModuleBuilder.buildProject(LifecycleModuleBuilder.java:80)
	at org.apache.maven.lifecycle.internal.builder.singlethreaded.SingleThreadedBuilder.build(SingleThreadedBuilder.java:51)
	at org.apache.maven.lifecycle.internal.LifecycleStarter.execute(LifecycleStarter.java:128)
	at org.apache.maven.DefaultMaven.doExecute(DefaultMaven.java:307)
	at org.apache.maven.DefaultMaven.doExecute(DefaultMaven.java:193)
	at org.apache.maven.DefaultMaven.execute(DefaultMaven.java:106)
	at org.jvnet.hudson.maven3.launcher.Maven33Launcher.main(Maven33Launcher.java:129)
	at sun.reflect.NativeMethodAccessorImpl.invoke0(Native Method)
	at sun.reflect.NativeMethodAccessorImpl.invoke(NativeMethodAccessorImpl.java:62)
	at sun.reflect.DelegatingMethodAccessorImpl.invoke(DelegatingMethodAccessorImpl.java:43)
	at java.lang.reflect.Method.invoke(Method.java:498)
	at org.codehaus.plexus.classworlds.launcher.Launcher.launchStandard(Launcher.java:330)
	at org.codehaus.plexus.classworlds.launcher.Launcher.launch(Launcher.java:238)
	at jenkins.maven3.agent.Maven33Main.launch(Maven33Main.java:176)
	at sun.reflect.NativeMethodAccessorImpl.invoke0(Native Method)
	at sun.reflect.NativeMethodAccessorImpl.invoke(NativeMethodAccessorImpl.java:62)
	at sun.reflect.DelegatingMethodAccessorImpl.invoke(DelegatingMethodAccessorImpl.java:43)
	at java.lang.reflect.Method.invoke(Method.java:498)
	at hudson.maven.Maven3Builder.call(Maven3Builder.java:139)
	at hudson.maven.Maven3Builder.call(Maven3Builder.java:70)
	at hudson.remoting.UserRequest.perform(UserRequest.java:153)
	at hudson.remoting.UserRequest.perform(UserRequest.java:50)
	at hudson.remoting.Request$2.run(Request.java:336)
	at hudson.remoting.InterceptingExecutorService$1.call(InterceptingExecutorService.java:68)
	at java.util.concurrent.FutureTask.run(FutureTask.java:266)
	at java.util.concurrent.ThreadPoolExecutor.runWorker(ThreadPoolExecutor.java:1142)
	at java.util.concurrent.ThreadPoolExecutor$Worker.run(ThreadPoolExecutor.java:617)
	at java.lang.Thread.run(Thread.java:745)
Caused by: org.apache.maven.plugin.MojoExecutionException: Cannot analyze dependencies
	at org.apache.maven.plugins.dependency.analyze.AbstractAnalyzeMojo.checkDependencies(AbstractAnalyzeMojo.java:315)
	at org.apache.maven.plugins.dependency.analyze.AbstractAnalyzeMojo.execute(AbstractAnalyzeMojo.java:257)
	at org.apache.maven.plugin.DefaultBuildPluginManager.executeMojo(DefaultBuildPluginManager.java:134)
	at org.apache.maven.lifecycle.internal.MojoExecutor.execute(MojoExecutor.java:208)
	... 31 more
Caused by: org.apache.maven.shared.dependency.analyzer.ProjectDependencyAnalyzerException:
Cannot analyze dependencies
	at org.apache.maven.shared.dependency.analyzer.DefaultProjectDependencyAnalyzer.analyze(DefaultProjectDependencyAnalyzer.java:94)
	at org.apache.maven.plugins.dependency.analyze.AbstractAnalyzeMojo.checkDependencies(AbstractAnalyzeMojo.java:306)
	... 34 more
Caused by: java.io.FileNotFoundException: <https://builds.apache.org/job/beam_PostCommit_Java_MavenInstall/ws/.repository/io/grpc/grpc-auth/1.0.1/grpc-auth-1.0.1.jar>
(No such file or directory)
	at java.util.zip.ZipFile.open(Native Method)
	at java.util.zip.ZipFile.<init>(ZipFile.java:219)
	at java.util.zip.ZipFile.<init>(ZipFile.java:149)
	at java.util.jar.JarFile.<init>(JarFile.java:166)
	at java.util.jar.JarFile.<init>(JarFile.java:130)
	at org.apache.maven.shared.dependency.analyzer.DefaultProjectDependencyAnalyzer.buildArtifactClassMap(DefaultProjectDependencyAnalyzer.java:149)
	at org.apache.maven.shared.dependency.analyzer.DefaultProjectDependencyAnalyzer.analyze(DefaultProjectDependencyAnalyzer.java:72)
	... 35 more
2017-04-04T01:05:41.140 [ERROR] 
2017-04-04T01:05:41.140 [ERROR] Re-run Maven using the -X switch to enable full debug logging.
2017-04-04T01:05:41.140 [ERROR] 
2017-04-04T01:05:41.140 [ERROR] For more information about the errors and possible solutions,
please read the following articles:
2017-04-04T01:05:41.140 [ERROR] [Help 1] http://cwiki.apache.org/confluence/display/MAVEN/MojoExecutionException
2017-04-04T01:05:41.140 [ERROR] 
2017-04-04T01:05:41.140 [ERROR] After correcting the problems, you can resume the build with
the command
2017-04-04T01:05:41.140 [ERROR]   mvn <goals> -rf :beam-sdks-java-io-google-cloud-platform

channel stopped

Mime
View raw message