beam-commits mailing list archives

Site index · List index
Message view « Date » · « Thread »
Top « Date » · « Thread »
From Apache Jenkins Server <jenk...@builds.apache.org>
Subject Build failed in Jenkins: beam_PostCommit_Java_MavenInstall #3395
Date Thu, 20 Apr 2017 18:44:27 GMT
See <https://builds.apache.org/job/beam_PostCommit_Java_MavenInstall/3395/display/redirect?page=changes>

Changes:

[dhalperi] Add javadoc to the Metric interfaces

------------------------------------------
[...truncated 665.07 KB...]
2017-04-20T18:42:57.685 [INFO] Downloading: https://repo.maven.apache.org/maven2/commons-collections/commons-collections/3.2/commons-collections-3.2.jar
2017-04-20T18:42:57.688 [INFO] Downloaded: https://repo.maven.apache.org/maven2/org/apache/maven/doxia/doxia-module-xhtml/1.1.2/doxia-module-xhtml-1.1.2.jar
(15 KB at 142.3 KB/sec)
2017-04-20T18:42:57.689 [INFO] Downloaded: https://repo.maven.apache.org/maven2/org/apache/maven/doxia/doxia-site-renderer/1.1.2/doxia-site-renderer-1.1.2.jar
(50 KB at 473.7 KB/sec)
2017-04-20T18:42:57.689 [INFO] Downloading: https://repo.maven.apache.org/maven2/org/jacoco/org.jacoco.core/0.7.8/org.jacoco.core-0.7.8.jar
2017-04-20T18:42:57.689 [INFO] Downloading: https://repo.maven.apache.org/maven2/org/jacoco/org.jacoco.agent/0.7.8/org.jacoco.agent-0.7.8-runtime.jar
2017-04-20T18:42:57.694 [INFO] Downloaded: https://repo.maven.apache.org/maven2/org/apache/maven/doxia/doxia-module-fml/1.1.2/doxia-module-fml-1.1.2.jar
(37 KB at 335.1 KB/sec)
2017-04-20T18:42:57.694 [INFO] Downloading: https://repo.maven.apache.org/maven2/org/ow2/asm/asm-debug-all/5.1/asm-debug-all-5.1.jar
2017-04-20T18:42:57.740 [INFO] Downloaded: https://repo.maven.apache.org/maven2/xerces/xercesImpl/2.8.1/xercesImpl-2.8.1.jar
(1185 KB at 7593.2 KB/sec)
2017-04-20T18:42:57.740 [INFO] Downloading: https://repo.maven.apache.org/maven2/org/jacoco/org.jacoco.report/0.7.8/org.jacoco.report-0.7.8.jar
2017-04-20T18:42:57.748 [INFO] Downloaded: https://repo.maven.apache.org/maven2/org/jacoco/org.jacoco.core/0.7.8/org.jacoco.core-0.7.8.jar
(122 KB at 745.4 KB/sec)
2017-04-20T18:42:57.767 [INFO] Downloaded: https://repo.maven.apache.org/maven2/org/jacoco/org.jacoco.agent/0.7.8/org.jacoco.agent-0.7.8-runtime.jar
(252 KB at 1380.7 KB/sec)
2017-04-20T18:42:57.788 [INFO] Downloaded: https://repo.maven.apache.org/maven2/org/jacoco/org.jacoco.report/0.7.8/org.jacoco.report-0.7.8.jar
(125 KB at 615.9 KB/sec)
2017-04-20T18:42:57.791 [INFO] Downloaded: https://repo.maven.apache.org/maven2/org/ow2/asm/asm-debug-all/5.1/asm-debug-all-5.1.jar
(379 KB at 1838.2 KB/sec)
2017-04-20T18:42:57.794 [INFO] Downloaded: https://repo.maven.apache.org/maven2/commons-collections/commons-collections/3.2/commons-collections-3.2.jar
(558 KB at 2669.2 KB/sec)
2017-04-20T18:42:57.881 [INFO] argLine set to -javaagent:<https://builds.apache.org/job/beam_PostCommit_Java_MavenInstall/ws/.repository/org/jacoco/org.jacoco.agent/0.7.8/org.jacoco.agent-0.7.8-runtime.jar=destfile=/home/jenkins/jenkins-slave/workspace/beam_PostCommit_Java_MavenInstall/sdks/java/core/target/jacoco.exec,excludes=**/AutoValue_*.class,dumponexit=true,output=file>
2017-04-20T18:42:58.188 [INFO] 
2017-04-20T18:42:58.188 [INFO] --- avro-maven-plugin:1.8.1:schema (schemas) @ beam-sdks-java-core
---
2017-04-20T18:42:58.191 [INFO] Downloading: https://repo.maven.apache.org/maven2/org/apache/avro/avro-compiler/1.8.1/avro-compiler-1.8.1.pom
2017-04-20T18:42:58.225 [INFO] Downloaded: https://repo.maven.apache.org/maven2/org/apache/avro/avro-compiler/1.8.1/avro-compiler-1.8.1.pom
(5 KB at 141.7 KB/sec)
2017-04-20T18:42:58.229 [INFO] Downloading: https://repo.maven.apache.org/maven2/org/apache/commons/commons-compress/1.8.1/commons-compress-1.8.1.pom
2017-04-20T18:42:58.259 [INFO] Downloaded: https://repo.maven.apache.org/maven2/org/apache/commons/commons-compress/1.8.1/commons-compress-1.8.1.pom
(12 KB at 372.1 KB/sec)
2017-04-20T18:42:58.263 [INFO] Downloading: https://repo.maven.apache.org/maven2/org/slf4j/slf4j-api/1.7.7/slf4j-api-1.7.7.pom
2017-04-20T18:42:58.290 [INFO] Downloaded: https://repo.maven.apache.org/maven2/org/slf4j/slf4j-api/1.7.7/slf4j-api-1.7.7.pom
(3 KB at 97.3 KB/sec)
2017-04-20T18:42:58.291 [INFO] Downloading: https://repo.maven.apache.org/maven2/org/slf4j/slf4j-parent/1.7.7/slf4j-parent-1.7.7.pom
2017-04-20T18:42:58.318 [INFO] Downloaded: https://repo.maven.apache.org/maven2/org/slf4j/slf4j-parent/1.7.7/slf4j-parent-1.7.7.pom
(12 KB at 430.7 KB/sec)
2017-04-20T18:42:58.322 [INFO] Downloading: https://repo.maven.apache.org/maven2/joda-time/joda-time/2.7/joda-time-2.7.pom
2017-04-20T18:42:58.352 [INFO] Downloaded: https://repo.maven.apache.org/maven2/joda-time/joda-time/2.7/joda-time-2.7.pom
(28 KB at 930.8 KB/sec)
2017-04-20T18:42:58.355 [INFO] Downloading: https://repo.maven.apache.org/maven2/org/slf4j/slf4j-simple/1.7.7/slf4j-simple-1.7.7.pom
2017-04-20T18:42:58.382 [INFO] Downloaded: https://repo.maven.apache.org/maven2/org/slf4j/slf4j-simple/1.7.7/slf4j-simple-1.7.7.pom
(2 KB at 53.2 KB/sec)
2017-04-20T18:42:58.387 [INFO] Downloading: https://repo.maven.apache.org/maven2/org/apache/maven/maven-plugin-api/2.0.10/maven-plugin-api-2.0.10.jar
2017-04-20T18:42:58.387 [INFO] Downloading: https://repo.maven.apache.org/maven2/org/apache/maven/maven-model/2.0.10/maven-model-2.0.10.jar
2017-04-20T18:42:58.388 [INFO] Downloading: https://repo.maven.apache.org/maven2/org/apache/maven/maven-artifact-manager/2.0.10/maven-artifact-manager-2.0.10.jar
2017-04-20T18:42:58.391 [INFO] Downloading: https://repo.maven.apache.org/maven2/org/codehaus/plexus/plexus-utils/1.5.5/plexus-utils-1.5.5.jar
2017-04-20T18:42:58.391 [INFO] Downloading: https://repo.maven.apache.org/maven2/org/apache/maven/maven-repository-metadata/2.0.10/maven-repository-metadata-2.0.10.jar
2017-04-20T18:42:58.420 [INFO] Downloaded: https://repo.maven.apache.org/maven2/org/apache/maven/maven-plugin-api/2.0.10/maven-plugin-api-2.0.10.jar
(13 KB at 381.6 KB/sec)
2017-04-20T18:42:58.420 [INFO] Downloading: https://repo.maven.apache.org/maven2/org/apache/maven/maven-artifact/2.0.10/maven-artifact-2.0.10.jar
2017-04-20T18:42:58.425 [INFO] Downloaded: https://repo.maven.apache.org/maven2/org/apache/maven/maven-repository-metadata/2.0.10/maven-repository-metadata-2.0.10.jar
(26 KB at 668.7 KB/sec)
2017-04-20T18:42:58.425 [INFO] Downloading: https://repo.maven.apache.org/maven2/org/apache/avro/avro-compiler/1.8.1/avro-compiler-1.8.1.jar
2017-04-20T18:42:58.433 [INFO] Downloaded: https://repo.maven.apache.org/maven2/org/apache/maven/maven-artifact-manager/2.0.10/maven-artifact-manager-2.0.10.jar
(57 KB at 1234.1 KB/sec)
2017-04-20T18:42:58.433 [INFO] Downloading: https://repo.maven.apache.org/maven2/org/xerial/snappy/snappy-java/1.1.1.3/snappy-java-1.1.1.3.jar
2017-04-20T18:42:58.434 [INFO] Downloaded: https://repo.maven.apache.org/maven2/org/apache/maven/maven-model/2.0.10/maven-model-2.0.10.jar
(94 KB at 1998.6 KB/sec)
2017-04-20T18:42:58.434 [INFO] Downloading: https://repo.maven.apache.org/maven2/org/apache/commons/commons-compress/1.8.1/commons-compress-1.8.1.jar
2017-04-20T18:42:58.442 [INFO] Downloaded: https://repo.maven.apache.org/maven2/org/codehaus/plexus/plexus-utils/1.5.5/plexus-utils-1.5.5.jar
(246 KB at 4544.2 KB/sec)
2017-04-20T18:42:58.442 [INFO] Downloading: https://repo.maven.apache.org/maven2/joda-time/joda-time/2.7/joda-time-2.7.jar
2017-04-20T18:42:58.461 [INFO] Downloaded: https://repo.maven.apache.org/maven2/org/apache/maven/maven-artifact/2.0.10/maven-artifact-2.0.10.jar
(88 KB at 1228.6 KB/sec)
2017-04-20T18:42:58.461 [INFO] Downloading: https://repo.maven.apache.org/maven2/org/slf4j/slf4j-api/1.7.7/slf4j-api-1.7.7.jar
2017-04-20T18:42:58.461 [INFO] Downloaded: https://repo.maven.apache.org/maven2/org/apache/avro/avro-compiler/1.8.1/avro-compiler-1.8.1.jar
(80 KB at 1122.2 KB/sec)
2017-04-20T18:42:58.461 [INFO] Downloading: https://repo.maven.apache.org/maven2/org/slf4j/slf4j-simple/1.7.7/slf4j-simple-1.7.7.jar
2017-04-20T18:42:58.493 [INFO] Downloaded: https://repo.maven.apache.org/maven2/org/slf4j/slf4j-api/1.7.7/slf4j-api-1.7.7.jar
(29 KB at 280.1 KB/sec)
2017-04-20T18:42:58.493 [INFO] Downloaded: https://repo.maven.apache.org/maven2/org/slf4j/slf4j-simple/1.7.7/slf4j-simple-1.7.7.jar
(11 KB at 102.3 KB/sec)
2017-04-20T18:42:58.500 [INFO] Downloaded: https://repo.maven.apache.org/maven2/org/apache/commons/commons-compress/1.8.1/commons-compress-1.8.1.jar
(357 KB at 3275.1 KB/sec)
2017-04-20T18:42:58.547 [INFO] Downloaded: https://repo.maven.apache.org/maven2/joda-time/joda-time/2.7/joda-time-2.7.jar
(576 KB at 3689.0 KB/sec)
2017-04-20T18:42:58.547 [INFO] Downloaded: https://repo.maven.apache.org/maven2/org/xerial/snappy/snappy-java/1.1.1.3/snappy-java-1.1.1.3.jar
(576 KB at 3664.0 KB/sec)
2017-04-20T18:42:59.142 [INFO] 
2017-04-20T18:42:59.143 [INFO] --- maven-remote-resources-plugin:1.5:process (process-resource-bundles)
@ beam-sdks-java-core ---
2017-04-20T18:42:59.552 [INFO] 
2017-04-20T18:42:59.552 [INFO] --- maven-resources-plugin:2.7:resources (default-resources)
@ beam-sdks-java-core ---
2017-04-20T18:42:59.554 [INFO] Using 'UTF-8' encoding to copy filtered resources.
2017-04-20T18:42:59.555 [INFO] Copying 1 resource
2017-04-20T18:42:59.566 [INFO] Copying 3 resources
2017-04-20T18:42:59.617 [INFO] 
2017-04-20T18:42:59.617 [INFO] --- maven-compiler-plugin:3.6.1:compile (default-compile) @
beam-sdks-java-core ---
2017-04-20T18:42:59.675 [INFO] Changes detected - recompiling the module!
2017-04-20T18:42:59.676 [INFO] Compiling 405 source files to <https://builds.apache.org/job/beam_PostCommit_Java_MavenInstall/ws/sdks/java/core/target/classes>
2017-04-20T18:43:03.379 [WARNING] bootstrap class path not set in conjunction with -source
1.7
2017-04-20T18:43:03.380 [INFO] <https://builds.apache.org/job/beam_PostCommit_Java_MavenInstall/ws/sdks/java/core/src/main/java/org/apache/beam/sdk/io/FileBasedSink.java>:
Some input files use or override a deprecated API.
2017-04-20T18:43:03.380 [INFO] <https://builds.apache.org/job/beam_PostCommit_Java_MavenInstall/ws/sdks/java/core/src/main/java/org/apache/beam/sdk/io/FileBasedSink.java>:
Recompile with -Xlint:deprecation for details.
2017-04-20T18:43:03.380 [INFO] <https://builds.apache.org/job/beam_PostCommit_Java_MavenInstall/ws/sdks/java/core/src/main/java/org/apache/beam/sdk/runners/PTransformOverrideFactory.java>:
Some input files use unchecked or unsafe operations.
2017-04-20T18:43:03.380 [INFO] <https://builds.apache.org/job/beam_PostCommit_Java_MavenInstall/ws/sdks/java/core/src/main/java/org/apache/beam/sdk/runners/PTransformOverrideFactory.java>:
Recompile with -Xlint:unchecked for details.
2017-04-20T18:43:04.869 [INFO] 
2017-04-20T18:43:04.869 [INFO] --- build-helper-maven-plugin:3.0.0:add-test-source (add-test-source)
@ beam-sdks-java-core ---
2017-04-20T18:43:04.871 [INFO] Test Source directory: <https://builds.apache.org/job/beam_PostCommit_Java_MavenInstall/ws/sdks/java/core/target/generated-test-sources/java>
added.
2017-04-20T18:43:04.922 [INFO] 
2017-04-20T18:43:04.922 [INFO] --- maven-resources-plugin:2.7:testResources (default-testResources)
@ beam-sdks-java-core ---
2017-04-20T18:43:04.937 [INFO] Using 'UTF-8' encoding to copy filtered resources.
2017-04-20T18:43:04.937 [INFO] skip non existing resourceDirectory <https://builds.apache.org/job/beam_PostCommit_Java_MavenInstall/ws/sdks/java/core/src/test/resources>
2017-04-20T18:43:04.937 [INFO] Copying 3 resources
2017-04-20T18:43:04.988 [INFO] 
2017-04-20T18:43:04.988 [INFO] --- maven-compiler-plugin:3.6.1:testCompile (default-testCompile)
@ beam-sdks-java-core ---
2017-04-20T18:43:05.136 [INFO] Changes detected - recompiling the module!
2017-04-20T18:43:05.137 [INFO] Compiling 244 source files to <https://builds.apache.org/job/beam_PostCommit_Java_MavenInstall/ws/sdks/java/core/target/test-classes>
2017-04-20T18:43:10.521 [INFO] <https://builds.apache.org/job/beam_PostCommit_Java_MavenInstall/ws/sdks/java/core/src/test/java/org/apache/beam/sdk/io/FileBasedSourceTest.java>:
Some input files use or override a deprecated API.
2017-04-20T18:43:10.521 [INFO] <https://builds.apache.org/job/beam_PostCommit_Java_MavenInstall/ws/sdks/java/core/src/test/java/org/apache/beam/sdk/io/FileBasedSourceTest.java>:
Recompile with -Xlint:deprecation for details.
2017-04-20T18:43:10.521 [INFO] <https://builds.apache.org/job/beam_PostCommit_Java_MavenInstall/ws/sdks/java/core/src/test/java/org/apache/beam/sdk/coders/AvroCoderTest.java>:
Some input files use unchecked or unsafe operations.
2017-04-20T18:43:10.521 [INFO] <https://builds.apache.org/job/beam_PostCommit_Java_MavenInstall/ws/sdks/java/core/src/test/java/org/apache/beam/sdk/coders/AvroCoderTest.java>:
Recompile with -Xlint:unchecked for details.
2017-04-20T18:43:10.572 [INFO] 
2017-04-20T18:43:10.572 [INFO] --- maven-checkstyle-plugin:2.17:check (default) @ beam-sdks-java-core
---
2017-04-20T18:43:36.611 [INFO] Starting audit...
[ERROR] <https://builds.apache.org/job/beam_PostCommit_Java_MavenInstall/ws/sdks/java/core/src/main/java/org/apache/beam/sdk/metrics/MetricResults.java>:32:
Empty line should be followed by <p> tag on the next line. [JavadocParagraph]
Audit done.
2017-04-20T18:43:36.611 [INFO] There is 1 error reported by Checkstyle 6.19 with beam/checkstyle.xml
ruleset.
2017-04-20T18:43:36.614 [ERROR] src/main/java/org/apache/beam/sdk/metrics/MetricResults.java:[32]
(javadoc) JavadocParagraph: Empty line should be followed by <p> tag on the next line.
[JENKINS] Archiving disabled
2017-04-20T18:43:37.554 [INFO]                                                           
             
2017-04-20T18:43:37.554 [INFO] ------------------------------------------------------------------------
2017-04-20T18:43:37.554 [INFO] Skipping Apache Beam :: Parent
2017-04-20T18:43:37.554 [INFO] This project has been banned from the build due to previous
failures.
2017-04-20T18:43:37.555 [INFO] ------------------------------------------------------------------------
[JENKINS] Archiving disabled
[JENKINS] Archiving disabled
[JENKINS] Archiving disabled
[JENKINS] Archiving disabled
[JENKINS] Archiving disabled
[JENKINS] Archiving disabled
[JENKINS] Archiving disabled
[JENKINS] Archiving disabled
[JENKINS] Archiving disabled
[JENKINS] Archiving disabled
[JENKINS] Archiving disabled
[JENKINS] Archiving disabled
[JENKINS] Archiving disabled
[JENKINS] Archiving disabled
[JENKINS] Archiving disabled
[JENKINS] Archiving disabled
[JENKINS] Archiving disabled
[JENKINS] Archiving disabled
[JENKINS] Archiving disabled
[JENKINS] Archiving disabled
[JENKINS] Archiving disabled
[JENKINS] Archiving disabled
[JENKINS] Archiving disabled
[JENKINS] Archiving disabled
[JENKINS] Archiving disabled
[JENKINS] Archiving disabled
[JENKINS] Archiving disabled
[JENKINS] Archiving disabled
[JENKINS] Archiving disabled
[JENKINS] Archiving disabled
[JENKINS] Archiving disabled
[JENKINS] Archiving disabled
[JENKINS] Archiving disabled
[JENKINS] Archiving disabled
[JENKINS] Archiving disabled
[JENKINS] Archiving disabled
[JENKINS] Archiving disabled
[JENKINS] Archiving disabled
[JENKINS] Archiving disabled
[JENKINS] Archiving disabled
[JENKINS] Archiving disabled
[JENKINS] Archiving disabled
[JENKINS] Archiving disabled
[JENKINS] Archiving disabled
2017-04-20T18:43:50.832 [INFO] ------------------------------------------------------------------------
2017-04-20T18:43:50.832 [INFO] Reactor Summary:
2017-04-20T18:43:50.832 [INFO] 
2017-04-20T18:43:50.833 [INFO] Apache Beam :: Parent .............................. SUCCESS
[ 30.014 s]
2017-04-20T18:43:50.833 [INFO] Apache Beam :: SDKs :: Java :: Build Tools ......... SUCCESS
[ 12.392 s]
2017-04-20T18:43:50.833 [INFO] Apache Beam :: SDKs ................................ SUCCESS
[  5.966 s]
2017-04-20T18:43:50.833 [INFO] Apache Beam :: SDKs :: Common ...................... SUCCESS
[  3.286 s]
2017-04-20T18:43:50.833 [INFO] Apache Beam :: SDKs :: Common :: Fn API ............ SUCCESS
[ 19.289 s]
2017-04-20T18:43:50.833 [INFO] Apache Beam :: SDKs :: Common :: Runner API ........ SUCCESS
[ 16.022 s]
2017-04-20T18:43:50.833 [INFO] Apache Beam :: SDKs :: Java ........................ SUCCESS
[  3.320 s]
2017-04-20T18:43:50.833 [INFO] Apache Beam :: SDKs :: Java :: Core ................ FAILURE
[ 43.824 s]
2017-04-20T18:43:50.833 [INFO] Apache Beam :: SDKs :: Java :: IO .................. SKIPPED
2017-04-20T18:43:50.833 [INFO] Apache Beam :: SDKs :: Java :: IO :: Common ........ SKIPPED
2017-04-20T18:43:50.833 [INFO] Apache Beam :: Runners ............................. SKIPPED
2017-04-20T18:43:50.833 [INFO] Apache Beam :: Runners :: Core Construction Java ... SKIPPED
2017-04-20T18:43:50.833 [INFO] Apache Beam :: Runners :: Core Java ................ SKIPPED
2017-04-20T18:43:50.833 [INFO] Apache Beam :: Runners :: Direct Java .............. SKIPPED
2017-04-20T18:43:50.833 [INFO] Apache Beam :: SDKs :: Java :: IO :: Elasticsearch . SKIPPED
2017-04-20T18:43:50.833 [INFO] Apache Beam :: SDKs :: Java :: Extensions .......... SKIPPED
2017-04-20T18:43:50.833 [INFO] Apache Beam :: SDKs :: Java :: Extensions :: Google Cloud Platform
Core SKIPPED
2017-04-20T18:43:50.833 [INFO] Apache Beam :: SDKs :: Java :: IO :: Google Cloud Platform
SKIPPED
2017-04-20T18:43:50.833 [INFO] Apache Beam :: SDKs :: Java :: IO :: Hadoop Common . SKIPPED
2017-04-20T18:43:50.833 [INFO] Apache Beam :: SDKs :: Java :: IO :: Hadoop ........ SKIPPED
2017-04-20T18:43:50.833 [INFO] Apache Beam :: SDKs :: Java :: IO :: Hadoop :: input-format
SKIPPED
2017-04-20T18:43:50.833 [INFO] Apache Beam :: Runners :: Google Cloud Dataflow .... SKIPPED
2017-04-20T18:43:50.833 [INFO] Apache Beam :: SDKs :: Java :: IO :: Hadoop :: jdk1.8-tests
SKIPPED
2017-04-20T18:43:50.833 [INFO] Apache Beam :: SDKs :: Java :: IO :: HBase ......... SKIPPED
2017-04-20T18:43:50.833 [INFO] Apache Beam :: SDKs :: Java :: IO :: HDFS .......... SKIPPED
2017-04-20T18:43:50.833 [INFO] Apache Beam :: SDKs :: Java :: IO :: JDBC .......... SKIPPED
2017-04-20T18:43:50.833 [INFO] Apache Beam :: SDKs :: Java :: IO :: JMS ........... SKIPPED
2017-04-20T18:43:50.833 [INFO] Apache Beam :: SDKs :: Java :: IO :: Kafka ......... SKIPPED
2017-04-20T18:43:50.833 [INFO] Apache Beam :: SDKs :: Java :: IO :: Kinesis ....... SKIPPED
2017-04-20T18:43:50.833 [INFO] Apache Beam :: SDKs :: Java :: IO :: MongoDB ....... SKIPPED
2017-04-20T18:43:50.833 [INFO] Apache Beam :: SDKs :: Java :: IO :: MQTT .......... SKIPPED
2017-04-20T18:43:50.833 [INFO] Apache Beam :: SDKs :: Java :: Maven Archetypes .... SKIPPED
2017-04-20T18:43:50.834 [INFO] Apache Beam :: SDKs :: Java :: Maven Archetypes :: Starter
SKIPPED
2017-04-20T18:43:50.834 [INFO] Apache Beam :: SDKs :: Java :: Maven Archetypes :: Examples
SKIPPED
2017-04-20T18:43:50.834 [INFO] Apache Beam :: SDKs :: Java :: Maven Archetypes :: Examples
- Java 8 SKIPPED
2017-04-20T18:43:50.834 [INFO] Apache Beam :: SDKs :: Java :: Extensions :: Jackson SKIPPED
2017-04-20T18:43:50.834 [INFO] Apache Beam :: SDKs :: Java :: Extensions :: Join library SKIPPED
2017-04-20T18:43:50.834 [INFO] Apache Beam :: SDKs :: Java :: Extensions :: Sorter  SKIPPED
2017-04-20T18:43:50.834 [INFO] Apache Beam :: SDKs :: Java :: Harness ............. SKIPPED
2017-04-20T18:43:50.834 [INFO] Apache Beam :: SDKs :: Java :: Java 8 Tests ........ SKIPPED
2017-04-20T18:43:50.834 [INFO] Apache Beam :: SDKs :: Python ...................... SKIPPED
2017-04-20T18:43:50.834 [INFO] Apache Beam :: Runners :: Flink .................... SKIPPED
2017-04-20T18:43:50.834 [INFO] Apache Beam :: Runners :: Spark .................... SKIPPED
2017-04-20T18:43:50.834 [INFO] Apache Beam :: Runners :: Apex ..................... SKIPPED
2017-04-20T18:43:50.834 [INFO] Apache Beam :: Examples ............................ SKIPPED
2017-04-20T18:43:50.834 [INFO] Apache Beam :: Examples :: Java .................... SKIPPED
2017-04-20T18:43:50.834 [INFO] Apache Beam :: Examples :: Java 8 .................. SKIPPED
2017-04-20T18:43:50.834 [INFO] Apache Beam :: SDKs :: Java :: Aggregated Javadoc .. SKIPPED
2017-04-20T18:43:50.834 [INFO] ------------------------------------------------------------------------
2017-04-20T18:43:50.834 [INFO] BUILD FAILURE
2017-04-20T18:43:50.834 [INFO] ------------------------------------------------------------------------
2017-04-20T18:43:50.834 [INFO] Total time: 02:49 min
2017-04-20T18:43:50.834 [INFO] Finished at: 2017-04-20T18:43:50+00:00
2017-04-20T18:43:51.268 [INFO] Final Memory: 109M/1348M
2017-04-20T18:43:51.268 [INFO] ------------------------------------------------------------------------
Waiting for Jenkins to finish collecting data
2017-04-20T18:44:14.861 [ERROR] Failed to execute goal org.apache.maven.plugins:maven-checkstyle-plugin:2.17:check
(default) on project beam-sdks-java-core: You have 1 Checkstyle violation. -> [Help 1]
org.apache.maven.lifecycle.LifecycleExecutionException: Failed to execute goal org.apache.maven.plugins:maven-checkstyle-plugin:2.17:check
(default) on project beam-sdks-java-core: You have 1 Checkstyle violation.
	at org.apache.maven.lifecycle.internal.MojoExecutor.execute(MojoExecutor.java:212)
	at org.apache.maven.lifecycle.internal.MojoExecutor.execute(MojoExecutor.java:153)
	at org.apache.maven.lifecycle.internal.MojoExecutor.execute(MojoExecutor.java:145)
	at org.apache.maven.lifecycle.internal.LifecycleModuleBuilder.buildProject(LifecycleModuleBuilder.java:116)
	at org.apache.maven.lifecycle.internal.LifecycleModuleBuilder.buildProject(LifecycleModuleBuilder.java:80)
	at org.apache.maven.lifecycle.internal.builder.singlethreaded.SingleThreadedBuilder.build(SingleThreadedBuilder.java:51)
	at org.apache.maven.lifecycle.internal.LifecycleStarter.execute(LifecycleStarter.java:128)
	at org.apache.maven.DefaultMaven.doExecute(DefaultMaven.java:307)
	at org.apache.maven.DefaultMaven.doExecute(DefaultMaven.java:193)
	at org.apache.maven.DefaultMaven.execute(DefaultMaven.java:106)
	at org.jvnet.hudson.maven3.launcher.Maven33Launcher.main(Maven33Launcher.java:129)
	at sun.reflect.NativeMethodAccessorImpl.invoke0(Native Method)
	at sun.reflect.NativeMethodAccessorImpl.invoke(NativeMethodAccessorImpl.java:62)
	at sun.reflect.DelegatingMethodAccessorImpl.invoke(DelegatingMethodAccessorImpl.java:43)
	at java.lang.reflect.Method.invoke(Method.java:498)
	at org.codehaus.plexus.classworlds.launcher.Launcher.launchStandard(Launcher.java:330)
	at org.codehaus.plexus.classworlds.launcher.Launcher.launch(Launcher.java:238)
	at jenkins.maven3.agent.Maven33Main.launch(Maven33Main.java:176)
	at sun.reflect.NativeMethodAccessorImpl.invoke0(Native Method)
	at sun.reflect.NativeMethodAccessorImpl.invoke(NativeMethodAccessorImpl.java:62)
	at sun.reflect.DelegatingMethodAccessorImpl.invoke(DelegatingMethodAccessorImpl.java:43)
	at java.lang.reflect.Method.invoke(Method.java:498)
	at hudson.maven.Maven3Builder.call(Maven3Builder.java:139)
	at hudson.maven.Maven3Builder.call(Maven3Builder.java:70)
	at hudson.remoting.UserRequest.perform(UserRequest.java:153)
	at hudson.remoting.UserRequest.perform(UserRequest.java:50)
	at hudson.remoting.Request$2.run(Request.java:336)
	at hudson.remoting.InterceptingExecutorService$1.call(InterceptingExecutorService.java:68)
	at java.util.concurrent.FutureTask.run(FutureTask.java:266)
	at java.util.concurrent.ThreadPoolExecutor.runWorker(ThreadPoolExecutor.java:1142)
	at java.util.concurrent.ThreadPoolExecutor$Worker.run(ThreadPoolExecutor.java:617)
	at java.lang.Thread.run(Thread.java:745)
Caused by: org.apache.maven.plugin.MojoFailureException: You have 1 Checkstyle violation.
	at org.apache.maven.plugin.checkstyle.CheckstyleViolationCheckMojo.execute(CheckstyleViolationCheckMojo.java:588)
	at org.apache.maven.plugin.DefaultBuildPluginManager.executeMojo(DefaultBuildPluginManager.java:134)
	at org.apache.maven.lifecycle.internal.MojoExecutor.execute(MojoExecutor.java:208)
	... 31 more
2017-04-20T18:44:14.862 [ERROR] 
2017-04-20T18:44:14.862 [ERROR] Re-run Maven using the -X switch to enable full debug logging.
2017-04-20T18:44:14.862 [ERROR] 
2017-04-20T18:44:14.862 [ERROR] For more information about the errors and possible solutions,
please read the following articles:
2017-04-20T18:44:14.862 [ERROR] [Help 1] http://cwiki.apache.org/confluence/display/MAVEN/MojoFailureException
2017-04-20T18:44:14.862 [ERROR] 
2017-04-20T18:44:14.862 [ERROR] After correcting the problems, you can resume the build with
the command
2017-04-20T18:44:14.862 [ERROR]   mvn <goals> -rf :beam-sdks-java-core
channel stopped

Mime
View raw message