beam-commits mailing list archives

Site index · List index
Message view « Date » · « Thread »
Top « Date » · « Thread »
From Apache Jenkins Server <jenk...@builds.apache.org>
Subject Build failed in Jenkins: beam_PostCommit_Java_ValidatesRunner_Flink #2212
Date Thu, 06 Apr 2017 01:13:31 GMT
See <https://builds.apache.org/job/beam_PostCommit_Java_ValidatesRunner_Flink/2212/display/redirect?page=changes>

Changes:

[tgroh] Use WinodwMappingFn where possible

[tgroh] Add Initial Materializations

------------------------------------------
[...truncated 595.20 KB...]
2017-04-06T01:12:47.370 [INFO] Downloading: https://repo.maven.apache.org/maven2/org/codehaus/woodstox/stax2-api/3.1.4/stax2-api-3.1.4.jar
2017-04-06T01:12:47.382 [INFO] Downloaded: https://repo.maven.apache.org/maven2/org/xerial/snappy/snappy-java/1.1.2.1/snappy-java-1.1.2.1.jar
(689 KB at 1407.5 KB/sec)
2017-04-06T01:12:47.382 [INFO] Downloading: https://repo.maven.apache.org/maven2/org/codehaus/woodstox/woodstox-core-asl/4.4.1/woodstox-core-asl-4.4.1.jar
2017-04-06T01:12:47.384 [INFO] Downloaded: https://repo.maven.apache.org/maven2/org/apache/commons/commons-lang3/3.5/commons-lang3-3.5.jar
(469 KB at 954.4 KB/sec)
2017-04-06T01:12:47.384 [INFO] Downloading: https://repo.maven.apache.org/maven2/com/google/auto/service/auto-service/1.0-rc2/auto-service-1.0-rc2.jar
2017-04-06T01:12:47.413 [INFO] Downloaded: https://repo.maven.apache.org/maven2/org/codehaus/woodstox/stax2-api/3.1.4/stax2-api-3.1.4.jar
(159 KB at 304.0 KB/sec)
2017-04-06T01:12:47.413 [INFO] Downloading: https://repo.maven.apache.org/maven2/com/google/auto/auto-common/0.3/auto-common-0.3.jar
2017-04-06T01:12:47.415 [INFO] Downloaded: https://repo.maven.apache.org/maven2/com/google/auto/service/auto-service/1.0-rc2/auto-service-1.0-rc2.jar
(11 KB at 19.4 KB/sec)
2017-04-06T01:12:47.415 [INFO] Downloading: https://repo.maven.apache.org/maven2/com/google/auto/value/auto-value/1.3/auto-value-1.3.jar
2017-04-06T01:12:47.428 [INFO] Downloaded: https://repo.maven.apache.org/maven2/joda-time/joda-time/2.4/joda-time-2.4.jar
(573 KB at 1070.0 KB/sec)
2017-04-06T01:12:47.428 [INFO] Downloading: https://repo.maven.apache.org/maven2/com/fasterxml/jackson/dataformat/jackson-dataformat-yaml/2.7.2/jackson-dataformat-yaml-2.7.2.jar
2017-04-06T01:12:47.443 [INFO] Downloaded: https://repo.maven.apache.org/maven2/com/google/auto/auto-common/0.3/auto-common-0.3.jar
(39 KB at 69.2 KB/sec)
2017-04-06T01:12:47.443 [INFO] Downloading: https://repo.maven.apache.org/maven2/org/yaml/snakeyaml/1.15/snakeyaml-1.15.jar
2017-04-06T01:12:47.444 [INFO] Downloaded: https://repo.maven.apache.org/maven2/net/bytebuddy/byte-buddy/1.6.8/byte-buddy-1.6.8.jar
(2706 KB at 4910.7 KB/sec)
2017-04-06T01:12:47.444 [INFO] Downloading: https://repo.maven.apache.org/maven2/org/hamcrest/hamcrest-all/1.3/hamcrest-all-1.3.jar
2017-04-06T01:12:47.448 [INFO] Downloaded: https://repo.maven.apache.org/maven2/org/codehaus/woodstox/woodstox-core-asl/4.4.1/woodstox-core-asl-4.4.1.jar
(475 KB at 855.2 KB/sec)
2017-04-06T01:12:47.448 [INFO] Downloading: https://repo.maven.apache.org/maven2/org/slf4j/slf4j-jdk14/1.7.14/slf4j-jdk14-1.7.14.jar
2017-04-06T01:12:47.475 [INFO] Downloaded: https://repo.maven.apache.org/maven2/org/slf4j/slf4j-jdk14/1.7.14/slf4j-jdk14-1.7.14.jar
(8 KB at 13.1 KB/sec)
2017-04-06T01:12:47.475 [INFO] Downloading: https://repo.maven.apache.org/maven2/org/mockito/mockito-all/1.9.5/mockito-all-1.9.5.jar
2017-04-06T01:12:47.479 [INFO] Downloaded: https://repo.maven.apache.org/maven2/com/fasterxml/jackson/dataformat/jackson-dataformat-yaml/2.7.2/jackson-dataformat-yaml-2.7.2.jar
(314 KB at 534.9 KB/sec)
2017-04-06T01:12:47.479 [INFO] Downloading: https://repo.maven.apache.org/maven2/com/google/cloud/dataflow/google-cloud-dataflow-java-proto-library-all/0.5.160304/google-cloud-dataflow-java-proto-library-all-0.5.160304.jar
2017-04-06T01:12:47.488 [INFO] Downloaded: https://repo.maven.apache.org/maven2/org/yaml/snakeyaml/1.15/snakeyaml-1.15.jar
(263 KB at 442.0 KB/sec)
2017-04-06T01:12:47.488 [INFO] Downloading: https://repo.maven.apache.org/maven2/com/esotericsoftware/kryo/kryo/2.21/kryo-2.21.jar
2017-04-06T01:12:47.490 [INFO] Downloaded: https://repo.maven.apache.org/maven2/org/hamcrest/hamcrest-all/1.3/hamcrest-all-1.3.jar
(300 KB at 501.5 KB/sec)
2017-04-06T01:12:47.490 [INFO] Downloading: https://repo.maven.apache.org/maven2/com/esotericsoftware/reflectasm/reflectasm/1.07/reflectasm-1.07-shaded.jar
2017-04-06T01:12:47.511 [INFO] Downloaded: https://repo.maven.apache.org/maven2/com/google/cloud/dataflow/google-cloud-dataflow-java-proto-library-all/0.5.160304/google-cloud-dataflow-java-proto-library-all-0.5.160304.jar
(53 KB at 85.2 KB/sec)
2017-04-06T01:12:47.511 [INFO] Downloading: https://repo.maven.apache.org/maven2/org/ow2/asm/asm/4.0/asm-4.0.jar
2017-04-06T01:12:47.527 [INFO] Downloaded: https://repo.maven.apache.org/maven2/com/esotericsoftware/reflectasm/reflectasm/1.07/reflectasm-1.07-shaded.jar
(65 KB at 101.1 KB/sec)
2017-04-06T01:12:47.527 [INFO] Downloading: https://repo.maven.apache.org/maven2/com/esotericsoftware/minlog/minlog/1.2/minlog-1.2.jar
2017-04-06T01:12:47.539 [INFO] Downloaded: https://repo.maven.apache.org/maven2/com/esotericsoftware/kryo/kryo/2.21/kryo-2.21.jar
(355 KB at 549.4 KB/sec)
2017-04-06T01:12:47.539 [INFO] Downloading: https://repo.maven.apache.org/maven2/org/objenesis/objenesis/1.2/objenesis-1.2.jar
2017-04-06T01:12:47.539 [INFO] Downloaded: https://repo.maven.apache.org/maven2/org/ow2/asm/asm/4.0/asm-4.0.jar
(45 KB at 69.6 KB/sec)
2017-04-06T01:12:47.544 [INFO] Downloaded: https://repo.maven.apache.org/maven2/com/google/auto/value/auto-value/1.3/auto-value-1.3.jar
(1380 KB at 2119.6 KB/sec)
2017-04-06T01:12:47.554 [INFO] Downloaded: https://repo.maven.apache.org/maven2/com/esotericsoftware/minlog/minlog/1.2/minlog-1.2.jar
(5 KB at 7.3 KB/sec)
2017-04-06T01:12:47.567 [INFO] Downloaded: https://repo.maven.apache.org/maven2/org/objenesis/objenesis/1.2/objenesis-1.2.jar
(36 KB at 52.2 KB/sec)
2017-04-06T01:12:47.608 [INFO] Downloaded: https://repo.maven.apache.org/maven2/org/mockito/mockito-all/1.9.5/mockito-all-1.9.5.jar
(1545 KB at 2159.5 KB/sec)
2017-04-06T01:12:47.625 [INFO] 
2017-04-06T01:12:47.625 [INFO] --- maven-clean-plugin:3.0.0:clean (default-clean) @ beam-sdks-java-core
---
2017-04-06T01:12:47.626 [INFO] Deleting <https://builds.apache.org/job/beam_PostCommit_Java_ValidatesRunner_Flink/ws/sdks/java/core>
(includes = [**/*.pyc, **/*.egg-info/], excludes = [])
2017-04-06T01:12:48.169 [INFO] 
2017-04-06T01:12:48.169 [INFO] --- maven-enforcer-plugin:1.4.1:enforce (enforce) @ beam-sdks-java-core
---
2017-04-06T01:12:48.207 [INFO] artifact io.netty:netty-codec-http2: checking for updates from
central
2017-04-06T01:12:49.281 [INFO] 
2017-04-06T01:12:49.281 [INFO] --- jacoco-maven-plugin:0.7.8:prepare-agent (default) @ beam-sdks-java-core
---
2017-04-06T01:12:49.285 [INFO] Downloading: https://repo.maven.apache.org/maven2/junit/junit/4.8.2/junit-4.8.2.pom
2017-04-06T01:12:49.311 [INFO] Downloaded: https://repo.maven.apache.org/maven2/junit/junit/4.8.2/junit-4.8.2.pom
(2 KB at 55.7 KB/sec)
2017-04-06T01:12:49.313 [INFO] Downloading: https://repo.maven.apache.org/maven2/org/apache/maven/maven-artifact-manager/2.0.2/maven-artifact-manager-2.0.2.pom
2017-04-06T01:12:49.341 [INFO] Downloaded: https://repo.maven.apache.org/maven2/org/apache/maven/maven-artifact-manager/2.0.2/maven-artifact-manager-2.0.2.pom
(2 KB at 48.7 KB/sec)
2017-04-06T01:12:49.343 [INFO] Downloading: https://repo.maven.apache.org/maven2/org/apache/maven/maven-repository-metadata/2.0.2/maven-repository-metadata-2.0.2.pom
2017-04-06T01:12:49.368 [INFO] Downloaded: https://repo.maven.apache.org/maven2/org/apache/maven/maven-repository-metadata/2.0.2/maven-repository-metadata-2.0.2.pom
(2 KB at 51.1 KB/sec)
2017-04-06T01:12:49.371 [INFO] Downloading: https://repo.maven.apache.org/maven2/org/apache/maven/maven-plugin-api/2.0.10/maven-plugin-api-2.0.10.pom
2017-04-06T01:12:49.397 [INFO] Downloaded: https://repo.maven.apache.org/maven2/org/apache/maven/maven-plugin-api/2.0.10/maven-plugin-api-2.0.10.pom
(2 KB at 56.2 KB/sec)
2017-04-06T01:12:49.400 [INFO] Downloading: https://repo.maven.apache.org/maven2/org/jacoco/org.jacoco.agent/0.7.8/org.jacoco.agent-0.7.8.pom
2017-04-06T01:12:49.426 [INFO] Downloaded: https://repo.maven.apache.org/maven2/org/jacoco/org.jacoco.agent/0.7.8/org.jacoco.agent-0.7.8.pom
(3 KB at 108.0 KB/sec)
2017-04-06T01:12:49.428 [INFO] Downloading: https://repo.maven.apache.org/maven2/org/jacoco/org.jacoco.core/0.7.8/org.jacoco.core-0.7.8.pom
2017-04-06T01:12:49.455 [INFO] Downloaded: https://repo.maven.apache.org/maven2/org/jacoco/org.jacoco.core/0.7.8/org.jacoco.core-0.7.8.pom
(2 KB at 43.8 KB/sec)
2017-04-06T01:12:49.457 [INFO] Downloading: https://repo.maven.apache.org/maven2/org/ow2/asm/asm-debug-all/5.1/asm-debug-all-5.1.pom
2017-04-06T01:12:49.482 [INFO] Downloaded: https://repo.maven.apache.org/maven2/org/ow2/asm/asm-debug-all/5.1/asm-debug-all-5.1.pom
(2 KB at 77.4 KB/sec)
2017-04-06T01:12:49.483 [INFO] Downloading: https://repo.maven.apache.org/maven2/org/jacoco/org.jacoco.report/0.7.8/org.jacoco.report-0.7.8.pom
2017-04-06T01:12:49.509 [INFO] Downloaded: https://repo.maven.apache.org/maven2/org/jacoco/org.jacoco.report/0.7.8/org.jacoco.report-0.7.8.pom
(2 KB at 50.6 KB/sec)
2017-04-06T01:12:49.516 [INFO] Downloading: https://repo.maven.apache.org/maven2/junit/junit/4.8.2/junit-4.8.2.jar
2017-04-06T01:12:49.516 [INFO] Downloading: https://repo.maven.apache.org/maven2/org/apache/maven/doxia/doxia-core/1.1.2/doxia-core-1.1.2.jar
2017-04-06T01:12:49.517 [INFO] Downloading: https://repo.maven.apache.org/maven2/xerces/xercesImpl/2.8.1/xercesImpl-2.8.1.jar
2017-04-06T01:12:49.517 [INFO] Downloading: https://repo.maven.apache.org/maven2/commons-httpclient/commons-httpclient/3.1/commons-httpclient-3.1.jar
2017-04-06T01:12:49.517 [INFO] Downloading: https://repo.maven.apache.org/maven2/commons-codec/commons-codec/1.2/commons-codec-1.2.jar
2017-04-06T01:12:49.547 [INFO] Downloaded: https://repo.maven.apache.org/maven2/commons-codec/commons-codec/1.2/commons-codec-1.2.jar
(30 KB at 979.3 KB/sec)
2017-04-06T01:12:49.547 [INFO] Downloading: https://repo.maven.apache.org/maven2/org/apache/maven/doxia/doxia-site-renderer/1.1.2/doxia-site-renderer-1.1.2.jar
2017-04-06T01:12:49.555 [INFO] Downloaded: https://repo.maven.apache.org/maven2/org/apache/maven/doxia/doxia-core/1.1.2/doxia-core-1.1.2.jar
(155 KB at 3963.8 KB/sec)
2017-04-06T01:12:49.555 [INFO] Downloading: https://repo.maven.apache.org/maven2/org/apache/maven/doxia/doxia-decoration-model/1.1.2/doxia-decoration-model-1.1.2.jar
2017-04-06T01:12:49.558 [INFO] Downloaded: https://repo.maven.apache.org/maven2/junit/junit/4.8.2/junit-4.8.2.jar
(232 KB at 5390.3 KB/sec)
2017-04-06T01:12:49.558 [INFO] Downloading: https://repo.maven.apache.org/maven2/org/apache/maven/doxia/doxia-module-xhtml/1.1.2/doxia-module-xhtml-1.1.2.jar
2017-04-06T01:12:49.568 [INFO] Downloaded: https://repo.maven.apache.org/maven2/commons-httpclient/commons-httpclient/3.1/commons-httpclient-3.1.jar
(298 KB at 5840.2 KB/sec)
2017-04-06T01:12:49.568 [INFO] Downloading: https://repo.maven.apache.org/maven2/org/apache/maven/doxia/doxia-module-fml/1.1.2/doxia-module-fml-1.1.2.jar
2017-04-06T01:12:49.578 [INFO] Downloaded: https://repo.maven.apache.org/maven2/org/apache/maven/doxia/doxia-site-renderer/1.1.2/doxia-site-renderer-1.1.2.jar
(50 KB at 807.6 KB/sec)
2017-04-06T01:12:49.578 [INFO] Downloading: https://repo.maven.apache.org/maven2/commons-collections/commons-collections/3.2/commons-collections-3.2.jar
2017-04-06T01:12:49.585 [INFO] Downloaded: https://repo.maven.apache.org/maven2/org/apache/maven/doxia/doxia-decoration-model/1.1.2/doxia-decoration-model-1.1.2.jar
(52 KB at 751.2 KB/sec)
2017-04-06T01:12:49.585 [INFO] Downloading: https://repo.maven.apache.org/maven2/org/jacoco/org.jacoco.agent/0.7.8/org.jacoco.agent-0.7.8-runtime.jar
2017-04-06T01:12:49.586 [INFO] Downloaded: https://repo.maven.apache.org/maven2/org/apache/maven/doxia/doxia-module-xhtml/1.1.2/doxia-module-xhtml-1.1.2.jar
(15 KB at 212.4 KB/sec)
2017-04-06T01:12:49.586 [INFO] Downloading: https://repo.maven.apache.org/maven2/org/jacoco/org.jacoco.core/0.7.8/org.jacoco.core-0.7.8.jar
2017-04-06T01:12:49.596 [INFO] Downloaded: https://repo.maven.apache.org/maven2/org/apache/maven/doxia/doxia-module-fml/1.1.2/doxia-module-fml-1.1.2.jar
(37 KB at 462.3 KB/sec)
2017-04-06T01:12:49.597 [INFO] Downloading: https://repo.maven.apache.org/maven2/org/ow2/asm/asm-debug-all/5.1/asm-debug-all-5.1.jar
2017-04-06T01:12:49.628 [INFO] Downloaded: https://repo.maven.apache.org/maven2/org/jacoco/org.jacoco.core/0.7.8/org.jacoco.core-0.7.8.jar
(122 KB at 1094.5 KB/sec)
2017-04-06T01:12:49.628 [INFO] Downloaded: https://repo.maven.apache.org/maven2/xerces/xercesImpl/2.8.1/xercesImpl-2.8.1.jar
(1185 KB at 10576.2 KB/sec)
2017-04-06T01:12:49.628 [INFO] Downloading: https://repo.maven.apache.org/maven2/org/jacoco/org.jacoco.report/0.7.8/org.jacoco.report-0.7.8.jar
2017-04-06T01:12:49.629 [INFO] Downloaded: https://repo.maven.apache.org/maven2/org/jacoco/org.jacoco.agent/0.7.8/org.jacoco.agent-0.7.8-runtime.jar
(252 KB at 2243.7 KB/sec)
2017-04-06T01:12:49.650 [INFO] Downloaded: https://repo.maven.apache.org/maven2/commons-collections/commons-collections/3.2/commons-collections-3.2.jar
(558 KB at 4194.5 KB/sec)
2017-04-06T01:12:49.657 [INFO] Downloaded: https://repo.maven.apache.org/maven2/org/ow2/asm/asm-debug-all/5.1/asm-debug-all-5.1.jar
(379 KB at 2704.7 KB/sec)
2017-04-06T01:12:49.664 [INFO] Downloaded: https://repo.maven.apache.org/maven2/org/jacoco/org.jacoco.report/0.7.8/org.jacoco.report-0.7.8.jar
(125 KB at 846.3 KB/sec)
2017-04-06T01:12:49.749 [INFO] argLine set to -javaagent:<https://builds.apache.org/job/beam_PostCommit_Java_ValidatesRunner_Flink/ws/.repository/org/jacoco/org.jacoco.agent/0.7.8/org.jacoco.agent-0.7.8-runtime.jar=destfile=/home/jenkins/jenkins-slave/workspace/beam_PostCommit_Java_ValidatesRunner_Flink/sdks/java/core/target/jacoco.exec,excludes=**/AutoValue_*.class,dumponexit=true,output=file>
2017-04-06T01:12:49.800 [INFO] 
2017-04-06T01:12:49.800 [INFO] --- avro-maven-plugin:1.8.1:schema (schemas) @ beam-sdks-java-core
---
2017-04-06T01:12:49.804 [INFO] Downloading: https://repo.maven.apache.org/maven2/org/apache/avro/avro-compiler/1.8.1/avro-compiler-1.8.1.pom
2017-04-06T01:12:49.831 [INFO] Downloaded: https://repo.maven.apache.org/maven2/org/apache/avro/avro-compiler/1.8.1/avro-compiler-1.8.1.pom
(5 KB at 178.4 KB/sec)
2017-04-06T01:12:49.835 [INFO] Downloading: https://repo.maven.apache.org/maven2/org/slf4j/slf4j-api/1.7.7/slf4j-api-1.7.7.pom
2017-04-06T01:12:49.859 [INFO] Downloaded: https://repo.maven.apache.org/maven2/org/slf4j/slf4j-api/1.7.7/slf4j-api-1.7.7.pom
(3 KB at 105.0 KB/sec)
2017-04-06T01:12:49.860 [INFO] Downloading: https://repo.maven.apache.org/maven2/org/slf4j/slf4j-parent/1.7.7/slf4j-parent-1.7.7.pom
2017-04-06T01:12:49.886 [INFO] Downloaded: https://repo.maven.apache.org/maven2/org/slf4j/slf4j-parent/1.7.7/slf4j-parent-1.7.7.pom
(12 KB at 447.2 KB/sec)
2017-04-06T01:12:49.889 [INFO] Downloading: https://repo.maven.apache.org/maven2/joda-time/joda-time/2.7/joda-time-2.7.pom
2017-04-06T01:12:49.918 [INFO] Downloaded: https://repo.maven.apache.org/maven2/joda-time/joda-time/2.7/joda-time-2.7.pom
(28 KB at 962.9 KB/sec)
2017-04-06T01:12:49.921 [INFO] Downloading: https://repo.maven.apache.org/maven2/org/slf4j/slf4j-simple/1.7.7/slf4j-simple-1.7.7.pom
2017-04-06T01:12:49.946 [INFO] Downloaded: https://repo.maven.apache.org/maven2/org/slf4j/slf4j-simple/1.7.7/slf4j-simple-1.7.7.pom
(2 KB at 59.9 KB/sec)
2017-04-06T01:12:49.950 [INFO] Downloading: https://repo.maven.apache.org/maven2/org/apache/maven/maven-plugin-api/2.0.10/maven-plugin-api-2.0.10.jar
2017-04-06T01:12:49.951 [INFO] Downloading: https://repo.maven.apache.org/maven2/org/apache/maven/maven-artifact-manager/2.0.10/maven-artifact-manager-2.0.10.jar
2017-04-06T01:12:49.951 [INFO] Downloading: https://repo.maven.apache.org/maven2/org/apache/maven/maven-model/2.0.10/maven-model-2.0.10.jar
2017-04-06T01:12:49.951 [INFO] Downloading: https://repo.maven.apache.org/maven2/org/apache/maven/maven-repository-metadata/2.0.10/maven-repository-metadata-2.0.10.jar
2017-04-06T01:12:49.952 [INFO] Downloading: https://repo.maven.apache.org/maven2/org/codehaus/plexus/plexus-utils/1.5.5/plexus-utils-1.5.5.jar
2017-04-06T01:12:49.979 [INFO] Downloaded: https://repo.maven.apache.org/maven2/org/apache/maven/maven-plugin-api/2.0.10/maven-plugin-api-2.0.10.jar
(13 KB at 434.2 KB/sec)
2017-04-06T01:12:49.979 [INFO] Downloading: https://repo.maven.apache.org/maven2/org/apache/maven/maven-artifact/2.0.10/maven-artifact-2.0.10.jar
2017-04-06T01:12:49.980 [INFO] Downloaded: https://repo.maven.apache.org/maven2/org/apache/maven/maven-repository-metadata/2.0.10/maven-repository-metadata-2.0.10.jar
(26 KB at 876.2 KB/sec)
2017-04-06T01:12:49.980 [INFO] Downloading: https://repo.maven.apache.org/maven2/org/apache/avro/avro-compiler/1.8.1/avro-compiler-1.8.1.jar
2017-04-06T01:12:49.983 [INFO] Downloaded: https://repo.maven.apache.org/maven2/org/apache/maven/maven-artifact-manager/2.0.10/maven-artifact-manager-2.0.10.jar
(57 KB at 1774.0 KB/sec)
2017-04-06T01:12:49.983 [INFO] Downloading: https://repo.maven.apache.org/maven2/org/xerial/snappy/snappy-java/1.1.1.3/snappy-java-1.1.1.3.jar
2017-04-06T01:12:49.985 [INFO] Downloaded: https://repo.maven.apache.org/maven2/org/apache/maven/maven-model/2.0.10/maven-model-2.0.10.jar
(94 KB at 2683.9 KB/sec)
2017-04-06T01:12:49.985 [INFO] Downloading: https://repo.maven.apache.org/maven2/org/apache/commons/commons-compress/1.8.1/commons-compress-1.8.1.jar
2017-04-06T01:12:49.998 [INFO] Downloaded: https://repo.maven.apache.org/maven2/org/codehaus/plexus/plexus-utils/1.5.5/plexus-utils-1.5.5.jar
(246 KB at 5221.0 KB/sec)
2017-04-06T01:12:49.998 [INFO] Downloading: https://repo.maven.apache.org/maven2/joda-time/joda-time/2.7/joda-time-2.7.jar
2017-04-06T01:12:50.013 [INFO] Downloaded: https://repo.maven.apache.org/maven2/org/apache/avro/avro-compiler/1.8.1/avro-compiler-1.8.1.jar
(80 KB at 1306.2 KB/sec)
2017-04-06T01:12:50.013 [INFO] Downloading: https://repo.maven.apache.org/maven2/org/slf4j/slf4j-api/1.7.7/slf4j-api-1.7.7.jar
2017-04-06T01:12:50.013 [INFO] Downloaded: https://repo.maven.apache.org/maven2/org/apache/maven/maven-artifact/2.0.10/maven-artifact-2.0.10.jar
(88 KB at 1430.0 KB/sec)
2017-04-06T01:12:50.013 [INFO] Downloading: https://repo.maven.apache.org/maven2/org/slf4j/slf4j-simple/1.7.7/slf4j-simple-1.7.7.jar
2017-04-06T01:12:50.036 [INFO] Downloaded: https://repo.maven.apache.org/maven2/org/apache/commons/commons-compress/1.8.1/commons-compress-1.8.1.jar
(357 KB at 4249.8 KB/sec)
2017-04-06T01:12:50.040 [INFO] Downloaded: https://repo.maven.apache.org/maven2/org/slf4j/slf4j-simple/1.7.7/slf4j-simple-1.7.7.jar
(11 KB at 119.9 KB/sec)
2017-04-06T01:12:50.042 [INFO] Downloaded: https://repo.maven.apache.org/maven2/org/slf4j/slf4j-api/1.7.7/slf4j-api-1.7.7.jar
(29 KB at 317.5 KB/sec)
2017-04-06T01:12:50.052 [INFO] Downloaded: https://repo.maven.apache.org/maven2/org/xerial/snappy/snappy-java/1.1.1.3/snappy-java-1.1.1.3.jar
(576 KB at 5752.5 KB/sec)
2017-04-06T01:12:50.067 [INFO] Downloaded: https://repo.maven.apache.org/maven2/joda-time/joda-time/2.7/joda-time-2.7.jar
(576 KB at 5004.2 KB/sec)
2017-04-06T01:12:50.512 [INFO] 
2017-04-06T01:12:50.512 [INFO] --- maven-remote-resources-plugin:1.5:process (process-resource-bundles)
@ beam-sdks-java-core ---
2017-04-06T01:12:51.141 [INFO] 
2017-04-06T01:12:51.141 [INFO] --- maven-resources-plugin:2.7:resources (default-resources)
@ beam-sdks-java-core ---
2017-04-06T01:12:51.142 [INFO] Using 'UTF-8' encoding to copy filtered resources.
2017-04-06T01:12:51.143 [INFO] Copying 1 resource
2017-04-06T01:12:51.149 [INFO] Copying 3 resources
2017-04-06T01:12:51.232 [INFO] 
2017-04-06T01:12:51.232 [INFO] --- maven-compiler-plugin:3.6.1:compile (default-compile) @
beam-sdks-java-core ---
2017-04-06T01:12:51.284 [INFO] Changes detected - recompiling the module!
2017-04-06T01:12:51.285 [INFO] Compiling 435 source files to <https://builds.apache.org/job/beam_PostCommit_Java_ValidatesRunner_Flink/ws/sdks/java/core/target/classes>
2017-04-06T01:12:55.512 [WARNING] bootstrap class path not set in conjunction with -source
1.7
2017-04-06T01:12:55.512 [INFO] <https://builds.apache.org/job/beam_PostCommit_Java_ValidatesRunner_Flink/ws/sdks/java/core/src/main/java/org/apache/beam/sdk/io/FileBasedSink.java>:
Some input files use or override a deprecated API.
2017-04-06T01:12:55.512 [INFO] <https://builds.apache.org/job/beam_PostCommit_Java_ValidatesRunner_Flink/ws/sdks/java/core/src/main/java/org/apache/beam/sdk/io/FileBasedSink.java>:
Recompile with -Xlint:deprecation for details.
2017-04-06T01:12:55.512 [INFO] <https://builds.apache.org/job/beam_PostCommit_Java_ValidatesRunner_Flink/ws/sdks/java/core/src/main/java/org/apache/beam/sdk/options/ValueProvider.java>:
Some input files use unchecked or unsafe operations.
2017-04-06T01:12:55.512 [INFO] <https://builds.apache.org/job/beam_PostCommit_Java_ValidatesRunner_Flink/ws/sdks/java/core/src/main/java/org/apache/beam/sdk/options/ValueProvider.java>:
Recompile with -Xlint:unchecked for details.
2017-04-06T01:12:55.604 [INFO] 
2017-04-06T01:12:55.604 [INFO] --- build-helper-maven-plugin:3.0.0:add-test-source (add-test-source)
@ beam-sdks-java-core ---
2017-04-06T01:12:55.606 [INFO] Test Source directory: <https://builds.apache.org/job/beam_PostCommit_Java_ValidatesRunner_Flink/ws/sdks/java/core/target/generated-test-sources/java>
added.
2017-04-06T01:12:55.656 [INFO] 
2017-04-06T01:12:55.656 [INFO] --- maven-resources-plugin:2.7:testResources (default-testResources)
@ beam-sdks-java-core ---
2017-04-06T01:12:55.658 [INFO] Using 'UTF-8' encoding to copy filtered resources.
2017-04-06T01:12:55.658 [INFO] skip non existing resourceDirectory <https://builds.apache.org/job/beam_PostCommit_Java_ValidatesRunner_Flink/ws/sdks/java/core/src/test/resources>
2017-04-06T01:12:55.658 [INFO] Copying 3 resources
2017-04-06T01:12:55.709 [INFO] 
2017-04-06T01:12:55.709 [INFO] --- maven-compiler-plugin:3.6.1:testCompile (default-testCompile)
@ beam-sdks-java-core ---
2017-04-06T01:12:55.759 [INFO] Changes detected - recompiling the module!
2017-04-06T01:12:55.759 [INFO] Compiling 267 source files to <https://builds.apache.org/job/beam_PostCommit_Java_ValidatesRunner_Flink/ws/sdks/java/core/target/test-classes>
2017-04-06T01:12:59.577 [INFO] <https://builds.apache.org/job/beam_PostCommit_Java_ValidatesRunner_Flink/ws/sdks/java/core/src/test/java/org/apache/beam/sdk/util/DefaultBucketTest.java>:
Some input files use or override a deprecated API.
2017-04-06T01:12:59.577 [INFO] <https://builds.apache.org/job/beam_PostCommit_Java_ValidatesRunner_Flink/ws/sdks/java/core/src/test/java/org/apache/beam/sdk/util/DefaultBucketTest.java>:
Recompile with -Xlint:deprecation for details.
2017-04-06T01:12:59.577 [INFO] <https://builds.apache.org/job/beam_PostCommit_Java_ValidatesRunner_Flink/ws/sdks/java/core/src/test/java/org/apache/beam/sdk/transforms/CombineFnsTest.java>:
Some input files use unchecked or unsafe operations.
2017-04-06T01:12:59.577 [INFO] <https://builds.apache.org/job/beam_PostCommit_Java_ValidatesRunner_Flink/ws/sdks/java/core/src/test/java/org/apache/beam/sdk/transforms/CombineFnsTest.java>:
Recompile with -Xlint:unchecked for details.
2017-04-06T01:12:59.629 [INFO] 
2017-04-06T01:12:59.629 [INFO] --- maven-checkstyle-plugin:2.17:check (default) @ beam-sdks-java-core
---
2017-04-06T01:13:25.162 [INFO] Starting audit...
[ERROR] <https://builds.apache.org/job/beam_PostCommit_Java_ValidatesRunner_Flink/ws/sdks/java/core/src/main/java/org/apache/beam/sdk/transforms/ViewFn.java>:21:8:
Unused import: org.apache.beam.sdk.runners.PipelineRunner. [UnusedImports]
Audit done.
2017-04-06T01:13:25.162 [INFO] There is 1 error reported by Checkstyle 6.19 with beam/checkstyle.xml
ruleset.
2017-04-06T01:13:25.171 [ERROR] src/main/java/org/apache/beam/sdk/transforms/ViewFn.java:[21,8]
(imports) UnusedImports: Unused import: org.apache.beam.sdk.runners.PipelineRunner.
[JENKINS] Archiving disabled
[JENKINS] Archiving disabled
[JENKINS] Archiving disabled
[JENKINS] Archiving disabled
[JENKINS] Archiving disabled
[JENKINS] Archiving disabled
[JENKINS] Archiving disabled
[JENKINS] Archiving disabled
[JENKINS] Archiving disabled
[JENKINS] Archiving disabled
[JENKINS] Archiving disabled
[JENKINS] Archiving disabled
[JENKINS] Archiving disabled
[JENKINS] Archiving disabled2017-04-06T01:13:28.440 [INFO] ------------------------------------------------------------------------

2017-04-06T01:13:28.440 [INFO] Reactor Summary:
2017-04-06T01:13:28.440 [INFO] 
2017-04-06T01:13:28.440 [INFO] Apache Beam :: Parent .............................. SUCCESS
[ 18.302 s]
2017-04-06T01:13:28.440 [INFO] Apache Beam :: SDKs :: Java :: Build Tools ......... SUCCESS
[  8.543 s]
2017-04-06T01:13:28.440 [INFO] Apache Beam :: SDKs ................................ SUCCESS
[  1.013 s]
2017-04-06T01:13:28.441 [INFO] Apache Beam :: SDKs :: Common ...................... SUCCESS
[  0.942 s]
2017-04-06T01:13:28.441 [INFO] Apache Beam :: SDKs :: Common :: Fn API ............ SUCCESS
[  9.661 s]
2017-04-06T01:13:28.441 [INFO] Apache Beam :: SDKs :: Common :: Runner API ........ SUCCESS
[  3.174 s]
2017-04-06T01:13:28.441 [INFO] Apache Beam :: SDKs :: Java ........................ SUCCESS
[  1.107 s]
2017-04-06T01:13:28.441 [INFO] Apache Beam :: SDKs :: Java :: Core ................ FAILURE
[ 41.937 s]
2017-04-06T01:13:28.441 [INFO] Apache Beam :: Runners ............................. SKIPPED
2017-04-06T01:13:28.441 [INFO] Apache Beam :: Runners :: Core Java Construction ... SKIPPED
2017-04-06T01:13:28.441 [INFO] Apache Beam :: Runners :: Core Java ................ SKIPPED
2017-04-06T01:13:28.441 [INFO] Apache Beam :: Runners :: Flink .................... SKIPPED
2017-04-06T01:13:28.441 [INFO] Apache Beam :: Runners :: Flink :: Core ............ SKIPPED
2017-04-06T01:13:28.441 [INFO] ------------------------------------------------------------------------
2017-04-06T01:13:28.441 [INFO] BUILD FAILURE
2017-04-06T01:13:28.441 [INFO] ------------------------------------------------------------------------
2017-04-06T01:13:28.441 [INFO] Total time: 01:46 min
2017-04-06T01:13:28.441 [INFO] Finished at: 2017-04-06T01:13:28+00:00
2017-04-06T01:13:28.767 [INFO] Final Memory: 98M/1490M
2017-04-06T01:13:28.767 [INFO] ------------------------------------------------------------------------
2017-04-06T01:13:28.772 [ERROR] Failed to execute goal org.apache.maven.plugins:maven-checkstyle-plugin:2.17:check
(default) on project beam-sdks-java-core: You have 1 Checkstyle violation. -> [Help 1]
org.apache.maven.lifecycle.LifecycleExecutionException: Failed to execute goal org.apache.maven.plugins:maven-checkstyle-plugin:2.17:check
(default) on project beam-sdks-java-core: You have 1 Checkstyle violation.
	at org.apache.maven.lifecycle.internal.MojoExecutor.execute(MojoExecutor.java:212)
	at org.apache.maven.lifecycle.internal.MojoExecutor.execute(MojoExecutor.java:153)
	at org.apache.maven.lifecycle.internal.MojoExecutor.execute(MojoExecutor.java:145)
	at org.apache.maven.lifecycle.internal.LifecycleModuleBuilder.buildProject(LifecycleModuleBuilder.java:116)
	at org.apache.maven.lifecycle.internal.LifecycleModuleBuilder.buildProject(LifecycleModuleBuilder.java:80)
	at org.apache.maven.lifecycle.internal.builder.singlethreaded.SingleThreadedBuilder.build(SingleThreadedBuilder.java:51)
	at org.apache.maven.lifecycle.internal.LifecycleStarter.execute(LifecycleStarter.java:128)
	at org.apache.maven.DefaultMaven.doExecute(DefaultMaven.java:307)
	at org.apache.maven.DefaultMaven.doExecute(DefaultMaven.java:193)
	at org.apache.maven.DefaultMaven.execute(DefaultMaven.java:106)
	at org.jvnet.hudson.maven3.launcher.Maven33Launcher.main(Maven33Launcher.java:129)
	at sun.reflect.NativeMethodAccessorImpl.invoke0(Native Method)
	at sun.reflect.NativeMethodAccessorImpl.invoke(NativeMethodAccessorImpl.java:62)
	at sun.reflect.DelegatingMethodAccessorImpl.invoke(DelegatingMethodAccessorImpl.java:43)
	at java.lang.reflect.Method.invoke(Method.java:498)
	at org.codehaus.plexus.classworlds.launcher.Launcher.launchStandard(Launcher.java:330)
	at org.codehaus.plexus.classworlds.launcher.Launcher.launch(Launcher.java:238)
	at jenkins.maven3.agent.Maven33Main.launch(Maven33Main.java:176)
	at sun.reflect.NativeMethodAccessorImpl.invoke0(Native Method)
	at sun.reflect.NativeMethodAccessorImpl.invoke(NativeMethodAccessorImpl.java:62)
	at sun.reflect.DelegatingMethodAccessorImpl.invoke(DelegatingMethodAccessorImpl.java:43)
	at java.lang.reflect.Method.invoke(Method.java:498)
	at hudson.maven.Maven3Builder.call(Maven3Builder.java:139)
	at hudson.maven.Maven3Builder.call(Maven3Builder.java:70)
	at hudson.remoting.UserRequest.perform(UserRequest.java:153)
	at hudson.remoting.UserRequest.perform(UserRequest.java:50)
	at hudson.remoting.Request$2.run(Request.java:336)
	at hudson.remoting.InterceptingExecutorService$1.call(InterceptingExecutorService.java:68)
	at java.util.concurrent.FutureTask.run(FutureTask.java:266)
	at java.util.concurrent.ThreadPoolExecutor.runWorker(ThreadPoolExecutor.java:1142)
	at java.util.concurrent.ThreadPoolExecutor$Worker.run(ThreadPoolExecutor.java:617)
	at java.lang.Thread.run(Thread.java:745)
Caused by: org.apache.maven.plugin.MojoFailureException: You have 1 Checkstyle violation.
	at org.apache.maven.plugin.checkstyle.CheckstyleViolationCheckMojo.execute(CheckstyleViolationCheckMojo.java:588)
	at org.apache.maven.plugin.DefaultBuildPluginManager.executeMojo(DefaultBuildPluginManager.java:134)
	at org.apache.maven.lifecycle.internal.MojoExecutor.execute(MojoExecutor.java:208)
	... 31 more
2017-04-06T01:13:28.773 [ERROR] 
2017-04-06T01:13:28.773 [ERROR] Re-run Maven using the -X switch to enable full debug logging.
2017-04-06T01:13:28.773 [ERROR] 
2017-04-06T01:13:28.773 [ERROR] For more information about the errors and possible solutions,
please read the following articles:
2017-04-06T01:13:28.773 [ERROR] [Help 1] http://cwiki.apache.org/confluence/display/MAVEN/MojoFailureException
2017-04-06T01:13:28.773 [ERROR] 
2017-04-06T01:13:28.773 [ERROR] After correcting the problems, you can resume the build with
the command
2017-04-06T01:13:28.773 [ERROR]   mvn <goals> -rf :beam-sdks-java-core
channel stopped

Mime
View raw message