beam-commits mailing list archives

Site index · List index
Message view « Date » · « Thread »
Top « Date » · « Thread »
From Apache Jenkins Server <jenk...@builds.apache.org>
Subject Build failed in Jenkins: beam_PostCommit_Java_ValidatesRunner_Flink #2400
Date Wed, 19 Apr 2017 15:43:52 GMT
See <https://builds.apache.org/job/beam_PostCommit_Java_ValidatesRunner_Flink/2400/display/redirect>

------------------------------------------
[...truncated 800.03 KB...]
2017-04-19T15:42:52.796 [INFO] Downloading: https://repo.maven.apache.org/maven2/org/apache/directory/server/apacheds-interceptor-kerberos/2.0.0-M15/apacheds-interceptor-kerberos-2.0.0-M15.jar
2017-04-19T15:42:52.827 [INFO] Downloaded: https://repo.maven.apache.org/maven2/org/apache/directory/server/apacheds-interceptor-kerberos/2.0.0-M15/apacheds-interceptor-kerberos-2.0.0-M15.jar
(16 KB at 7.3 KB/sec)
2017-04-19T15:42:52.827 [INFO] Downloading: https://repo.maven.apache.org/maven2/org/apache/directory/server/apacheds-core/2.0.0-M15/apacheds-core-2.0.0-M15.jar
2017-04-19T15:42:52.861 [INFO] Downloaded: https://repo.maven.apache.org/maven2/org/apache/directory/server/apacheds-core/2.0.0-M15/apacheds-core-2.0.0-M15.jar
(45 KB at 21.3 KB/sec)
2017-04-19T15:42:52.861 [INFO] Downloading: https://repo.maven.apache.org/maven2/org/apache/directory/server/apacheds-interceptors-admin/2.0.0-M15/apacheds-interceptors-admin-2.0.0-M15.jar
2017-04-19T15:42:52.878 [INFO] Downloaded: https://repo.maven.apache.org/maven2/org/apache/directory/api/api-ldap-model/1.0.0-M20/api-ldap-model-1.0.0-M20.jar
(868 KB at 410.3 KB/sec)
2017-04-19T15:42:52.879 [INFO] Downloading: https://repo.maven.apache.org/maven2/org/apache/directory/server/apacheds-interceptors-authn/2.0.0-M15/apacheds-interceptors-authn-2.0.0-M15.jar
2017-04-19T15:42:52.881 [INFO] Downloaded: https://repo.maven.apache.org/maven2/org/apache/mina/mina-core/2.0.7/mina-core-2.0.7.jar
(630 KB at 297.3 KB/sec)
2017-04-19T15:42:52.881 [INFO] Downloading: https://repo.maven.apache.org/maven2/org/apache/directory/server/apacheds-interceptors-authz/2.0.0-M15/apacheds-interceptors-authz-2.0.0-M15.jar
2017-04-19T15:42:52.891 [INFO] Downloaded: https://repo.maven.apache.org/maven2/org/apache/directory/server/apacheds-interceptors-admin/2.0.0-M15/apacheds-interceptors-admin-2.0.0-M15.jar
(20 KB at 9.2 KB/sec)
2017-04-19T15:42:52.891 [INFO] Downloading: https://repo.maven.apache.org/maven2/org/apache/directory/server/apacheds-interceptors-changelog/2.0.0-M15/apacheds-interceptors-changelog-2.0.0-M15.jar
2017-04-19T15:42:52.909 [INFO] Downloaded: https://repo.maven.apache.org/maven2/org/apache/directory/server/apacheds-interceptors-authn/2.0.0-M15/apacheds-interceptors-authn-2.0.0-M15.jar
(41 KB at 18.9 KB/sec)
2017-04-19T15:42:52.909 [INFO] Downloading: https://repo.maven.apache.org/maven2/org/apache/directory/server/apacheds-interceptors-collective/2.0.0-M15/apacheds-interceptors-collective-2.0.0-M15.jar
2017-04-19T15:42:52.915 [INFO] Downloaded: https://repo.maven.apache.org/maven2/org/apache/directory/server/apacheds-interceptors-authz/2.0.0-M15/apacheds-interceptors-authz-2.0.0-M15.jar
(63 KB at 29.2 KB/sec)
2017-04-19T15:42:52.915 [INFO] Downloading: https://repo.maven.apache.org/maven2/org/apache/directory/server/apacheds-interceptors-event/2.0.0-M15/apacheds-interceptors-event-2.0.0-M15.jar
2017-04-19T15:42:52.915 [INFO] Downloaded: https://repo.maven.apache.org/maven2/net/sf/ehcache/ehcache-core/2.4.4/ehcache-core-2.4.4.jar
(986 KB at 458.1 KB/sec)
2017-04-19T15:42:52.915 [INFO] Downloading: https://repo.maven.apache.org/maven2/org/apache/directory/server/apacheds-interceptors-exception/2.0.0-M15/apacheds-interceptors-exception-2.0.0-M15.jar
2017-04-19T15:42:52.918 [INFO] Downloaded: https://repo.maven.apache.org/maven2/org/apache/directory/server/apacheds-interceptors-changelog/2.0.0-M15/apacheds-interceptors-changelog-2.0.0-M15.jar
(21 KB at 9.7 KB/sec)
2017-04-19T15:42:52.919 [INFO] Downloading: https://repo.maven.apache.org/maven2/org/apache/directory/server/apacheds-interceptors-journal/2.0.0-M15/apacheds-interceptors-journal-2.0.0-M15.jar
2017-04-19T15:42:52.937 [INFO] Downloaded: https://repo.maven.apache.org/maven2/org/apache/directory/server/apacheds-interceptors-collective/2.0.0-M15/apacheds-interceptors-collective-2.0.0-M15.jar
(14 KB at 6.2 KB/sec)
2017-04-19T15:42:52.937 [INFO] Downloading: https://repo.maven.apache.org/maven2/org/apache/directory/server/apacheds-interceptors-normalization/2.0.0-M15/apacheds-interceptors-normalization-2.0.0-M15.jar
2017-04-19T15:42:52.942 [INFO] Downloaded: https://repo.maven.apache.org/maven2/org/apache/directory/server/apacheds-interceptors-event/2.0.0-M15/apacheds-interceptors-event-2.0.0-M15.jar
(19 KB at 8.4 KB/sec)
2017-04-19T15:42:52.942 [INFO] Downloading: https://repo.maven.apache.org/maven2/org/apache/directory/server/apacheds-interceptors-operational/2.0.0-M15/apacheds-interceptors-operational-2.0.0-M15.jar
2017-04-19T15:42:52.942 [INFO] Downloaded: https://repo.maven.apache.org/maven2/org/apache/directory/server/apacheds-interceptors-exception/2.0.0-M15/apacheds-interceptors-exception-2.0.0-M15.jar
(11 KB at 5.0 KB/sec)
2017-04-19T15:42:52.942 [INFO] Downloading: https://repo.maven.apache.org/maven2/org/apache/directory/server/apacheds-interceptors-referral/2.0.0-M15/apacheds-interceptors-referral-2.0.0-M15.jar
2017-04-19T15:42:52.946 [INFO] Downloaded: https://repo.maven.apache.org/maven2/org/apache/directory/server/apacheds-interceptors-journal/2.0.0-M15/apacheds-interceptors-journal-2.0.0-M15.jar
(14 KB at 6.1 KB/sec)
2017-04-19T15:42:52.946 [INFO] Downloading: https://repo.maven.apache.org/maven2/org/apache/directory/server/apacheds-interceptors-schema/2.0.0-M15/apacheds-interceptors-schema-2.0.0-M15.jar
2017-04-19T15:42:52.963 [INFO] Downloaded: https://repo.maven.apache.org/maven2/org/apache/directory/server/apacheds-interceptors-normalization/2.0.0-M15/apacheds-interceptors-normalization-2.0.0-M15.jar
(16 KB at 6.8 KB/sec)
2017-04-19T15:42:52.963 [INFO] Downloading: https://repo.maven.apache.org/maven2/org/apache/directory/server/apacheds-interceptors-subtree/2.0.0-M15/apacheds-interceptors-subtree-2.0.0-M15.jar
2017-04-19T15:42:52.970 [INFO] Downloaded: https://repo.maven.apache.org/maven2/org/apache/directory/server/apacheds-interceptors-operational/2.0.0-M15/apacheds-interceptors-operational-2.0.0-M15.jar
(15 KB at 6.7 KB/sec)
2017-04-19T15:42:52.970 [INFO] Downloading: https://repo.maven.apache.org/maven2/org/apache/directory/server/apacheds-interceptors-trigger/2.0.0-M15/apacheds-interceptors-trigger-2.0.0-M15.jar
2017-04-19T15:42:52.971 [INFO] Downloaded: https://repo.maven.apache.org/maven2/org/apache/directory/server/apacheds-interceptors-referral/2.0.0-M15/apacheds-interceptors-referral-2.0.0-M15.jar
(12 KB at 5.0 KB/sec)
2017-04-19T15:42:52.971 [INFO] Downloading: https://repo.maven.apache.org/maven2/org/apache/directory/api/api-ldap-extras-trigger/1.0.0-M20/api-ldap-extras-trigger-1.0.0-M20.jar
2017-04-19T15:42:52.976 [INFO] Downloaded: https://repo.maven.apache.org/maven2/org/apache/directory/server/apacheds-interceptors-schema/2.0.0-M15/apacheds-interceptors-schema-2.0.0-M15.jar
(40 KB at 17.6 KB/sec)
2017-04-19T15:42:52.976 [INFO] Downloading: https://repo.maven.apache.org/maven2/org/apache/directory/server/apacheds-kerberos-codec/2.0.0-M15/apacheds-kerberos-codec-2.0.0-M15.jar
2017-04-19T15:42:52.992 [INFO] Downloaded: https://repo.maven.apache.org/maven2/org/apache/directory/server/apacheds-interceptors-subtree/2.0.0-M15/apacheds-interceptors-subtree-2.0.0-M15.jar
(26 KB at 11.4 KB/sec)
2017-04-19T15:42:52.992 [INFO] Downloading: https://repo.maven.apache.org/maven2/org/apache/directory/server/apacheds-protocol-shared/2.0.0-M15/apacheds-protocol-shared-2.0.0-M15.jar
2017-04-19T15:42:53.000 [INFO] Downloaded: https://repo.maven.apache.org/maven2/org/apache/directory/server/apacheds-interceptors-trigger/2.0.0-M15/apacheds-interceptors-trigger-2.0.0-M15.jar
(47 KB at 20.8 KB/sec)
2017-04-19T15:42:53.000 [INFO] Downloading: https://repo.maven.apache.org/maven2/org/apache/directory/server/apacheds-protocol-kerberos/2.0.0-M15/apacheds-protocol-kerberos-2.0.0-M15.jar
2017-04-19T15:42:53.004 [INFO] Downloaded: https://repo.maven.apache.org/maven2/org/apache/directory/api/api-ldap-extras-trigger/1.0.0-M20/api-ldap-extras-trigger-1.0.0-M20.jar
(48 KB at 21.2 KB/sec)
2017-04-19T15:42:53.004 [INFO] Downloading: https://repo.maven.apache.org/maven2/org/apache/directory/server/apacheds-core-shared/2.0.0-M15/apacheds-core-shared-2.0.0-M15.jar
2017-04-19T15:42:53.037 [INFO] Downloaded: https://repo.maven.apache.org/maven2/org/apache/directory/server/apacheds-core-shared/2.0.0-M15/apacheds-core-shared-2.0.0-M15.jar
(37 KB at 16.2 KB/sec)
2017-04-19T15:42:53.037 [INFO] Downloading: https://repo.maven.apache.org/maven2/org/apache/directory/server/apacheds-ldif-partition/2.0.0-M15/apacheds-ldif-partition-2.0.0-M15.jar
2017-04-19T15:42:53.037 [INFO] Downloaded: https://repo.maven.apache.org/maven2/org/apache/directory/server/apacheds-protocol-kerberos/2.0.0-M15/apacheds-protocol-kerberos-2.0.0-M15.jar
(83 KB at 36.3 KB/sec)
2017-04-19T15:42:53.037 [INFO] Downloading: https://repo.maven.apache.org/maven2/org/apache/directory/server/apacheds-xdbm-partition/2.0.0-M15/apacheds-xdbm-partition-2.0.0-M15.jar
2017-04-19T15:42:53.047 [INFO] Downloaded: https://repo.maven.apache.org/maven2/org/apache/directory/server/apacheds-protocol-shared/2.0.0-M15/apacheds-protocol-shared-2.0.0-M15.jar
(32 KB at 13.7 KB/sec)
2017-04-19T15:42:53.047 [INFO] Downloading: https://repo.maven.apache.org/maven2/org/apache/directory/server/apacheds-mavibot-partition/2.0.0-M15/apacheds-mavibot-partition-2.0.0-M15.jar
2017-04-19T15:42:53.053 [INFO] Downloaded: https://repo.maven.apache.org/maven2/org/apache/directory/server/apacheds-kerberos-codec/2.0.0-M15/apacheds-kerberos-codec-2.0.0-M15.jar
(676 KB at 294.9 KB/sec)
2017-04-19T15:42:53.054 [INFO] Downloading: https://repo.maven.apache.org/maven2/org/apache/directory/mavibot/mavibot/1.0.0-M1/mavibot-1.0.0-M1.jar
2017-04-19T15:42:53.074 [INFO] Downloaded: https://repo.maven.apache.org/maven2/org/apache/directory/server/apacheds-ldif-partition/2.0.0-M15/apacheds-ldif-partition-2.0.0-M15.jar
(29 KB at 12.3 KB/sec)
2017-04-19T15:42:53.074 [INFO] Downloading: https://repo.maven.apache.org/maven2/org/apache/directory/server/apacheds-core-avl/2.0.0-M15/apacheds-core-avl-2.0.0-M15.jar
2017-04-19T15:42:53.079 [INFO] Downloaded: https://repo.maven.apache.org/maven2/org/apache/directory/server/apacheds-mavibot-partition/2.0.0-M15/apacheds-mavibot-partition-2.0.0-M15.jar
(48 KB at 20.3 KB/sec)
2017-04-19T15:42:53.079 [INFO] Downloading: https://repo.maven.apache.org/maven2/org/apache/directory/api/api-all/1.0.0-M20/api-all-1.0.0-M20.jar
2017-04-19T15:42:53.081 [INFO] Downloaded: https://repo.maven.apache.org/maven2/org/apache/directory/server/apacheds-xdbm-partition/2.0.0-M15/apacheds-xdbm-partition-2.0.0-M15.jar
(173 KB at 74.6 KB/sec)
2017-04-19T15:42:53.081 [INFO] Downloading: https://repo.maven.apache.org/maven2/commons-pool/commons-pool/1.6/commons-pool-1.6.jar
2017-04-19T15:42:53.085 [INFO] Downloaded: https://repo.maven.apache.org/maven2/org/apache/flink/flink-shaded-hadoop2/1.2.0/flink-shaded-hadoop2-1.2.0.jar
(17859 KB at 7687.9 KB/sec)
2017-04-19T15:42:53.085 [INFO] Downloading: https://repo.maven.apache.org/maven2/org/apache/directory/server/apacheds-jdbm-partition/2.0.0-M15/apacheds-jdbm-partition-2.0.0-M15.jar
2017-04-19T15:42:53.092 [INFO] Downloaded: https://repo.maven.apache.org/maven2/org/apache/directory/mavibot/mavibot/1.0.0-M1/mavibot-1.0.0-M1.jar
(146 KB at 62.4 KB/sec)
2017-04-19T15:42:53.092 [INFO] Downloading: https://repo.maven.apache.org/maven2/org/apache/directory/server/apacheds-protocol-ldap/2.0.0-M15/apacheds-protocol-ldap-2.0.0-M15.jar
2017-04-19T15:42:53.108 [INFO] Downloaded: https://repo.maven.apache.org/maven2/org/apache/directory/server/apacheds-core-avl/2.0.0-M15/apacheds-core-avl-2.0.0-M15.jar
(60 KB at 25.4 KB/sec)
2017-04-19T15:42:53.109 [INFO] Downloading: https://repo.maven.apache.org/maven2/org/apache/directory/api/api-asn1-ber/1.0.0-M20/api-asn1-ber-1.0.0-M20.jar
2017-04-19T15:42:53.116 [INFO] Downloaded: https://repo.maven.apache.org/maven2/commons-pool/commons-pool/1.6/commons-pool-1.6.jar
(109 KB at 46.1 KB/sec)
2017-04-19T15:42:53.116 [INFO] Downloading: https://repo.maven.apache.org/maven2/org/apache/directory/api/api-ldap-extras-codec-api/1.0.0-M20/api-ldap-extras-codec-api-1.0.0-M20.jar
2017-04-19T15:42:53.118 [INFO] Downloaded: https://repo.maven.apache.org/maven2/org/apache/directory/server/apacheds-jdbm-partition/2.0.0-M15/apacheds-jdbm-partition-2.0.0-M15.jar
(71 KB at 30.0 KB/sec)
2017-04-19T15:42:53.118 [INFO] Downloading: https://repo.maven.apache.org/maven2/org/apache/directory/api/api-ldap-extras-codec/1.0.0-M20/api-ldap-extras-codec-1.0.0-M20.jar
2017-04-19T15:42:53.137 [INFO] Downloaded: https://repo.maven.apache.org/maven2/org/apache/directory/server/apacheds-protocol-ldap/2.0.0-M15/apacheds-protocol-ldap-2.0.0-M15.jar
(224 KB at 94.0 KB/sec)
2017-04-19T15:42:53.137 [INFO] Downloading: https://repo.maven.apache.org/maven2/org/apache/directory/api/api-ldap-extras-sp/1.0.0-M20/api-ldap-extras-sp-1.0.0-M20.jar
2017-04-19T15:42:53.138 [INFO] Downloaded: https://repo.maven.apache.org/maven2/org/apache/directory/api/api-asn1-ber/1.0.0-M20/api-asn1-ber-1.0.0-M20.jar
(42 KB at 17.3 KB/sec)
2017-04-19T15:42:53.138 [INFO] Downloading: https://repo.maven.apache.org/maven2/bouncycastle/bcprov-jdk15/140/bcprov-jdk15-140.jar
2017-04-19T15:42:53.148 [INFO] Downloaded: https://repo.maven.apache.org/maven2/org/apache/directory/api/api-ldap-extras-codec-api/1.0.0-M20/api-ldap-extras-codec-api-1.0.0-M20.jar
(54 KB at 22.4 KB/sec)
2017-04-19T15:42:53.162 [INFO] Downloaded: https://repo.maven.apache.org/maven2/org/apache/directory/api/api-ldap-extras-codec/1.0.0-M20/api-ldap-extras-codec-1.0.0-M20.jar
(204 KB at 84.7 KB/sec)
2017-04-19T15:42:53.164 [INFO] Downloaded: https://repo.maven.apache.org/maven2/org/apache/directory/api/api-ldap-extras-sp/1.0.0-M20/api-ldap-extras-sp-1.0.0-M20.jar
(13 KB at 5.2 KB/sec)
2017-04-19T15:42:53.274 [INFO] Downloaded: https://repo.maven.apache.org/maven2/bouncycastle/bcprov-jdk15/140/bcprov-jdk15-140.jar
(1557 KB at 619.7 KB/sec)
2017-04-19T15:42:53.332 [INFO] Downloaded: https://repo.maven.apache.org/maven2/org/apache/directory/api/api-all/1.0.0-M20/api-all-1.0.0-M20.jar
(2708 KB at 1053.7 KB/sec)
2017-04-19T15:42:53.356 [INFO] 
2017-04-19T15:42:53.356 [INFO] --- maven-clean-plugin:3.0.0:clean (default-clean) @ beam-runners-flink
---
2017-04-19T15:42:53.358 [INFO] Deleting <https://builds.apache.org/job/beam_PostCommit_Java_ValidatesRunner_Flink/ws/runners/flink>
(includes = [**/*.pyc, **/*.egg-info/], excludes = [])
2017-04-19T15:42:53.410 [INFO] 
2017-04-19T15:42:53.410 [INFO] --- maven-enforcer-plugin:1.4.1:enforce (enforce) @ beam-runners-flink
---
2017-04-19T15:42:57.233 [INFO] 
2017-04-19T15:42:57.233 [INFO] --- maven-remote-resources-plugin:1.5:process (process-resource-bundles)
@ beam-runners-flink ---
2017-04-19T15:42:58.489 [INFO] 
2017-04-19T15:42:58.489 [INFO] --- maven-resources-plugin:2.7:resources (default-resources)
@ beam-runners-flink ---
2017-04-19T15:42:58.490 [INFO] Using 'UTF-8' encoding to copy filtered resources.
2017-04-19T15:42:58.491 [INFO] Copying 1 resource
2017-04-19T15:42:58.491 [INFO] Copying 3 resources
2017-04-19T15:42:58.577 [INFO] 
2017-04-19T15:42:58.577 [INFO] --- maven-compiler-plugin:3.6.1:compile (default-compile) @
beam-runners-flink ---
2017-04-19T15:42:58.589 [INFO] Changes detected - recompiling the module!
2017-04-19T15:42:58.590 [INFO] Compiling 70 source files to <https://builds.apache.org/job/beam_PostCommit_Java_ValidatesRunner_Flink/ws/runners/flink/target/classes>
2017-04-19T15:42:59.338 [WARNING] bootstrap class path not set in conjunction with -source
1.7
2017-04-19T15:42:59.338 [INFO] <https://builds.apache.org/job/beam_PostCommit_Java_ValidatesRunner_Flink/ws/runners/flink/src/main/java/org/apache/beam/runners/flink/translation/utils/SerializedPipelineOptions.java>:
Some input files use or override a deprecated API.
2017-04-19T15:42:59.338 [INFO] <https://builds.apache.org/job/beam_PostCommit_Java_ValidatesRunner_Flink/ws/runners/flink/src/main/java/org/apache/beam/runners/flink/translation/utils/SerializedPipelineOptions.java>:
Recompile with -Xlint:deprecation for details.
2017-04-19T15:42:59.338 [INFO] <https://builds.apache.org/job/beam_PostCommit_Java_ValidatesRunner_Flink/ws/runners/flink/src/main/java/org/apache/beam/runners/flink/FlinkRunnerResult.java>:
Some input files use unchecked or unsafe operations.
2017-04-19T15:42:59.338 [INFO] <https://builds.apache.org/job/beam_PostCommit_Java_ValidatesRunner_Flink/ws/runners/flink/src/main/java/org/apache/beam/runners/flink/FlinkRunnerResult.java>:
Recompile with -Xlint:unchecked for details.
2017-04-19T15:42:59.603 [INFO] 
2017-04-19T15:42:59.603 [INFO] --- maven-resources-plugin:2.7:testResources (default-testResources)
@ beam-runners-flink ---
2017-04-19T15:42:59.604 [INFO] Using 'UTF-8' encoding to copy filtered resources.
2017-04-19T15:42:59.604 [INFO] Copying 1 resource
2017-04-19T15:42:59.604 [INFO] Copying 3 resources
2017-04-19T15:42:59.695 [INFO] 
2017-04-19T15:42:59.695 [INFO] --- maven-compiler-plugin:3.6.1:testCompile (default-testCompile)
@ beam-runners-flink ---
2017-04-19T15:42:59.704 [INFO] Changes detected - recompiling the module!
2017-04-19T15:42:59.705 [INFO] Compiling 17 source files to <https://builds.apache.org/job/beam_PostCommit_Java_ValidatesRunner_Flink/ws/runners/flink/target/test-classes>
2017-04-19T15:42:59.998 [INFO] -------------------------------------------------------------
2017-04-19T15:42:59.998 [ERROR] COMPILATION ERROR : 
2017-04-19T15:42:59.998 [INFO] -------------------------------------------------------------
2017-04-19T15:42:59.998 [ERROR] <https://builds.apache.org/job/beam_PostCommit_Java_ValidatesRunner_Flink/ws/runners/flink/src/test/java/org/apache/beam/runners/flink/WriteSinkITCase.java>:[32,30]
cannot find symbol
  symbol:   class Sink
  location: package org.apache.beam.sdk.io
2017-04-19T15:42:59.998 [ERROR] <https://builds.apache.org/job/beam_PostCommit_Java_ValidatesRunner_Flink/ws/runners/flink/src/test/java/org/apache/beam/runners/flink/WriteSinkITCase.java>:[33,30]
cannot find symbol
  symbol:   class Write
  location: package org.apache.beam.sdk.io
2017-04-19T15:42:59.998 [ERROR] <https://builds.apache.org/job/beam_PostCommit_Java_ValidatesRunner_Flink/ws/runners/flink/src/test/java/org/apache/beam/runners/flink/WriteSinkITCase.java>:[93,45]
cannot find symbol
  symbol:   class Sink
  location: class org.apache.beam.runners.flink.WriteSinkITCase
2017-04-19T15:42:59.998 [ERROR] <https://builds.apache.org/job/beam_PostCommit_Java_ValidatesRunner_Flink/ws/runners/flink/src/test/java/org/apache/beam/runners/flink/WriteSinkITCase.java>:[107,12]
cannot find symbol
  symbol:   class WriteOperation
  location: class org.apache.beam.runners.flink.WriteSinkITCase.MyCustomSink
2017-04-19T15:42:59.998 [ERROR] <https://builds.apache.org/job/beam_PostCommit_Java_ValidatesRunner_Flink/ws/runners/flink/src/test/java/org/apache/beam/runners/flink/WriteSinkITCase.java>:[111,44]
cannot find symbol
  symbol:   class WriteOperation
  location: class org.apache.beam.runners.flink.WriteSinkITCase.MyCustomSink
2017-04-19T15:42:59.998 [ERROR] <https://builds.apache.org/job/beam_PostCommit_Java_ValidatesRunner_Flink/ws/runners/flink/src/test/java/org/apache/beam/runners/flink/WriteSinkITCase.java>:[135,14]
cannot find symbol
  symbol:   class Writer
  location: class org.apache.beam.runners.flink.WriteSinkITCase.MyCustomSink.MyWriteOperation
2017-04-19T15:42:59.998 [ERROR] <https://builds.apache.org/job/beam_PostCommit_Java_ValidatesRunner_Flink/ws/runners/flink/src/test/java/org/apache/beam/runners/flink/WriteSinkITCase.java>:[140,14]
cannot find symbol
  symbol:   class Sink
  location: class org.apache.beam.runners.flink.WriteSinkITCase.MyCustomSink.MyWriteOperation
2017-04-19T15:42:59.998 [ERROR] <https://builds.apache.org/job/beam_PostCommit_Java_ValidatesRunner_Flink/ws/runners/flink/src/test/java/org/apache/beam/runners/flink/WriteSinkITCase.java>:[147,38]
cannot find symbol
  symbol:   class Writer
  location: class org.apache.beam.runners.flink.WriteSinkITCase.MyCustomSink.MyWriteOperation
2017-04-19T15:42:59.998 [ERROR] <https://builds.apache.org/job/beam_PostCommit_Java_ValidatesRunner_Flink/ws/runners/flink/src/test/java/org/apache/beam/runners/flink/WriteSinkITCase.java>:[184,16]
cannot find symbol
  symbol:   class WriteOperation
  location: class org.apache.beam.runners.flink.WriteSinkITCase.MyCustomSink.MyWriteOperation.MyWriter
2017-04-19T15:42:59.998 [INFO] 9 errors 
2017-04-19T15:42:59.998 [INFO] -------------------------------------------------------------
[JENKINS] Archiving disabled
[JENKINS] Archiving disabled
[JENKINS] Archiving disabled
[JENKINS] Archiving disabled
[JENKINS] Archiving disabled
[JENKINS] Archiving disabled
[JENKINS] Archiving disabled
[JENKINS] Archiving disabled
[JENKINS] Archiving disabled
[JENKINS] Archiving disabled
[JENKINS] Archiving disabled
[JENKINS] Archiving disabled
[JENKINS] Archiving disabled
2017-04-19T15:43:11.108 [INFO] ------------------------------------------------------------------------
2017-04-19T15:43:11.108 [INFO] Reactor Summary:
2017-04-19T15:43:11.108 [INFO] 
2017-04-19T15:43:11.108 [INFO] Apache Beam :: Parent .............................. SUCCESS
[ 29.859 s]
2017-04-19T15:43:11.108 [INFO] Apache Beam :: SDKs :: Java :: Build Tools ......... SUCCESS
[ 23.339 s]
2017-04-19T15:43:11.108 [INFO] Apache Beam :: SDKs ................................ SUCCESS
[  3.579 s]
2017-04-19T15:43:11.108 [INFO] Apache Beam :: SDKs :: Common ...................... SUCCESS
[  4.660 s]
2017-04-19T15:43:11.108 [INFO] Apache Beam :: SDKs :: Common :: Fn API ............ SUCCESS
[ 18.306 s]
2017-04-19T15:43:11.108 [INFO] Apache Beam :: SDKs :: Common :: Runner API ........ SUCCESS
[ 13.903 s]
2017-04-19T15:43:11.108 [INFO] Apache Beam :: SDKs :: Java ........................ SUCCESS
[ 11.664 s]
2017-04-19T15:43:11.108 [INFO] Apache Beam :: SDKs :: Java :: Core ................ SUCCESS
[01:48 min]
2017-04-19T15:43:11.108 [INFO] Apache Beam :: Runners ............................. SUCCESS
[  6.466 s]
2017-04-19T15:43:11.108 [INFO] Apache Beam :: Runners :: Core Construction Java ... SUCCESS
[ 19.311 s]
2017-04-19T15:43:11.108 [INFO] Apache Beam :: Runners :: Core Java ................ SUCCESS
[ 35.815 s]
2017-04-19T15:43:11.108 [INFO] Apache Beam :: Runners :: Flink .................... FAILURE
[ 15.115 s]
2017-04-19T15:43:11.108 [INFO] ------------------------------------------------------------------------
2017-04-19T15:43:11.108 [INFO] BUILD FAILURE
2017-04-19T15:43:11.108 [INFO] ------------------------------------------------------------------------
2017-04-19T15:43:11.108 [INFO] Total time: 13:17 min
2017-04-19T15:43:11.108 [INFO] Finished at: 2017-04-19T15:43:11+00:00
2017-04-19T15:43:11.580 [INFO] Final Memory: 130M/1739M
2017-04-19T15:43:11.581 [INFO] ------------------------------------------------------------------------
Waiting for Jenkins to finish collecting data
2017-04-19T15:43:40.273 [ERROR] Failed to execute goal org.apache.maven.plugins:maven-compiler-plugin:3.6.1:testCompile
(default-testCompile) on project beam-runners-flink: Compilation failure: Compilation failure:
2017-04-19T15:43:40.273 [ERROR] <https://builds.apache.org/job/beam_PostCommit_Java_ValidatesRunner_Flink/ws/runners/flink/src/test/java/org/apache/beam/runners/flink/WriteSinkITCase.java>:[32,30]
cannot find symbol
2017-04-19T15:43:40.273 [ERROR] symbol:   class Sink
2017-04-19T15:43:40.273 [ERROR] location: package org.apache.beam.sdk.io
2017-04-19T15:43:40.273 [ERROR] <https://builds.apache.org/job/beam_PostCommit_Java_ValidatesRunner_Flink/ws/runners/flink/src/test/java/org/apache/beam/runners/flink/WriteSinkITCase.java>:[33,30]
cannot find symbol
2017-04-19T15:43:40.273 [ERROR] symbol:   class Write
2017-04-19T15:43:40.273 [ERROR] location: package org.apache.beam.sdk.io
2017-04-19T15:43:40.273 [ERROR] <https://builds.apache.org/job/beam_PostCommit_Java_ValidatesRunner_Flink/ws/runners/flink/src/test/java/org/apache/beam/runners/flink/WriteSinkITCase.java>:[93,45]
cannot find symbol
2017-04-19T15:43:40.273 [ERROR] symbol:   class Sink
2017-04-19T15:43:40.273 [ERROR] location: class org.apache.beam.runners.flink.WriteSinkITCase
2017-04-19T15:43:40.273 [ERROR] <https://builds.apache.org/job/beam_PostCommit_Java_ValidatesRunner_Flink/ws/runners/flink/src/test/java/org/apache/beam/runners/flink/WriteSinkITCase.java>:[107,12]
cannot find symbol
2017-04-19T15:43:40.273 [ERROR] symbol:   class WriteOperation
2017-04-19T15:43:40.273 [ERROR] location: class org.apache.beam.runners.flink.WriteSinkITCase.MyCustomSink
2017-04-19T15:43:40.273 [ERROR] <https://builds.apache.org/job/beam_PostCommit_Java_ValidatesRunner_Flink/ws/runners/flink/src/test/java/org/apache/beam/runners/flink/WriteSinkITCase.java>:[111,44]
cannot find symbol
2017-04-19T15:43:40.273 [ERROR] symbol:   class WriteOperation
2017-04-19T15:43:40.273 [ERROR] location: class org.apache.beam.runners.flink.WriteSinkITCase.MyCustomSink
2017-04-19T15:43:40.273 [ERROR] <https://builds.apache.org/job/beam_PostCommit_Java_ValidatesRunner_Flink/ws/runners/flink/src/test/java/org/apache/beam/runners/flink/WriteSinkITCase.java>:[135,14]
cannot find symbol
2017-04-19T15:43:40.273 [ERROR] symbol:   class Writer
2017-04-19T15:43:40.273 [ERROR] location: class org.apache.beam.runners.flink.WriteSinkITCase.MyCustomSink.MyWriteOperation
2017-04-19T15:43:40.273 [ERROR] <https://builds.apache.org/job/beam_PostCommit_Java_ValidatesRunner_Flink/ws/runners/flink/src/test/java/org/apache/beam/runners/flink/WriteSinkITCase.java>:[140,14]
cannot find symbol
2017-04-19T15:43:40.273 [ERROR] symbol:   class Sink
2017-04-19T15:43:40.273 [ERROR] location: class org.apache.beam.runners.flink.WriteSinkITCase.MyCustomSink.MyWriteOperation
2017-04-19T15:43:40.273 [ERROR] <https://builds.apache.org/job/beam_PostCommit_Java_ValidatesRunner_Flink/ws/runners/flink/src/test/java/org/apache/beam/runners/flink/WriteSinkITCase.java>:[147,38]
cannot find symbol
2017-04-19T15:43:40.273 [ERROR] symbol:   class Writer
2017-04-19T15:43:40.274 [ERROR] location: class org.apache.beam.runners.flink.WriteSinkITCase.MyCustomSink.MyWriteOperation
2017-04-19T15:43:40.274 [ERROR] <https://builds.apache.org/job/beam_PostCommit_Java_ValidatesRunner_Flink/ws/runners/flink/src/test/java/org/apache/beam/runners/flink/WriteSinkITCase.java>:[184,16]
cannot find symbol
2017-04-19T15:43:40.274 [ERROR] symbol:   class WriteOperation
2017-04-19T15:43:40.274 [ERROR] location: class org.apache.beam.runners.flink.WriteSinkITCase.MyCustomSink.MyWriteOperation.MyWriter
2017-04-19T15:43:40.274 [ERROR] -> [Help 1]
org.apache.maven.lifecycle.LifecycleExecutionException: Failed to execute goal org.apache.maven.plugins:maven-compiler-plugin:3.6.1:testCompile
(default-testCompile) on project beam-runners-flink: Compilation failure
	at org.apache.maven.lifecycle.internal.MojoExecutor.execute(MojoExecutor.java:212)
	at org.apache.maven.lifecycle.internal.MojoExecutor.execute(MojoExecutor.java:153)
	at org.apache.maven.lifecycle.internal.MojoExecutor.execute(MojoExecutor.java:145)
	at org.apache.maven.lifecycle.internal.LifecycleModuleBuilder.buildProject(LifecycleModuleBuilder.java:116)
	at org.apache.maven.lifecycle.internal.LifecycleModuleBuilder.buildProject(LifecycleModuleBuilder.java:80)
	at org.apache.maven.lifecycle.internal.builder.singlethreaded.SingleThreadedBuilder.build(SingleThreadedBuilder.java:51)
	at org.apache.maven.lifecycle.internal.LifecycleStarter.execute(LifecycleStarter.java:128)
	at org.apache.maven.DefaultMaven.doExecute(DefaultMaven.java:307)
	at org.apache.maven.DefaultMaven.doExecute(DefaultMaven.java:193)
	at org.apache.maven.DefaultMaven.execute(DefaultMaven.java:106)
	at org.jvnet.hudson.maven3.launcher.Maven33Launcher.main(Maven33Launcher.java:129)
	at sun.reflect.NativeMethodAccessorImpl.invoke0(Native Method)
	at sun.reflect.NativeMethodAccessorImpl.invoke(NativeMethodAccessorImpl.java:62)
	at sun.reflect.DelegatingMethodAccessorImpl.invoke(DelegatingMethodAccessorImpl.java:43)
	at java.lang.reflect.Method.invoke(Method.java:498)
	at org.codehaus.plexus.classworlds.launcher.Launcher.launchStandard(Launcher.java:330)
	at org.codehaus.plexus.classworlds.launcher.Launcher.launch(Launcher.java:238)
	at jenkins.maven3.agent.Maven33Main.launch(Maven33Main.java:176)
	at sun.reflect.NativeMethodAccessorImpl.invoke0(Native Method)
	at sun.reflect.NativeMethodAccessorImpl.invoke(NativeMethodAccessorImpl.java:62)
	at sun.reflect.DelegatingMethodAccessorImpl.invoke(DelegatingMethodAccessorImpl.java:43)
	at java.lang.reflect.Method.invoke(Method.java:498)
	at hudson.maven.Maven3Builder.call(Maven3Builder.java:139)
	at hudson.maven.Maven3Builder.call(Maven3Builder.java:70)
	at hudson.remoting.UserRequest.perform(UserRequest.java:153)
	at hudson.remoting.UserRequest.perform(UserRequest.java:50)
	at hudson.remoting.Request$2.run(Request.java:336)
	at hudson.remoting.InterceptingExecutorService$1.call(InterceptingExecutorService.java:68)
	at java.util.concurrent.FutureTask.run(FutureTask.java:266)
	at java.util.concurrent.ThreadPoolExecutor.runWorker(ThreadPoolExecutor.java:1142)
	at java.util.concurrent.ThreadPoolExecutor$Worker.run(ThreadPoolExecutor.java:617)
	at java.lang.Thread.run(Thread.java:745)
Caused by: org.apache.maven.plugin.compiler.CompilationFailureException: Compilation failure
	at org.apache.maven.plugin.compiler.AbstractCompilerMojo.execute(AbstractCompilerMojo.java:1029)
	at org.apache.maven.plugin.compiler.TestCompilerMojo.execute(TestCompilerMojo.java:170)
	at org.apache.maven.plugin.DefaultBuildPluginManager.executeMojo(DefaultBuildPluginManager.java:134)
	at org.apache.maven.lifecycle.internal.MojoExecutor.execute(MojoExecutor.java:208)
	... 31 more
2017-04-19T15:43:40.274 [ERROR] 
2017-04-19T15:43:40.274 [ERROR] Re-run Maven using the -X switch to enable full debug logging.
2017-04-19T15:43:40.274 [ERROR] 
2017-04-19T15:43:40.274 [ERROR] For more information about the errors and possible solutions,
please read the following articles:
2017-04-19T15:43:40.274 [ERROR] [Help 1] http://cwiki.apache.org/confluence/display/MAVEN/MojoFailureException
2017-04-19T15:43:40.275 [ERROR] 
2017-04-19T15:43:40.275 [ERROR] After correcting the problems, you can resume the build with
the command
2017-04-19T15:43:40.275 [ERROR]   mvn <goals> -rf :beam-runners-flink
channel stopped

Mime
View raw message