beam-commits mailing list archives

Site index · List index
Message view « Date » · « Thread »
Top « Date » · « Thread »
From Apache Jenkins Server <jenk...@builds.apache.org>
Subject Build failed in Jenkins: beam_PostCommit_Java_MavenInstall #3462
Date Wed, 26 Apr 2017 15:55:55 GMT
See <https://builds.apache.org/job/beam_PostCommit_Java_MavenInstall/3462/display/redirect?page=changes>

Changes:

[lcwik] [BEAM-1871] Move ByteStringCoder to sdks/java/extensions/protobuf

[dhalperi] Update maven surefire and failsafe plugins to version 2.20

------------------------------------------
[...truncated 1.63 MB...]
2017-04-26T15:55:11.936 [INFO] Exclude: **/*.iml
2017-04-26T15:55:11.936 [INFO] Exclude: **/.idea/**/*
2017-04-26T15:55:11.936 [INFO] Exclude: **/*.egg-info/**/*
2017-04-26T15:55:11.936 [INFO] Exclude: **/package-list
2017-04-26T15:55:11.936 [INFO] Exclude: **/user.avsc
2017-04-26T15:55:11.936 [INFO] Exclude: **/test/resources/**/*.txt
2017-04-26T15:55:11.936 [INFO] Exclude: **/test/**/.placeholder
2017-04-26T15:55:11.936 [INFO] Exclude: .repository/**/*
2017-04-26T15:55:11.936 [INFO] Exclude: **/nose-*.egg/**/*
2017-04-26T15:55:11.936 [INFO] Exclude: **/.eggs/**/*
2017-04-26T15:55:11.936 [INFO] Exclude: **/.tox/**/*
2017-04-26T15:55:11.936 [INFO] Exclude: **/.checkstyle
2017-04-26T15:55:11.936 [INFO] Exclude: **/.classpath
2017-04-26T15:55:11.936 [INFO] Exclude: **/.factorypath
2017-04-26T15:55:11.936 [INFO] Exclude: **/.project
2017-04-26T15:55:11.936 [INFO] Exclude: **/.settings/**/*
2017-04-26T15:55:11.936 [INFO] Exclude: **/sdks/python/apache_beam/runners/api/*.py
2017-04-26T15:55:11.939 [INFO] 17 resources included (use -debug for more details)
2017-04-26T15:55:11.966 [INFO] Rat check: Summary over all files. Unapproved: 0, unknown:
0, generated: 0, approved: 17 licenses.
2017-04-26T15:55:12.019 [INFO] 
2017-04-26T15:55:12.019 [INFO] --- maven-install-plugin:2.5.2:install (default-install) @
beam-sdks-java-maven-archetypes-examples ---
2017-04-26T15:55:12.020 [INFO] Installing <https://builds.apache.org/job/beam_PostCommit_Java_MavenInstall/ws/sdks/java/maven-archetypes/examples/target/beam-sdks-java-maven-archetypes-examples-0.7.0-SNAPSHOT.jar>
to <https://builds.apache.org/job/beam_PostCommit_Java_MavenInstall/ws/.repository/org/apache/beam/beam-sdks-java-maven-archetypes-examples/0.7.0-SNAPSHOT/beam-sdks-java-maven-archetypes-examples-0.7.0-SNAPSHOT.jar>
2017-04-26T15:55:12.024 [INFO] Installing <https://builds.apache.org/job/beam_PostCommit_Java_MavenInstall/ws/sdks/java/maven-archetypes/examples/dependency-reduced-pom.xml>
to <https://builds.apache.org/job/beam_PostCommit_Java_MavenInstall/ws/.repository/org/apache/beam/beam-sdks-java-maven-archetypes-examples/0.7.0-SNAPSHOT/beam-sdks-java-maven-archetypes-examples-0.7.0-SNAPSHOT.pom>
2017-04-26T15:55:12.025 [INFO] Installing <https://builds.apache.org/job/beam_PostCommit_Java_MavenInstall/ws/sdks/java/maven-archetypes/examples/target/beam-sdks-java-maven-archetypes-examples-0.7.0-SNAPSHOT-sources.jar>
to <https://builds.apache.org/job/beam_PostCommit_Java_MavenInstall/ws/.repository/org/apache/beam/beam-sdks-java-maven-archetypes-examples/0.7.0-SNAPSHOT/beam-sdks-java-maven-archetypes-examples-0.7.0-SNAPSHOT-sources.jar>
2017-04-26T15:55:12.026 [INFO] Installing <https://builds.apache.org/job/beam_PostCommit_Java_MavenInstall/ws/sdks/java/maven-archetypes/examples/target/beam-sdks-java-maven-archetypes-examples-0.7.0-SNAPSHOT-test-sources.jar>
to <https://builds.apache.org/job/beam_PostCommit_Java_MavenInstall/ws/.repository/org/apache/beam/beam-sdks-java-maven-archetypes-examples/0.7.0-SNAPSHOT/beam-sdks-java-maven-archetypes-examples-0.7.0-SNAPSHOT-test-sources.jar>
2017-04-26T15:55:12.117 [INFO] 
2017-04-26T15:55:12.117 [INFO] --- maven-archetype-plugin:2.4:integration-test (default-integration-test)
@ beam-sdks-java-maven-archetypes-examples ---
2017-04-26T15:55:12.118 [INFO] Processing Archetype IT project: basic
2017-04-26T15:55:12.120 [INFO] ----------------------------------------------------------------------------
2017-04-26T15:55:12.120 [INFO] Using following parameters for creating project from Archetype:
beam-sdks-java-maven-archetypes-examples:0.7.0-SNAPSHOT
2017-04-26T15:55:12.120 [INFO] ----------------------------------------------------------------------------
2017-04-26T15:55:12.120 [INFO] Parameter: groupId, Value: archetype.it
2017-04-26T15:55:12.120 [INFO] Parameter: artifactId, Value: basic
2017-04-26T15:55:12.120 [INFO] Parameter: version, Value: 0.1
2017-04-26T15:55:12.120 [INFO] Parameter: package, Value: it.pkg
2017-04-26T15:55:12.120 [INFO] Parameter: packageInPathFormat, Value: it/pkg
2017-04-26T15:55:12.120 [INFO] Parameter: version, Value: 0.1
2017-04-26T15:55:12.120 [INFO] Parameter: package, Value: it.pkg
2017-04-26T15:55:12.120 [INFO] Parameter: groupId, Value: archetype.it
2017-04-26T15:55:12.120 [INFO] Parameter: targetPlatform, Value: 1.7
2017-04-26T15:55:12.120 [INFO] Parameter: artifactId, Value: basic
2017-04-26T15:55:12.148 [INFO] project created from Archetype in dir: <https://builds.apache.org/job/beam_PostCommit_Java_MavenInstall/ws/sdks/java/maven-archetypes/examples/target/test-classes/projects/basic/project/basic>
2017-04-26T15:55:12.148 [INFO] Invoking post-archetype-generation goals: verify
2017-04-26T15:55:13.503 [INFO] 2017-04-26\T\15:55:13.502 [INFO] Error stacktraces are turned
on.
2017-04-26T15:55:13.550 [INFO] 2017-04-26\T\15:55:13.549 [INFO] Scanning for projects...
2017-04-26T15:55:13.612 [INFO] 2017-04-26\T\15:55:13.612 [ERROR] [ERROR] Some problems were
encountered while processing the POMs:
2017-04-26T15:55:13.612 [INFO] [ERROR] 'build.plugins.plugin.version' for org.apache.maven.plugins:maven-surefire-plugin
must be a valid version but is '${surefire-plugin.version}'. @ line 62, column 18
2017-04-26T15:55:13.612 [INFO] [ERROR] 'build.plugins.plugin[org.apache.maven.plugins:maven-surefire-plugin].dependencies.dependency.version'
for org.apache.maven.surefire:surefire-junit47:jar must be a valid version but is '${surefire-plugin.version}'.
@ line 72, column 22
2017-04-26T15:55:13.612 [INFO]  @ 
2017-04-26T15:55:13.613 [INFO] 2017-04-26\T\15:55:13.613 [ERROR] The build could not read
1 project -> [Help 1]
2017-04-26T15:55:13.614 [INFO] org.apache.maven.project.ProjectBuildingException: Some problems
were encountered while processing the POMs:
2017-04-26T15:55:13.614 [INFO] [ERROR] 'build.plugins.plugin.version' for org.apache.maven.plugins:maven-surefire-plugin
must be a valid version but is '${surefire-plugin.version}'. @ line 62, column 18
2017-04-26T15:55:13.614 [INFO] [ERROR] 'build.plugins.plugin[org.apache.maven.plugins:maven-surefire-plugin].dependencies.dependency.version'
for org.apache.maven.surefire:surefire-junit47:jar must be a valid version but is '${surefire-plugin.version}'.
@ line 72, column 22
2017-04-26T15:55:13.614 [INFO] 
2017-04-26T15:55:13.614 [INFO] 	at org.apache.maven.project.DefaultProjectBuilder.build(DefaultProjectBuilder.java:422)
2017-04-26T15:55:13.614 [INFO] 	at org.apache.maven.graph.DefaultGraphBuilder.collectProjects(DefaultGraphBuilder.java:419)
2017-04-26T15:55:13.614 [INFO] 	at org.apache.maven.graph.DefaultGraphBuilder.getProjectsForMavenReactor(DefaultGraphBuilder.java:410)
2017-04-26T15:55:13.614 [INFO] 	at org.apache.maven.graph.DefaultGraphBuilder.build(DefaultGraphBuilder.java:83)
2017-04-26T15:55:13.614 [INFO] 	at org.apache.maven.DefaultMaven.buildGraph(DefaultMaven.java:491)
2017-04-26T15:55:13.614 [INFO] 	at org.apache.maven.DefaultMaven.doExecute(DefaultMaven.java:219)
2017-04-26T15:55:13.614 [INFO] 	at org.apache.maven.DefaultMaven.doExecute(DefaultMaven.java:193)
2017-04-26T15:55:13.614 [INFO] 	at org.apache.maven.DefaultMaven.execute(DefaultMaven.java:106)
2017-04-26T15:55:13.614 [INFO] 	at org.apache.maven.cli.MavenCli.execute(MavenCli.java:862)
2017-04-26T15:55:13.614 [INFO] 	at org.apache.maven.cli.MavenCli.doMain(MavenCli.java:286)
2017-04-26T15:55:13.614 [INFO] 	at org.apache.maven.cli.MavenCli.main(MavenCli.java:197)
2017-04-26T15:55:13.614 [INFO] 	at sun.reflect.NativeMethodAccessorImpl.invoke0(Native Method)
2017-04-26T15:55:13.614 [INFO] 	at sun.reflect.NativeMethodAccessorImpl.invoke(NativeMethodAccessorImpl.java:62)
2017-04-26T15:55:13.614 [INFO] 	at sun.reflect.DelegatingMethodAccessorImpl.invoke(DelegatingMethodAccessorImpl.java:43)
2017-04-26T15:55:13.614 [INFO] 	at java.lang.reflect.Method.invoke(Method.java:498)
2017-04-26T15:55:13.614 [INFO] 	at org.codehaus.plexus.classworlds.launcher.Launcher.launchEnhanced(Launcher.java:289)
2017-04-26T15:55:13.614 [INFO] 	at org.codehaus.plexus.classworlds.launcher.Launcher.launch(Launcher.java:229)
2017-04-26T15:55:13.614 [INFO] 	at org.codehaus.plexus.classworlds.launcher.Launcher.mainWithExitCode(Launcher.java:415)
2017-04-26T15:55:13.614 [INFO] 	at org.codehaus.plexus.classworlds.launcher.Launcher.main(Launcher.java:356)
2017-04-26T15:55:13.615 [INFO] 2017-04-26\T\15:55:13.615 [ERROR]   
2017-04-26T15:55:13.615 [INFO] 2017-04-26\T\15:55:13.615 [ERROR]   The project archetype.it:basic:0.1
(<https://builds.apache.org/job/beam_PostCommit_Java_MavenInstall/ws/sdks/java/maven-archetypes/examples/target/test-classes/projects/basic/project/basic/pom.xml)>
has 2 errors
2017-04-26T15:55:13.615 [INFO] 2017-04-26\T\15:55:13.615 [ERROR]     'build.plugins.plugin.version'
for org.apache.maven.plugins:maven-surefire-plugin must be a valid version but is '${surefire-plugin.version}'.
@ line 62, column 18
2017-04-26T15:55:13.615 [INFO] 2017-04-26\T\15:55:13.615 [ERROR]     'build.plugins.plugin[org.apache.maven.plugins:maven-surefire-plugin].dependencies.dependency.version'
for org.apache.maven.surefire:surefire-junit47:jar must be a valid version but is '${surefire-plugin.version}'.
@ line 72, column 22
2017-04-26T15:55:13.615 [INFO] 2017-04-26\T\15:55:13.615 [ERROR] 
2017-04-26T15:55:13.616 [INFO] 2017-04-26\T\15:55:13.615 [ERROR] Re-run Maven using the -X
switch to enable full debug logging.
2017-04-26T15:55:13.616 [INFO] 2017-04-26\T\15:55:13.616 [ERROR] 
2017-04-26T15:55:13.616 [INFO] 2017-04-26\T\15:55:13.616 [ERROR] For more information about
the errors and possible solutions, please read the following articles:
2017-04-26T15:55:13.616 [INFO] 2017-04-26\T\15:55:13.616 [ERROR] [Help 1] http://cwiki.apache.org/confluence/display/MAVEN/ProjectBuildingException
2017-04-26T15:55:13.626 [INFO] Post-archetype-generation invoker exit code: 1
[JENKINS] Recording test results
[JENKINS] Archiving disabled
2017-04-26T15:55:14.407 [INFO]                                                           
             
2017-04-26T15:55:14.407 [INFO] ------------------------------------------------------------------------
2017-04-26T15:55:14.407 [INFO] Skipping Apache Beam :: Parent
2017-04-26T15:55:14.407 [INFO] This project has been banned from the build due to previous
failures.
2017-04-26T15:55:14.407 [INFO] ------------------------------------------------------------------------
[JENKINS] Archiving disabled
[JENKINS] Archiving disabled
[JENKINS] Archiving disabled
[JENKINS] Archiving disabled
[JENKINS] Archiving disabled
[JENKINS] Archiving disabled
[JENKINS] Archiving disabled
[JENKINS] Archiving disabled
[JENKINS] Archiving disabled
[JENKINS] Archiving disabled
[JENKINS] Archiving disabled
[JENKINS] Archiving disabled
[JENKINS] Archiving disabled
[JENKINS] Archiving disabled
[JENKINS] Archiving disabled
[JENKINS] Archiving disabled
[JENKINS] Archiving disabled
[JENKINS] Archiving disabled
[JENKINS] Archiving disabled
[JENKINS] Archiving disabled
[JENKINS] Archiving disabled
[JENKINS] Archiving disabled
[JENKINS] Archiving disabled
[JENKINS] Archiving disabled
[JENKINS] Archiving disabled
[JENKINS] Archiving disabled
[JENKINS] Archiving disabled
[JENKINS] Archiving disabled
[JENKINS] Archiving disabled
[JENKINS] Archiving disabled
[JENKINS] Archiving disabled
[JENKINS] Archiving disabled
[JENKINS] Archiving disabled
[JENKINS] Archiving disabled
[JENKINS] Archiving disabled
[JENKINS] Archiving disabled
[JENKINS] Archiving disabled
[JENKINS] Archiving disabled
[JENKINS] Archiving disabled
[JENKINS] Archiving disabled
[JENKINS] Archiving disabled
[JENKINS] Archiving disabled
[JENKINS] Archiving disabled
[JENKINS] Archiving disabled
[JENKINS] Archiving disabled
[JENKINS] Archiving disabled
2017-04-26T15:55:32.707 [INFO] ------------------------------------------------------------------------
2017-04-26T15:55:32.707 [INFO] Reactor Summary:
2017-04-26T15:55:32.707 [INFO] 
2017-04-26T15:55:32.707 [INFO] Apache Beam :: Parent .............................. SUCCESS
[ 27.408 s]
2017-04-26T15:55:32.707 [INFO] Apache Beam :: SDKs :: Java :: Build Tools ......... SUCCESS
[ 15.572 s]
2017-04-26T15:55:32.707 [INFO] Apache Beam :: SDKs ................................ SUCCESS
[  4.798 s]
2017-04-26T15:55:32.707 [INFO] Apache Beam :: SDKs :: Common ...................... SUCCESS
[  1.455 s]
2017-04-26T15:55:32.707 [INFO] Apache Beam :: SDKs :: Common :: Fn API ............ SUCCESS
[ 17.839 s]
2017-04-26T15:55:32.707 [INFO] Apache Beam :: SDKs :: Common :: Runner API ........ SUCCESS
[ 13.111 s]
2017-04-26T15:55:32.707 [INFO] Apache Beam :: SDKs :: Java ........................ SUCCESS
[  2.767 s]
2017-04-26T15:55:32.707 [INFO] Apache Beam :: SDKs :: Java :: Core ................ SUCCESS
[02:46 min]
2017-04-26T15:55:32.707 [INFO] Apache Beam :: SDKs :: Java :: IO .................. SUCCESS
[  3.302 s]
2017-04-26T15:55:32.707 [INFO] Apache Beam :: SDKs :: Java :: IO :: Common ........ SUCCESS
[  6.722 s]
2017-04-26T15:55:32.707 [INFO] Apache Beam :: Runners ............................. SUCCESS
[  7.696 s]
2017-04-26T15:55:32.707 [INFO] Apache Beam :: Runners :: Core Construction Java ... SUCCESS
[ 26.554 s]
2017-04-26T15:55:32.707 [INFO] Apache Beam :: Runners :: Core Java ................ SUCCESS
[01:09 min]
2017-04-26T15:55:32.707 [INFO] Apache Beam :: Runners :: Direct Java .............. SUCCESS
[03:59 min]
2017-04-26T15:55:32.707 [INFO] Apache Beam :: SDKs :: Java :: IO :: Elasticsearch . SUCCESS
[ 54.296 s]
2017-04-26T15:55:32.707 [INFO] Apache Beam :: SDKs :: Java :: Extensions .......... SUCCESS
[  3.979 s]
2017-04-26T15:55:32.707 [INFO] Apache Beam :: SDKs :: Java :: Extensions :: Google Cloud Platform
Core SUCCESS [ 43.845 s]
2017-04-26T15:55:32.707 [INFO] Apache Beam :: SDKs :: Java :: Extensions :: Protobuf SUCCESS
[ 23.463 s]
2017-04-26T15:55:32.707 [INFO] Apache Beam :: SDKs :: Java :: IO :: Google Cloud Platform
SUCCESS [01:28 min]
2017-04-26T15:55:32.707 [INFO] Apache Beam :: SDKs :: Java :: IO :: Hadoop Common . SUCCESS
[ 19.869 s]
2017-04-26T15:55:32.707 [INFO] Apache Beam :: SDKs :: Java :: IO :: Hadoop ........ SUCCESS
[  3.915 s]
2017-04-26T15:55:32.707 [INFO] Apache Beam :: SDKs :: Java :: IO :: Hadoop :: input-format
SUCCESS [ 19.893 s]
2017-04-26T15:55:32.707 [INFO] Apache Beam :: Runners :: Google Cloud Dataflow .... SUCCESS
[ 33.053 s]
2017-04-26T15:55:32.708 [INFO] Apache Beam :: SDKs :: Java :: IO :: Hadoop :: jdk1.8-tests
SUCCESS [01:20 min]
2017-04-26T15:55:32.708 [INFO] Apache Beam :: SDKs :: Java :: IO :: HBase ......... SUCCESS
[01:07 min]
2017-04-26T15:55:32.708 [INFO] Apache Beam :: SDKs :: Java :: IO :: HDFS .......... SUCCESS
[ 21.909 s]
2017-04-26T15:55:32.708 [INFO] Apache Beam :: SDKs :: Java :: IO :: JDBC .......... SUCCESS
[ 24.846 s]
2017-04-26T15:55:32.708 [INFO] Apache Beam :: SDKs :: Java :: IO :: JMS ........... SUCCESS
[ 18.065 s]
2017-04-26T15:55:32.708 [INFO] Apache Beam :: SDKs :: Java :: IO :: Kafka ......... SUCCESS
[ 22.011 s]
2017-04-26T15:55:32.708 [INFO] Apache Beam :: SDKs :: Java :: IO :: Kinesis ....... SUCCESS
[ 21.527 s]
2017-04-26T15:55:32.708 [INFO] Apache Beam :: SDKs :: Java :: IO :: MongoDB ....... SUCCESS
[ 31.434 s]
2017-04-26T15:55:32.708 [INFO] Apache Beam :: SDKs :: Java :: IO :: MQTT .......... SUCCESS
[ 21.593 s]
2017-04-26T15:55:32.708 [INFO] Apache Beam :: SDKs :: Java :: IO :: XML ........... SUCCESS
[ 26.997 s]
2017-04-26T15:55:32.708 [INFO] Apache Beam :: SDKs :: Java :: Maven Archetypes .... SUCCESS
[  1.579 s]
2017-04-26T15:55:32.708 [INFO] Apache Beam :: SDKs :: Java :: Maven Archetypes :: Starter
SUCCESS [ 15.523 s]
2017-04-26T15:55:32.708 [INFO] Apache Beam :: SDKs :: Java :: Maven Archetypes :: Examples
FAILURE [  8.918 s]
2017-04-26T15:55:32.708 [INFO] Apache Beam :: SDKs :: Java :: Maven Archetypes :: Examples
- Java 8 SKIPPED
2017-04-26T15:55:32.708 [INFO] Apache Beam :: SDKs :: Java :: Extensions :: Jackson SKIPPED
2017-04-26T15:55:32.708 [INFO] Apache Beam :: SDKs :: Java :: Extensions :: Join library SKIPPED
2017-04-26T15:55:32.708 [INFO] Apache Beam :: SDKs :: Java :: Extensions :: Sorter  SKIPPED
2017-04-26T15:55:32.708 [INFO] Apache Beam :: SDKs :: Java :: Harness ............. SKIPPED
2017-04-26T15:55:32.708 [INFO] Apache Beam :: SDKs :: Java :: Java 8 Tests ........ SKIPPED
2017-04-26T15:55:32.708 [INFO] Apache Beam :: SDKs :: Python ...................... SKIPPED
2017-04-26T15:55:32.708 [INFO] Apache Beam :: Runners :: Flink .................... SKIPPED
2017-04-26T15:55:32.708 [INFO] Apache Beam :: Runners :: Spark .................... SKIPPED
2017-04-26T15:55:32.708 [INFO] Apache Beam :: Runners :: Apex ..................... SKIPPED
2017-04-26T15:55:32.708 [INFO] Apache Beam :: Examples ............................ SKIPPED
2017-04-26T15:55:32.708 [INFO] Apache Beam :: Examples :: Java .................... SKIPPED
2017-04-26T15:55:32.708 [INFO] Apache Beam :: Examples :: Java 8 .................. SKIPPED
2017-04-26T15:55:32.708 [INFO] Apache Beam :: SDKs :: Java :: Aggregated Javadoc .. SKIPPED
2017-04-26T15:55:32.708 [INFO] ------------------------------------------------------------------------
2017-04-26T15:55:32.708 [INFO] BUILD FAILURE
2017-04-26T15:55:32.708 [INFO] ------------------------------------------------------------------------
2017-04-26T15:55:32.709 [INFO] Total time: 22:32 min
2017-04-26T15:55:32.710 [INFO] Finished at: 2017-04-26T15:55:32+00:00
2017-04-26T15:55:34.761 [INFO] Final Memory: 260M/1563M
2017-04-26T15:55:34.761 [INFO] ------------------------------------------------------------------------
Waiting for Jenkins to finish collecting data
2017-04-26T15:55:42.031 [ERROR] Failed to execute goal org.apache.maven.plugins:maven-archetype-plugin:2.4:integration-test
(default-integration-test) on project beam-sdks-java-maven-archetypes-examples:
2017-04-26T15:55:42.032 [ERROR] Archetype IT 'basic' failed: Execution failure: exit code
= 1
2017-04-26T15:55:42.032 [ERROR] -> [Help 1]
org.apache.maven.lifecycle.LifecycleExecutionException: Failed to execute goal org.apache.maven.plugins:maven-archetype-plugin:2.4:integration-test
(default-integration-test) on project beam-sdks-java-maven-archetypes-examples: 
Archetype IT 'basic' failed: Execution failure: exit code = 1
	at org.apache.maven.lifecycle.internal.MojoExecutor.execute(MojoExecutor.java:216)
	at org.apache.maven.lifecycle.internal.MojoExecutor.execute(MojoExecutor.java:153)
	at org.apache.maven.lifecycle.internal.MojoExecutor.execute(MojoExecutor.java:145)
	at org.apache.maven.lifecycle.internal.LifecycleModuleBuilder.buildProject(LifecycleModuleBuilder.java:116)
	at org.apache.maven.lifecycle.internal.LifecycleModuleBuilder.buildProject(LifecycleModuleBuilder.java:80)
	at org.apache.maven.lifecycle.internal.builder.singlethreaded.SingleThreadedBuilder.build(SingleThreadedBuilder.java:51)
	at org.apache.maven.lifecycle.internal.LifecycleStarter.execute(LifecycleStarter.java:128)
	at org.apache.maven.DefaultMaven.doExecute(DefaultMaven.java:307)
	at org.apache.maven.DefaultMaven.doExecute(DefaultMaven.java:193)
	at org.apache.maven.DefaultMaven.execute(DefaultMaven.java:106)
	at org.jvnet.hudson.maven3.launcher.Maven33Launcher.main(Maven33Launcher.java:129)
	at sun.reflect.NativeMethodAccessorImpl.invoke0(Native Method)
	at sun.reflect.NativeMethodAccessorImpl.invoke(NativeMethodAccessorImpl.java:62)
	at sun.reflect.DelegatingMethodAccessorImpl.invoke(DelegatingMethodAccessorImpl.java:43)
	at java.lang.reflect.Method.invoke(Method.java:498)
	at org.codehaus.plexus.classworlds.launcher.Launcher.launchStandard(Launcher.java:330)
	at org.codehaus.plexus.classworlds.launcher.Launcher.launch(Launcher.java:238)
	at jenkins.maven3.agent.Maven33Main.launch(Maven33Main.java:176)
	at sun.reflect.NativeMethodAccessorImpl.invoke0(Native Method)
	at sun.reflect.NativeMethodAccessorImpl.invoke(NativeMethodAccessorImpl.java:62)
	at sun.reflect.DelegatingMethodAccessorImpl.invoke(DelegatingMethodAccessorImpl.java:43)
	at java.lang.reflect.Method.invoke(Method.java:498)
	at hudson.maven.Maven3Builder.call(Maven3Builder.java:139)
	at hudson.maven.Maven3Builder.call(Maven3Builder.java:70)
	at hudson.remoting.UserRequest.perform(UserRequest.java:153)
	at hudson.remoting.UserRequest.perform(UserRequest.java:50)
	at hudson.remoting.Request$2.run(Request.java:336)
	at hudson.remoting.InterceptingExecutorService$1.call(InterceptingExecutorService.java:68)
	at java.util.concurrent.FutureTask.run(FutureTask.java:266)
	at java.util.concurrent.ThreadPoolExecutor.runWorker(ThreadPoolExecutor.java:1142)
	at java.util.concurrent.ThreadPoolExecutor$Worker.run(ThreadPoolExecutor.java:617)
	at java.lang.Thread.run(Thread.java:745)
Caused by: org.apache.maven.plugin.MojoExecutionException: 
Archetype IT 'basic' failed: Execution failure: exit code = 1
	at org.apache.maven.archetype.mojos.IntegrationTestMojo.execute(IntegrationTestMojo.java:269)
	at org.apache.maven.plugin.DefaultBuildPluginManager.executeMojo(DefaultBuildPluginManager.java:134)
	at org.apache.maven.lifecycle.internal.MojoExecutor.execute(MojoExecutor.java:208)
	... 31 more
2017-04-26T15:55:42.037 [ERROR] 
2017-04-26T15:55:42.038 [ERROR] Re-run Maven using the -X switch to enable full debug logging.
2017-04-26T15:55:42.038 [ERROR] 
2017-04-26T15:55:42.038 [ERROR] For more information about the errors and possible solutions,
please read the following articles:
2017-04-26T15:55:42.038 [ERROR] [Help 1] http://cwiki.apache.org/confluence/display/MAVEN/MojoExecutionException
2017-04-26T15:55:42.039 [ERROR] 
2017-04-26T15:55:42.039 [ERROR] After correcting the problems, you can resume the build with
the command
2017-04-26T15:55:42.039 [ERROR]   mvn <goals> -rf :beam-sdks-java-maven-archetypes-examples
channel stopped

Mime
View raw message