beam-commits mailing list archives

Site index · List index
Message view « Date » · « Thread »
Top « Date » · « Thread »
From Apache Jenkins Server <jenk...@builds.apache.org>
Subject Build failed in Jenkins: beam_PostCommit_Python_Verify #1861
Date Fri, 14 Apr 2017 20:37:44 GMT
See <https://builds.apache.org/job/beam_PostCommit_Python_Verify/1861/display/redirect?page=changes>

Changes:

[dhalperi] Avoi repackaging bigtable classes in dataflow runner.

------------------------------------------
[...truncated 716.47 KB...]
  File "/usr/lib/python2.7/pickle.py", line 286, in save
    f(self, obj) # Call unbound method with explicit self
  File "<https://builds.apache.org/job/beam_PostCommit_Python_Verify/ws/sdks/python/apache_beam/internal/pickler.py",>
line 160, in new_save_module_dict
    return old_save_module_dict(pickler, obj)
  File "<https://builds.apache.org/job/beam_PostCommit_Python_Verify/ws/sdks/python/local/lib/python2.7/site-packages/dill/dill.py",>
line 841, in save_module_dict
    StockPickler.save_dict(pickler, obj)
  File "/usr/lib/python2.7/pickle.py", line 649, in save_dict
    self._batch_setitems(obj.iteritems())
  File "/usr/lib/python2.7/pickle.py", line 681, in _batch_setitems
    save(v)
  File "/usr/lib/python2.7/pickle.py", line 331, in save
    self.save_reduce(obj=obj, *rv)
  File "/usr/lib/python2.7/pickle.py", line 419, in save_reduce
    save(state)
  File "/usr/lib/python2.7/pickle.py", line 286, in save
    f(self, obj) # Call unbound method with explicit self
  File "/usr/lib/python2.7/pickle.py", line 548, in save_tuple
    save(element)
  File "/usr/lib/python2.7/pickle.py", line 286, in save
    f(self, obj) # Call unbound method with explicit self
  File "<https://builds.apache.org/job/beam_PostCommit_Python_Verify/ws/sdks/python/apache_beam/internal/pickler.py",>
line 160, in new_save_module_dict
    return old_save_module_dict(pickler, obj)
  File "<https://builds.apache.org/job/beam_PostCommit_Python_Verify/ws/sdks/python/local/lib/python2.7/site-packages/dill/dill.py",>
line 841, in save_module_dict
    StockPickler.save_dict(pickler, obj)
  File "/usr/lib/python2.7/pickle.py", line 649, in save_dict
    self._batch_setitems(obj.iteritems())
  File "/usr/lib/python2.7/pickle.py", line 681, in _batch_setitems
    save(v)
  File "/usr/lib/python2.7/pickle.py", line 286, in save
    f(self, obj) # Call unbound method with explicit self
  File "/usr/lib/python2.7/pickle.py", line 548, in save_tuple
    save(element)
  File "/usr/lib/python2.7/pickle.py", line 286, in save
    f(self, obj) # Call unbound method with explicit self
  File "/usr/lib/python2.7/pickle.py", line 555, in save_tuple
    self.memoize(obj)
  File "/usr/lib/python2.7/pickle.py", line 245, in memoize
    memo_len = len(self.memo)
  File "<https://builds.apache.org/job/beam_PostCommit_Python_Verify/ws/sdks/python/nose-1.3.7-py2.7.egg/nose/plugins/multiprocess.py",>
line 276, in signalhandler
    raise TimedOutException()
TimedOutException: 'test_flattened_side_input (apache_beam.transforms.sideinputs_test.SideInputsTest)'

======================================================================
ERROR: test_iterable_side_input (apache_beam.transforms.sideinputs_test.SideInputsTest)
----------------------------------------------------------------------
Traceback (most recent call last):
  File "<https://builds.apache.org/job/beam_PostCommit_Python_Verify/ws/sdks/python/nose-1.3.7-py2.7.egg/nose/plugins/multiprocess.py",>
line 812, in run
    test(orig)
  File "<https://builds.apache.org/job/beam_PostCommit_Python_Verify/ws/sdks/python/nose-1.3.7-py2.7.egg/nose/case.py",>
line 45, in __call__
    return self.run(*arg, **kwarg)
  File "<https://builds.apache.org/job/beam_PostCommit_Python_Verify/ws/sdks/python/nose-1.3.7-py2.7.egg/nose/case.py",>
line 133, in run
    self.runTest(result)
  File "<https://builds.apache.org/job/beam_PostCommit_Python_Verify/ws/sdks/python/nose-1.3.7-py2.7.egg/nose/case.py",>
line 151, in runTest
    test(result)
  File "/usr/lib/python2.7/unittest/case.py", line 395, in __call__
    return self.run(*args, **kwds)
  File "/usr/lib/python2.7/unittest/case.py", line 331, in run
    testMethod()
  File "<https://builds.apache.org/job/beam_PostCommit_Python_Verify/ws/sdks/python/apache_beam/transforms/sideinputs_test.py",>
line 177, in test_iterable_side_input
    pipeline.run()
  File "<https://builds.apache.org/job/beam_PostCommit_Python_Verify/ws/sdks/python/apache_beam/test_pipeline.py",>
line 91, in run
    result = super(TestPipeline, self).run()
  File "<https://builds.apache.org/job/beam_PostCommit_Python_Verify/ws/sdks/python/apache_beam/pipeline.py",>
line 158, in run
    if test_runner_api and self._verify_runner_api_compatible():
  File "<https://builds.apache.org/job/beam_PostCommit_Python_Verify/ws/sdks/python/apache_beam/pipeline.py",>
line 328, in _verify_runner_api_compatible
    self.visit(Visitor())
  File "<https://builds.apache.org/job/beam_PostCommit_Python_Verify/ws/sdks/python/apache_beam/pipeline.py",>
line 192, in visit
    self._root_transform().visit(visitor, self, visited)
  File "<https://builds.apache.org/job/beam_PostCommit_Python_Verify/ws/sdks/python/apache_beam/pipeline.py",>
line 484, in visit
    part.visit(visitor, pipeline, visited)
  File "<https://builds.apache.org/job/beam_PostCommit_Python_Verify/ws/sdks/python/apache_beam/pipeline.py",>
line 484, in visit
    part.visit(visitor, pipeline, visited)
  File "<https://builds.apache.org/job/beam_PostCommit_Python_Verify/ws/sdks/python/apache_beam/pipeline.py",>
line 484, in visit
    part.visit(visitor, pipeline, visited)
  File "<https://builds.apache.org/job/beam_PostCommit_Python_Verify/ws/sdks/python/apache_beam/pipeline.py",>
line 487, in visit
    visitor.visit_transform(self)
  File "<https://builds.apache.org/job/beam_PostCommit_Python_Verify/ws/sdks/python/apache_beam/pipeline.py",>
line 319, in visit_transform
    enable_trace=False),
  File "<https://builds.apache.org/job/beam_PostCommit_Python_Verify/ws/sdks/python/apache_beam/internal/pickler.py",>
line 186, in dumps
    s = dill.dumps(o)
  File "<https://builds.apache.org/job/beam_PostCommit_Python_Verify/ws/sdks/python/local/lib/python2.7/site-packages/dill/dill.py",>
line 259, in dumps
    dump(obj, file, protocol, byref, fmode, recurse)#, strictio)
  File "<https://builds.apache.org/job/beam_PostCommit_Python_Verify/ws/sdks/python/local/lib/python2.7/site-packages/dill/dill.py",>
line 252, in dump
    pik.dump(obj)
  File "/usr/lib/python2.7/pickle.py", line 224, in dump
    self.save(obj)
  File "/usr/lib/python2.7/pickle.py", line 331, in save
    self.save_reduce(obj=obj, *rv)
  File "/usr/lib/python2.7/pickle.py", line 419, in save_reduce
    save(state)
  File "/usr/lib/python2.7/pickle.py", line 286, in save
    f(self, obj) # Call unbound method with explicit self
  File "<https://builds.apache.org/job/beam_PostCommit_Python_Verify/ws/sdks/python/apache_beam/internal/pickler.py",>
line 160, in new_save_module_dict
    return old_save_module_dict(pickler, obj)
  File "<https://builds.apache.org/job/beam_PostCommit_Python_Verify/ws/sdks/python/local/lib/python2.7/site-packages/dill/dill.py",>
line 841, in save_module_dict
    StockPickler.save_dict(pickler, obj)
  File "/usr/lib/python2.7/pickle.py", line 649, in save_dict
    self._batch_setitems(obj.iteritems())
  File "/usr/lib/python2.7/pickle.py", line 681, in _batch_setitems
    save(v)
  File "/usr/lib/python2.7/pickle.py", line 331, in save
    self.save_reduce(obj=obj, *rv)
  File "/usr/lib/python2.7/pickle.py", line 419, in save_reduce
    save(state)
  File "/usr/lib/python2.7/pickle.py", line 286, in save
    f(self, obj) # Call unbound method with explicit self
  File "<https://builds.apache.org/job/beam_PostCommit_Python_Verify/ws/sdks/python/apache_beam/internal/pickler.py",>
line 160, in new_save_module_dict
    return old_save_module_dict(pickler, obj)
  File "<https://builds.apache.org/job/beam_PostCommit_Python_Verify/ws/sdks/python/local/lib/python2.7/site-packages/dill/dill.py",>
line 841, in save_module_dict
    StockPickler.save_dict(pickler, obj)
  File "/usr/lib/python2.7/pickle.py", line 649, in save_dict
    self._batch_setitems(obj.iteritems())
  File "/usr/lib/python2.7/pickle.py", line 681, in _batch_setitems
    save(v)
  File "/usr/lib/python2.7/pickle.py", line 286, in save
    f(self, obj) # Call unbound method with explicit self
  File "/usr/lib/python2.7/pickle.py", line 600, in save_list
    self._batch_appends(iter(obj))
  File "/usr/lib/python2.7/pickle.py", line 636, in _batch_appends
    save(tmp[0])
  File "/usr/lib/python2.7/pickle.py", line 331, in save
    self.save_reduce(obj=obj, *rv)
  File "/usr/lib/python2.7/pickle.py", line 419, in save_reduce
    save(state)
  File "/usr/lib/python2.7/pickle.py", line 286, in save
    f(self, obj) # Call unbound method with explicit self
  File "<https://builds.apache.org/job/beam_PostCommit_Python_Verify/ws/sdks/python/apache_beam/internal/pickler.py",>
line 160, in new_save_module_dict
    return old_save_module_dict(pickler, obj)
  File "<https://builds.apache.org/job/beam_PostCommit_Python_Verify/ws/sdks/python/local/lib/python2.7/site-packages/dill/dill.py",>
line 841, in save_module_dict
    StockPickler.save_dict(pickler, obj)
  File "/usr/lib/python2.7/pickle.py", line 649, in save_dict
    self._batch_setitems(obj.iteritems())
  File "/usr/lib/python2.7/pickle.py", line 681, in _batch_setitems
    save(v)
  File "/usr/lib/python2.7/pickle.py", line 286, in save
    f(self, obj) # Call unbound method with explicit self
  File "/usr/lib/python2.7/pickle.py", line 600, in save_list
    self._batch_appends(iter(obj))
  File "/usr/lib/python2.7/pickle.py", line 633, in _batch_appends
    save(x)
  File "/usr/lib/python2.7/pickle.py", line 331, in save
    self.save_reduce(obj=obj, *rv)
  File "/usr/lib/python2.7/pickle.py", line 419, in save_reduce
    save(state)
  File "/usr/lib/python2.7/pickle.py", line 286, in save
    f(self, obj) # Call unbound method with explicit self
  File "<https://builds.apache.org/job/beam_PostCommit_Python_Verify/ws/sdks/python/apache_beam/internal/pickler.py",>
line 160, in new_save_module_dict
    return old_save_module_dict(pickler, obj)
  File "<https://builds.apache.org/job/beam_PostCommit_Python_Verify/ws/sdks/python/local/lib/python2.7/site-packages/dill/dill.py",>
line 841, in save_module_dict
    StockPickler.save_dict(pickler, obj)
  File "/usr/lib/python2.7/pickle.py", line 649, in save_dict
    self._batch_setitems(obj.iteritems())
  File "/usr/lib/python2.7/pickle.py", line 681, in _batch_setitems
    save(v)
  File "/usr/lib/python2.7/pickle.py", line 286, in save
    f(self, obj) # Call unbound method with explicit self
  File "/usr/lib/python2.7/pickle.py", line 600, in save_list
    self._batch_appends(iter(obj))
  File "/usr/lib/python2.7/pickle.py", line 633, in _batch_appends
    save(x)
  File "/usr/lib/python2.7/pickle.py", line 331, in save
    self.save_reduce(obj=obj, *rv)
  File "/usr/lib/python2.7/pickle.py", line 419, in save_reduce
    save(state)
  File "/usr/lib/python2.7/pickle.py", line 286, in save
    f(self, obj) # Call unbound method with explicit self
  File "<https://builds.apache.org/job/beam_PostCommit_Python_Verify/ws/sdks/python/apache_beam/internal/pickler.py",>
line 160, in new_save_module_dict
    return old_save_module_dict(pickler, obj)
  File "<https://builds.apache.org/job/beam_PostCommit_Python_Verify/ws/sdks/python/local/lib/python2.7/site-packages/dill/dill.py",>
line 841, in save_module_dict
    StockPickler.save_dict(pickler, obj)
  File "/usr/lib/python2.7/pickle.py", line 649, in save_dict
    self._batch_setitems(obj.iteritems())
  File "/usr/lib/python2.7/pickle.py", line 681, in _batch_setitems
    save(v)
  File "/usr/lib/python2.7/pickle.py", line 331, in save
    self.save_reduce(obj=obj, *rv)
  File "/usr/lib/python2.7/pickle.py", line 419, in save_reduce
    save(state)
  File "/usr/lib/python2.7/pickle.py", line 286, in save
    f(self, obj) # Call unbound method with explicit self
  File "<https://builds.apache.org/job/beam_PostCommit_Python_Verify/ws/sdks/python/apache_beam/internal/pickler.py",>
line 160, in new_save_module_dict
    return old_save_module_dict(pickler, obj)
  File "<https://builds.apache.org/job/beam_PostCommit_Python_Verify/ws/sdks/python/local/lib/python2.7/site-packages/dill/dill.py",>
line 841, in save_module_dict
    StockPickler.save_dict(pickler, obj)
  File "/usr/lib/python2.7/pickle.py", line 649, in save_dict
    self._batch_setitems(obj.iteritems())
  File "/usr/lib/python2.7/pickle.py", line 680, in _batch_setitems
    save(k)
  File "/usr/lib/python2.7/pickle.py", line 271, in save
    pid = self.persistent_id(obj)
  File "<https://builds.apache.org/job/beam_PostCommit_Python_Verify/ws/sdks/python/nose-1.3.7-py2.7.egg/nose/plugins/multiprocess.py",>
line 276, in signalhandler
    raise TimedOutException()
TimedOutException: 'test_iterable_side_input (apache_beam.transforms.sideinputs_test.SideInputsTest)'

======================================================================
ERROR: test_multi_valued_singleton_side_input (apache_beam.transforms.sideinputs_test.SideInputsTest)
----------------------------------------------------------------------
Traceback (most recent call last):
  File "<https://builds.apache.org/job/beam_PostCommit_Python_Verify/ws/sdks/python/nose-1.3.7-py2.7.egg/nose/plugins/multiprocess.py",>
line 812, in run
    test(orig)
  File "<https://builds.apache.org/job/beam_PostCommit_Python_Verify/ws/sdks/python/nose-1.3.7-py2.7.egg/nose/case.py",>
line 45, in __call__
    return self.run(*arg, **kwarg)
  File "<https://builds.apache.org/job/beam_PostCommit_Python_Verify/ws/sdks/python/nose-1.3.7-py2.7.egg/nose/case.py",>
line 133, in run
    self.runTest(result)
  File "<https://builds.apache.org/job/beam_PostCommit_Python_Verify/ws/sdks/python/nose-1.3.7-py2.7.egg/nose/case.py",>
line 151, in runTest
    test(result)
  File "/usr/lib/python2.7/unittest/case.py", line 395, in __call__
    return self.run(*args, **kwds)
  File "/usr/lib/python2.7/unittest/case.py", line 331, in run
    testMethod()
  File "<https://builds.apache.org/job/beam_PostCommit_Python_Verify/ws/sdks/python/apache_beam/transforms/sideinputs_test.py",>
line 156, in test_multi_valued_singleton_side_input
    pipeline.run()
  File "<https://builds.apache.org/job/beam_PostCommit_Python_Verify/ws/sdks/python/apache_beam/test_pipeline.py",>
line 91, in run
    result = super(TestPipeline, self).run()
  File "<https://builds.apache.org/job/beam_PostCommit_Python_Verify/ws/sdks/python/apache_beam/pipeline.py",>
line 169, in run
    return self.runner.run(self)
  File "<https://builds.apache.org/job/beam_PostCommit_Python_Verify/ws/sdks/python/apache_beam/runners/dataflow/test_dataflow_runner.py",>
line 39, in run
    self.result = super(TestDataflowRunner, self).run(pipeline)
  File "<https://builds.apache.org/job/beam_PostCommit_Python_Verify/ws/sdks/python/apache_beam/runners/dataflow/dataflow_runner.py",>
line 175, in run
    pipeline.options, job_version)
  File "<https://builds.apache.org/job/beam_PostCommit_Python_Verify/ws/sdks/python/apache_beam/runners/dataflow/internal/apiclient.py",>
line 370, in __init__
    credentials = get_service_credentials()
  File "<https://builds.apache.org/job/beam_PostCommit_Python_Verify/ws/sdks/python/apache_beam/internal/gcp/auth.py",>
line 141, in get_service_credentials
    credentials.get_access_token()
  File "<https://builds.apache.org/job/beam_PostCommit_Python_Verify/ws/sdks/python/local/lib/python2.7/site-packages/oauth2client/client.py",>
line 677, in get_access_token
    self.refresh(http)
  File "<https://builds.apache.org/job/beam_PostCommit_Python_Verify/ws/sdks/python/local/lib/python2.7/site-packages/oauth2client/client.py",>
line 560, in refresh
    self._refresh(http.request)
  File "<https://builds.apache.org/job/beam_PostCommit_Python_Verify/ws/sdks/python/apache_beam/internal/gcp/auth.py",>
line 114, in _refresh
    output, _ = gcloud_process.communicate()
  File "/usr/lib/python2.7/subprocess.py", line 791, in communicate
    stdout = _eintr_retry_call(self.stdout.read)
  File "/usr/lib/python2.7/subprocess.py", line 476, in _eintr_retry_call
    return func(*args)
  File "<https://builds.apache.org/job/beam_PostCommit_Python_Verify/ws/sdks/python/nose-1.3.7-py2.7.egg/nose/plugins/multiprocess.py",>
line 276, in signalhandler
    raise TimedOutException()
TimedOutException: 'test_multi_valued_singleton_side_input (apache_beam.transforms.sideinputs_test.SideInputsTest)'

----------------------------------------------------------------------
Ran 14 tests in 708.142s

FAILED (errors=8)
Found: https://console.cloud.google.com/dataflow/job/2017-04-14_13_16_11-2900764602732882743?project=apache-beam-testing
Found: https://console.cloud.google.com/dataflow/job/2017-04-14_13_22_13-7522876215117761360?project=apache-beam-testing
Found: https://console.cloud.google.com/dataflow/job/2017-04-14_13_16_11-4308288569503299757?project=apache-beam-testing
Found: https://console.cloud.google.com/dataflow/job/2017-04-14_13_21_48-5621412517667739083?project=apache-beam-testing
Found: https://console.cloud.google.com/dataflow/job/2017-04-14_13_16_11-12308664871545399051?project=apache-beam-testing
Found: https://console.cloud.google.com/dataflow/job/2017-04-14_13_22_28-1158492961508600666?project=apache-beam-testing
Build step 'Execute shell' marked build as failure

Mime
View raw message