beam-commits mailing list archives

Site index · List index
Message view « Date » · « Thread »
Top « Date » · « Thread »
From Apache Jenkins Server <jenk...@builds.apache.org>
Subject Build failed in Jenkins: beam_PostCommit_Java_MavenInstall #3288
Date Thu, 13 Apr 2017 17:33:41 GMT
See <https://builds.apache.org/job/beam_PostCommit_Java_MavenInstall/3288/display/redirect?page=changes>

Changes:

[tgroh] Improve Empty Create Default Coder Error Message

------------------------------------------
[...truncated 2.20 MB...]
ok
test_read (apache_beam.pipeline_test.PipelineTest) ... ok
test_reuse_cloned_custom_transform_instance (apache_beam.pipeline_test.PipelineTest) ... ok
test_reuse_custom_transform_instance (apache_beam.pipeline_test.PipelineTest) ... <https://builds.apache.org/job/beam_PostCommit_Java_MavenInstall/ws/sdks/python/apache_beam/pipeline_test.py>:196:
DeprecationWarning: BaseException.message has been deprecated as of Python 2.6
  cm.exception.message,
ok
test_transform_no_super_init (apache_beam.pipeline_test.PipelineTest) ... ok
test_visit_entire_graph (apache_beam.pipeline_test.PipelineTest) ... ok
test_simple (apache_beam.pipeline_test.RunnerApiTest)
Tests serializing, deserializing, and running a simple pipeline. ... ok
test_pvalue_expected_arguments (apache_beam.pvalue_test.PValueTest) ... ok
test_append_extra_options (apache_beam.test_pipeline_test.TestPipelineTest) ... ok
test_append_verifier_in_extra_opt (apache_beam.test_pipeline_test.TestPipelineTest) ... ok
test_create_test_pipeline_options (apache_beam.test_pipeline_test.TestPipelineTest) ... ok
test_empty_option_args_parsing (apache_beam.test_pipeline_test.TestPipelineTest) ... ok
test_get_option (apache_beam.test_pipeline_test.TestPipelineTest) ... ok
test_option_args_parsing (apache_beam.test_pipeline_test.TestPipelineTest) ... ok
test_skip_IT (apache_beam.test_pipeline_test.TestPipelineTest) ... SKIP: IT is skipped because
--test-pipeline-options is not specified
test_file_checksum_matchcer_invalid_sleep_time (apache_beam.tests.pipeline_verifiers_test.PipelineVerifiersTest)
... <https://builds.apache.org/job/beam_PostCommit_Java_MavenInstall/ws/sdks/python/apache_beam/tests/pipeline_verifiers_test.py>:129:
DeprecationWarning: BaseException.message has been deprecated as of Python 2.6
  self.assertEqual(cm.exception.message,
ok
test_file_checksum_matcher_read_failed (apache_beam.tests.pipeline_verifiers_test.PipelineVerifiersTest)
... ok
test_file_checksum_matcher_service_error (apache_beam.tests.pipeline_verifiers_test.PipelineVerifiersTest)
... ok
test_file_checksum_matcher_sleep_before_verify (apache_beam.tests.pipeline_verifiers_test.PipelineVerifiersTest)
... ok
test_file_checksum_matcher_success (apache_beam.tests.pipeline_verifiers_test.PipelineVerifiersTest)
... ok
test_pipeline_state_matcher_fails (apache_beam.tests.pipeline_verifiers_test.PipelineVerifiersTest)
Test PipelineStateMatcher fails when using default expected state ... ok
test_pipeline_state_matcher_given_state (apache_beam.tests.pipeline_verifiers_test.PipelineVerifiersTest)
Test PipelineStateMatcher successes when matches given state ... ok
test_pipeline_state_matcher_success (apache_beam.tests.pipeline_verifiers_test.PipelineVerifiersTest)
Test PipelineStateMatcher successes when using default expected state ... ok

----------------------------------------------------------------------
Ran 1086 tests in 119.806s

OK (skipped=13)
___________________________________ summary ____________________________________
  docs: commands succeeded
ERROR:   lint: commands failed
  py27: commands succeeded
  py27cython: commands succeeded
  py27gcp: commands succeeded
2017-04-13T17:20:46.561 [ERROR] Command execution failed.
org.apache.commons.exec.ExecuteException: Process exited with an error: 1 (Exit value: 1)
	at org.apache.commons.exec.DefaultExecutor.executeInternal(DefaultExecutor.java:404)
	at org.apache.commons.exec.DefaultExecutor.execute(DefaultExecutor.java:166)
	at org.codehaus.mojo.exec.ExecMojo.executeCommandLine(ExecMojo.java:764)
	at org.codehaus.mojo.exec.ExecMojo.executeCommandLine(ExecMojo.java:711)
	at org.codehaus.mojo.exec.ExecMojo.execute(ExecMojo.java:289)
	at org.apache.maven.plugin.DefaultBuildPluginManager.executeMojo(DefaultBuildPluginManager.java:134)
	at org.apache.maven.lifecycle.internal.MojoExecutor.execute(MojoExecutor.java:208)
	at org.apache.maven.lifecycle.internal.MojoExecutor.execute(MojoExecutor.java:153)
	at org.apache.maven.lifecycle.internal.MojoExecutor.execute(MojoExecutor.java:145)
	at org.apache.maven.lifecycle.internal.LifecycleModuleBuilder.buildProject(LifecycleModuleBuilder.java:116)
	at org.apache.maven.lifecycle.internal.LifecycleModuleBuilder.buildProject(LifecycleModuleBuilder.java:80)
	at org.apache.maven.lifecycle.internal.builder.singlethreaded.SingleThreadedBuilder.build(SingleThreadedBuilder.java:51)
	at org.apache.maven.lifecycle.internal.LifecycleStarter.execute(LifecycleStarter.java:128)
	at org.apache.maven.DefaultMaven.doExecute(DefaultMaven.java:307)
	at org.apache.maven.DefaultMaven.doExecute(DefaultMaven.java:193)
	at org.apache.maven.DefaultMaven.execute(DefaultMaven.java:106)
	at org.jvnet.hudson.maven3.launcher.Maven33Launcher.main(Maven33Launcher.java:129)
	at sun.reflect.NativeMethodAccessorImpl.invoke0(Native Method)
	at sun.reflect.NativeMethodAccessorImpl.invoke(NativeMethodAccessorImpl.java:62)
	at sun.reflect.DelegatingMethodAccessorImpl.invoke(DelegatingMethodAccessorImpl.java:43)
	at java.lang.reflect.Method.invoke(Method.java:498)
	at org.codehaus.plexus.classworlds.launcher.Launcher.launchStandard(Launcher.java:330)
	at org.codehaus.plexus.classworlds.launcher.Launcher.launch(Launcher.java:238)
	at jenkins.maven3.agent.Maven33Main.launch(Maven33Main.java:176)
	at sun.reflect.NativeMethodAccessorImpl.invoke0(Native Method)
	at sun.reflect.NativeMethodAccessorImpl.invoke(NativeMethodAccessorImpl.java:62)
	at sun.reflect.DelegatingMethodAccessorImpl.invoke(DelegatingMethodAccessorImpl.java:43)
	at java.lang.reflect.Method.invoke(Method.java:498)
	at hudson.maven.Maven3Builder.call(Maven3Builder.java:139)
	at hudson.maven.Maven3Builder.call(Maven3Builder.java:70)
	at hudson.remoting.UserRequest.perform(UserRequest.java:153)
	at hudson.remoting.UserRequest.perform(UserRequest.java:50)
	at hudson.remoting.Request$2.run(Request.java:336)
	at hudson.remoting.InterceptingExecutorService$1.call(InterceptingExecutorService.java:68)
	at java.util.concurrent.FutureTask.run(FutureTask.java:266)
	at java.util.concurrent.ThreadPoolExecutor.runWorker(ThreadPoolExecutor.java:1142)
	at java.util.concurrent.ThreadPoolExecutor$Worker.run(ThreadPoolExecutor.java:617)
	at java.lang.Thread.run(Thread.java:745)
[JENKINS] Archiving disabled
2017-04-13T17:21:28.406 [INFO]                                                           
             
2017-04-13T17:21:28.406 [INFO] ------------------------------------------------------------------------
2017-04-13T17:21:28.406 [INFO] Skipping Apache Beam :: Parent
2017-04-13T17:21:28.406 [INFO] This project has been banned from the build due to previous
failures.
2017-04-13T17:21:28.406 [INFO] ------------------------------------------------------------------------
[JENKINS] Archiving disabled
[JENKINS] Archiving disabled
[JENKINS] Archiving disabled
[JENKINS] Archiving disabled
[JENKINS] Archiving disabled
[JENKINS] Archiving disabled
[JENKINS] Archiving disabled
[JENKINS] Archiving disabled
[JENKINS] Archiving disabled
[JENKINS] Archiving disabled
[JENKINS] Archiving disabled
[JENKINS] Archiving disabled
[JENKINS] Archiving disabled
[JENKINS] Archiving disabled
[JENKINS] Archiving disabled
[JENKINS] Archiving disabled
[JENKINS] Archiving disabled
[JENKINS] Archiving disabled
[JENKINS] Archiving disabled
[JENKINS] Archiving disabled
[JENKINS] Archiving disabled
[JENKINS] Archiving disabled
[JENKINS] Archiving disabled
[JENKINS] Archiving disabled
[JENKINS] Archiving disabled
[JENKINS] Archiving disabled
[JENKINS] Archiving disabled
[JENKINS] Archiving disabled
[JENKINS] Archiving disabled
[JENKINS] Archiving disabled
[JENKINS] Archiving disabled
[JENKINS] Archiving disabled
[JENKINS] Archiving disabled
[JENKINS] Archiving disabled
[JENKINS] Archiving disabled
[JENKINS] Archiving disabled
[JENKINS] Archiving disabled
[JENKINS] Archiving disabled
[JENKINS] Archiving disabled
[JENKINS] Archiving disabled
[JENKINS] Archiving disabled
[JENKINS] Archiving disabled
[JENKINS] Archiving disabled
[JENKINS] Archiving disabled
[JENKINS] Archiving disabled
[JENKINS] Archiving disabled2017-04-13T17:21:53.918 [INFO] ------------------------------------------------------------------------
2017-04-13T17:21:53.918 [INFO] Reactor Summary:
2017-04-13T17:21:53.918 [INFO] 
2017-04-13T17:21:53.918 [INFO] Apache Beam :: Parent .............................. SUCCESS
[ 44.026 s]
2017-04-13T17:21:53.918 [INFO] Apache Beam :: SDKs :: Java :: Build Tools ......... SUCCESS
[ 31.787 s]
2017-04-13T17:21:53.918 [INFO] Apache Beam :: SDKs ................................ SUCCESS
[ 24.001 s]
2017-04-13T17:21:53.918 [INFO] Apache Beam :: SDKs :: Common ...................... SUCCESS
[ 18.982 s]
2017-04-13T17:21:53.919 [INFO] Apache Beam :: SDKs :: Common :: Fn API ............ SUCCESS
[ 36.872 s]
2017-04-13T17:21:53.919 [INFO] Apache Beam :: SDKs :: Common :: Runner API ........ SUCCESS
[ 17.534 s]
2017-04-13T17:21:53.919 [INFO] Apache Beam :: SDKs :: Java ........................ SUCCESS
[  4.351 s]
2017-04-13T17:21:53.919 [INFO] Apache Beam :: SDKs :: Java :: Core ................ SUCCESS
[03:58 min]
2017-04-13T17:21:53.919 [INFO] Apache Beam :: SDKs :: Java :: IO .................. SUCCESS
[  4.249 s]
2017-04-13T17:21:53.919 [INFO] Apache Beam :: SDKs :: Java :: IO :: Common ........ SUCCESS
[ 13.799 s]
2017-04-13T17:21:53.919 [INFO] Apache Beam :: Runners ............................. SUCCESS
[  3.788 s]
2017-04-13T17:21:53.919 [INFO] Apache Beam :: Runners :: Core Java Construction ... SUCCESS
[ 49.063 s]
2017-04-13T17:21:53.919 [INFO] Apache Beam :: Runners :: Core Java ................ SUCCESS
[02:00 min]
2017-04-13T17:21:53.919 [INFO] Apache Beam :: Runners :: Direct Java .............. SUCCESS
[05:13 min]
2017-04-13T17:21:53.919 [INFO] Apache Beam :: SDKs :: Java :: IO :: Elasticsearch . SUCCESS
[ 56.650 s]
2017-04-13T17:21:53.919 [INFO] Apache Beam :: SDKs :: Java :: IO :: Google Cloud Platform
SUCCESS [01:47 min]
2017-04-13T17:21:53.919 [INFO] Apache Beam :: SDKs :: Java :: IO :: Hadoop Common . SUCCESS
[ 32.897 s]
2017-04-13T17:21:53.919 [INFO] Apache Beam :: SDKs :: Java :: IO :: Hadoop ........ SUCCESS
[  5.259 s]
2017-04-13T17:21:53.919 [INFO] Apache Beam :: SDKs :: Java :: IO :: Hadoop :: input-format
SUCCESS [ 36.409 s]
2017-04-13T17:21:53.919 [INFO] Apache Beam :: Runners :: Google Cloud Dataflow .... SUCCESS
[01:16 min]
2017-04-13T17:21:53.919 [INFO] Apache Beam :: SDKs :: Java :: IO :: Hadoop :: jdk1.8-tests
SUCCESS [02:12 min]
2017-04-13T17:21:53.919 [INFO] Apache Beam :: SDKs :: Java :: IO :: HBase ......... SUCCESS
[02:00 min]
2017-04-13T17:21:53.919 [INFO] Apache Beam :: SDKs :: Java :: IO :: HDFS .......... SUCCESS
[ 46.960 s]
2017-04-13T17:21:53.919 [INFO] Apache Beam :: SDKs :: Java :: IO :: JDBC .......... SUCCESS
[01:01 min]
2017-04-13T17:21:53.919 [INFO] Apache Beam :: SDKs :: Java :: IO :: JMS ........... SUCCESS
[ 50.247 s]
2017-04-13T17:21:53.919 [INFO] Apache Beam :: SDKs :: Java :: IO :: Kafka ......... SUCCESS
[ 49.244 s]
2017-04-13T17:21:53.919 [INFO] Apache Beam :: SDKs :: Java :: IO :: Kinesis ....... SUCCESS
[01:00 min]
2017-04-13T17:21:53.919 [INFO] Apache Beam :: SDKs :: Java :: IO :: MongoDB ....... SUCCESS
[01:30 min]
2017-04-13T17:21:53.919 [INFO] Apache Beam :: SDKs :: Java :: IO :: MQTT .......... SUCCESS
[01:07 min]
2017-04-13T17:21:53.920 [INFO] Apache Beam :: SDKs :: Java :: Maven Archetypes .... SUCCESS
[ 22.023 s]
2017-04-13T17:21:53.920 [INFO] Apache Beam :: SDKs :: Java :: Maven Archetypes :: Starter
SUCCESS [ 26.412 s]
2017-04-13T17:21:53.920 [INFO] Apache Beam :: SDKs :: Java :: Maven Archetypes :: Examples
SUCCESS [01:03 min]
2017-04-13T17:21:53.920 [INFO] Apache Beam :: SDKs :: Java :: Maven Archetypes :: Examples
- Java 8 SUCCESS [ 52.963 s]
2017-04-13T17:21:53.920 [INFO] Apache Beam :: SDKs :: Java :: Extensions .......... SUCCESS
[ 31.443 s]
2017-04-13T17:21:53.920 [INFO] Apache Beam :: SDKs :: Java :: Extensions :: Jackson SUCCESS
[ 33.392 s]
2017-04-13T17:21:53.920 [INFO] Apache Beam :: SDKs :: Java :: Extensions :: Join library SUCCESS
[ 33.787 s]
2017-04-13T17:21:53.920 [INFO] Apache Beam :: SDKs :: Java :: Extensions :: Sorter  SUCCESS
[ 57.397 s]
2017-04-13T17:21:53.920 [INFO] Apache Beam :: SDKs :: Java :: Harness ............. SUCCESS
[ 48.153 s]
2017-04-13T17:21:53.920 [INFO] Apache Beam :: SDKs :: Java :: Java 8 Tests ........ SUCCESS
[ 18.023 s]
2017-04-13T17:21:53.920 [INFO] Apache Beam :: SDKs :: Python ...................... FAILURE
[12:01 min]
2017-04-13T17:21:53.920 [INFO] Apache Beam :: Runners :: Flink .................... SKIPPED
2017-04-13T17:21:53.920 [INFO] Apache Beam :: Runners :: Flink :: Core ............ SKIPPED
2017-04-13T17:21:53.920 [INFO] Apache Beam :: Runners :: Flink :: Examples ........ SKIPPED
2017-04-13T17:21:53.921 [INFO] Apache Beam :: Runners :: Spark .................... SKIPPED
2017-04-13T17:21:53.921 [INFO] Apache Beam :: Runners :: Apex ..................... SKIPPED
2017-04-13T17:21:53.921 [INFO] Apache Beam :: Examples ............................ SKIPPED
2017-04-13T17:21:53.921 [INFO] Apache Beam :: Examples :: Java .................... SKIPPED
2017-04-13T17:21:53.921 [INFO] Apache Beam :: Examples :: Java 8 .................. SKIPPED
2017-04-13T17:21:53.921 [INFO] Apache Beam :: SDKs :: Java :: Aggregated Javadoc .. SKIPPED
2017-04-13T17:21:53.921 [INFO] ------------------------------------------------------------------------
2017-04-13T17:21:53.921 [INFO] BUILD FAILURE
2017-04-13T17:21:53.921 [INFO] ------------------------------------------------------------------------
2017-04-13T17:21:53.921 [INFO] Total time: 56:46 min
2017-04-13T17:21:53.922 [INFO] Finished at: 2017-04-13T17:21:53+00:00

2017-04-13T17:21:54.739 [INFO] Final Memory: 267M/2045M
2017-04-13T17:21:54.739 [INFO] ------------------------------------------------------------------------
Waiting for Jenkins to finish collecting data
2017-04-13T17:27:15.148 [ERROR] Failed to execute goal org.codehaus.mojo:exec-maven-plugin:1.5.0:exec
(setuptools-test) on project beam-sdks-python: Command execution failed. Process exited with
an error: 1 (Exit value: 1) -> [Help 1]
org.apache.maven.lifecycle.LifecycleExecutionException: Failed to execute goal org.codehaus.mojo:exec-maven-plugin:1.5.0:exec
(setuptools-test) on project beam-sdks-python: Command execution failed.
	at org.apache.maven.lifecycle.internal.MojoExecutor.execute(MojoExecutor.java:216)
	at org.apache.maven.lifecycle.internal.MojoExecutor.execute(MojoExecutor.java:153)
	at org.apache.maven.lifecycle.internal.MojoExecutor.execute(MojoExecutor.java:145)
	at org.apache.maven.lifecycle.internal.LifecycleModuleBuilder.buildProject(LifecycleModuleBuilder.java:116)
	at org.apache.maven.lifecycle.internal.LifecycleModuleBuilder.buildProject(LifecycleModuleBuilder.java:80)
	at org.apache.maven.lifecycle.internal.builder.singlethreaded.SingleThreadedBuilder.build(SingleThreadedBuilder.java:51)
	at org.apache.maven.lifecycle.internal.LifecycleStarter.execute(LifecycleStarter.java:128)
	at org.apache.maven.DefaultMaven.doExecute(DefaultMaven.java:307)
	at org.apache.maven.DefaultMaven.doExecute(DefaultMaven.java:193)
	at org.apache.maven.DefaultMaven.execute(DefaultMaven.java:106)
	at org.jvnet.hudson.maven3.launcher.Maven33Launcher.main(Maven33Launcher.java:129)
	at sun.reflect.NativeMethodAccessorImpl.invoke0(Native Method)
	at sun.reflect.NativeMethodAccessorImpl.invoke(NativeMethodAccessorImpl.java:62)
	at sun.reflect.DelegatingMethodAccessorImpl.invoke(DelegatingMethodAccessorImpl.java:43)
	at java.lang.reflect.Method.invoke(Method.java:498)
	at org.codehaus.plexus.classworlds.launcher.Launcher.launchStandard(Launcher.java:330)
	at org.codehaus.plexus.classworlds.launcher.Launcher.launch(Launcher.java:238)
	at jenkins.maven3.agent.Maven33Main.launch(Maven33Main.java:176)
	at sun.reflect.NativeMethodAccessorImpl.invoke0(Native Method)
	at sun.reflect.NativeMethodAccessorImpl.invoke(NativeMethodAccessorImpl.java:62)
	at sun.reflect.DelegatingMethodAccessorImpl.invoke(DelegatingMethodAccessorImpl.java:43)
	at java.lang.reflect.Method.invoke(Method.java:498)
	at hudson.maven.Maven3Builder.call(Maven3Builder.java:139)
	at hudson.maven.Maven3Builder.call(Maven3Builder.java:70)
	at hudson.remoting.UserRequest.perform(UserRequest.java:153)
	at hudson.remoting.UserRequest.perform(UserRequest.java:50)
	at hudson.remoting.Request$2.run(Request.java:336)
	at hudson.remoting.InterceptingExecutorService$1.call(InterceptingExecutorService.java:68)
	at java.util.concurrent.FutureTask.run(FutureTask.java:266)
	at java.util.concurrent.ThreadPoolExecutor.runWorker(ThreadPoolExecutor.java:1142)
	at java.util.concurrent.ThreadPoolExecutor$Worker.run(ThreadPoolExecutor.java:617)
	at java.lang.Thread.run(Thread.java:745)
Caused by: org.apache.maven.plugin.MojoExecutionException: Command execution failed.
	at org.codehaus.mojo.exec.ExecMojo.execute(ExecMojo.java:302)
	at org.apache.maven.plugin.DefaultBuildPluginManager.executeMojo(DefaultBuildPluginManager.java:134)
	at org.apache.maven.lifecycle.internal.MojoExecutor.execute(MojoExecutor.java:208)
	... 31 more
Caused by: org.apache.commons.exec.ExecuteException: Process exited with an error: 1 (Exit
value: 1)
	at org.apache.commons.exec.DefaultExecutor.executeInternal(DefaultExecutor.java:404)
	at org.apache.commons.exec.DefaultExecutor.execute(DefaultExecutor.java:166)
	at org.codehaus.mojo.exec.ExecMojo.executeCommandLine(ExecMojo.java:764)
	at org.codehaus.mojo.exec.ExecMojo.executeCommandLine(ExecMojo.java:711)
	at org.codehaus.mojo.exec.ExecMojo.execute(ExecMojo.java:289)
	... 33 more
2017-04-13T17:27:15.149 [ERROR] 
2017-04-13T17:27:15.149 [ERROR] Re-run Maven using the -X switch to enable full debug logging.
2017-04-13T17:27:15.149 [ERROR] 
2017-04-13T17:27:15.149 [ERROR] For more information about the errors and possible solutions,
please read the following articles:
2017-04-13T17:27:15.149 [ERROR] [Help 1] http://cwiki.apache.org/confluence/display/MAVEN/MojoExecutionException
2017-04-13T17:27:15.149 [ERROR] 
2017-04-13T17:27:15.149 [ERROR] After correcting the problems, you can resume the build with
the command
2017-04-13T17:27:15.149 [ERROR]   mvn <goals> -rf :beam-sdks-python
channel stopped

Mime
View raw message