beam-commits mailing list archives

Site index · List index
Message view « Date » · « Thread »
Top « Date » · « Thread »
From Apache Jenkins Server <jenk...@builds.apache.org>
Subject Build failed in Jenkins: beam_PostCommit_Java_MavenInstall #3463
Date Wed, 26 Apr 2017 16:11:10 GMT
See <https://builds.apache.org/job/beam_PostCommit_Java_MavenInstall/3463/display/redirect>

------------------------------------------
[...truncated 1.63 MB...]
2017-04-26T16:10:33.629 [INFO] Exclude: **/*.iml
2017-04-26T16:10:33.629 [INFO] Exclude: **/.idea/**/*
2017-04-26T16:10:33.629 [INFO] Exclude: **/*.egg-info/**/*
2017-04-26T16:10:33.629 [INFO] Exclude: **/package-list
2017-04-26T16:10:33.629 [INFO] Exclude: **/user.avsc
2017-04-26T16:10:33.629 [INFO] Exclude: **/test/resources/**/*.txt
2017-04-26T16:10:33.630 [INFO] Exclude: **/test/**/.placeholder
2017-04-26T16:10:33.630 [INFO] Exclude: .repository/**/*
2017-04-26T16:10:33.630 [INFO] Exclude: **/nose-*.egg/**/*
2017-04-26T16:10:33.630 [INFO] Exclude: **/.eggs/**/*
2017-04-26T16:10:33.630 [INFO] Exclude: **/.tox/**/*
2017-04-26T16:10:33.630 [INFO] Exclude: **/.checkstyle
2017-04-26T16:10:33.630 [INFO] Exclude: **/.classpath
2017-04-26T16:10:33.630 [INFO] Exclude: **/.factorypath
2017-04-26T16:10:33.630 [INFO] Exclude: **/.project
2017-04-26T16:10:33.630 [INFO] Exclude: **/.settings/**/*
2017-04-26T16:10:33.630 [INFO] Exclude: **/sdks/python/apache_beam/runners/api/*.py
2017-04-26T16:10:33.633 [INFO] 17 resources included (use -debug for more details)
2017-04-26T16:10:33.667 [INFO] Rat check: Summary over all files. Unapproved: 0, unknown:
0, generated: 0, approved: 17 licenses.
2017-04-26T16:10:33.769 [INFO] 
2017-04-26T16:10:33.769 [INFO] --- maven-install-plugin:2.5.2:install (default-install) @
beam-sdks-java-maven-archetypes-examples ---
2017-04-26T16:10:33.770 [INFO] Installing <https://builds.apache.org/job/beam_PostCommit_Java_MavenInstall/ws/sdks/java/maven-archetypes/examples/target/beam-sdks-java-maven-archetypes-examples-0.7.0-SNAPSHOT.jar>
to <https://builds.apache.org/job/beam_PostCommit_Java_MavenInstall/ws/.repository/org/apache/beam/beam-sdks-java-maven-archetypes-examples/0.7.0-SNAPSHOT/beam-sdks-java-maven-archetypes-examples-0.7.0-SNAPSHOT.jar>
2017-04-26T16:10:33.773 [INFO] Installing <https://builds.apache.org/job/beam_PostCommit_Java_MavenInstall/ws/sdks/java/maven-archetypes/examples/dependency-reduced-pom.xml>
to <https://builds.apache.org/job/beam_PostCommit_Java_MavenInstall/ws/.repository/org/apache/beam/beam-sdks-java-maven-archetypes-examples/0.7.0-SNAPSHOT/beam-sdks-java-maven-archetypes-examples-0.7.0-SNAPSHOT.pom>
2017-04-26T16:10:33.774 [INFO] Installing <https://builds.apache.org/job/beam_PostCommit_Java_MavenInstall/ws/sdks/java/maven-archetypes/examples/target/beam-sdks-java-maven-archetypes-examples-0.7.0-SNAPSHOT-sources.jar>
to <https://builds.apache.org/job/beam_PostCommit_Java_MavenInstall/ws/.repository/org/apache/beam/beam-sdks-java-maven-archetypes-examples/0.7.0-SNAPSHOT/beam-sdks-java-maven-archetypes-examples-0.7.0-SNAPSHOT-sources.jar>
2017-04-26T16:10:33.775 [INFO] Installing <https://builds.apache.org/job/beam_PostCommit_Java_MavenInstall/ws/sdks/java/maven-archetypes/examples/target/beam-sdks-java-maven-archetypes-examples-0.7.0-SNAPSHOT-test-sources.jar>
to <https://builds.apache.org/job/beam_PostCommit_Java_MavenInstall/ws/.repository/org/apache/beam/beam-sdks-java-maven-archetypes-examples/0.7.0-SNAPSHOT/beam-sdks-java-maven-archetypes-examples-0.7.0-SNAPSHOT-test-sources.jar>
2017-04-26T16:10:33.832 [INFO] 
2017-04-26T16:10:33.832 [INFO] --- maven-archetype-plugin:2.4:integration-test (default-integration-test)
@ beam-sdks-java-maven-archetypes-examples ---
2017-04-26T16:10:33.833 [INFO] Processing Archetype IT project: basic
2017-04-26T16:10:33.837 [INFO] ----------------------------------------------------------------------------
2017-04-26T16:10:33.837 [INFO] Using following parameters for creating project from Archetype:
beam-sdks-java-maven-archetypes-examples:0.7.0-SNAPSHOT
2017-04-26T16:10:33.837 [INFO] ----------------------------------------------------------------------------
2017-04-26T16:10:33.838 [INFO] Parameter: groupId, Value: archetype.it
2017-04-26T16:10:33.838 [INFO] Parameter: artifactId, Value: basic
2017-04-26T16:10:33.838 [INFO] Parameter: version, Value: 0.1
2017-04-26T16:10:33.838 [INFO] Parameter: package, Value: it.pkg
2017-04-26T16:10:33.838 [INFO] Parameter: packageInPathFormat, Value: it/pkg
2017-04-26T16:10:33.838 [INFO] Parameter: version, Value: 0.1
2017-04-26T16:10:33.838 [INFO] Parameter: package, Value: it.pkg
2017-04-26T16:10:33.838 [INFO] Parameter: groupId, Value: archetype.it
2017-04-26T16:10:33.838 [INFO] Parameter: targetPlatform, Value: 1.7
2017-04-26T16:10:33.839 [INFO] Parameter: artifactId, Value: basic
2017-04-26T16:10:33.921 [INFO] project created from Archetype in dir: <https://builds.apache.org/job/beam_PostCommit_Java_MavenInstall/ws/sdks/java/maven-archetypes/examples/target/test-classes/projects/basic/project/basic>
2017-04-26T16:10:33.922 [INFO] Invoking post-archetype-generation goals: verify
2017-04-26T16:10:36.050 [INFO] 2017-04-26\T\16:10:36.048 [INFO] Error stacktraces are turned
on.
2017-04-26T16:10:36.128 [INFO] 2017-04-26\T\16:10:36.127 [INFO] Scanning for projects...
2017-04-26T16:10:36.241 [INFO] 2017-04-26\T\16:10:36.240 [ERROR] [ERROR] Some problems were
encountered while processing the POMs:
2017-04-26T16:10:36.241 [INFO] [ERROR] 'build.plugins.plugin.version' for org.apache.maven.plugins:maven-surefire-plugin
must be a valid version but is '${surefire-plugin.version}'. @ line 62, column 18
2017-04-26T16:10:36.241 [INFO] [ERROR] 'build.plugins.plugin[org.apache.maven.plugins:maven-surefire-plugin].dependencies.dependency.version'
for org.apache.maven.surefire:surefire-junit47:jar must be a valid version but is '${surefire-plugin.version}'.
@ line 72, column 22
2017-04-26T16:10:36.241 [INFO]  @ 
2017-04-26T16:10:36.242 [INFO] 2017-04-26\T\16:10:36.242 [ERROR] The build could not read
1 project -> [Help 1]
2017-04-26T16:10:36.242 [INFO] org.apache.maven.project.ProjectBuildingException: Some problems
were encountered while processing the POMs:
2017-04-26T16:10:36.242 [INFO] [ERROR] 'build.plugins.plugin.version' for org.apache.maven.plugins:maven-surefire-plugin
must be a valid version but is '${surefire-plugin.version}'. @ line 62, column 18
2017-04-26T16:10:36.242 [INFO] [ERROR] 'build.plugins.plugin[org.apache.maven.plugins:maven-surefire-plugin].dependencies.dependency.version'
for org.apache.maven.surefire:surefire-junit47:jar must be a valid version but is '${surefire-plugin.version}'.
@ line 72, column 22
2017-04-26T16:10:36.242 [INFO] 
2017-04-26T16:10:36.242 [INFO] 	at org.apache.maven.project.DefaultProjectBuilder.build(DefaultProjectBuilder.java:422)
2017-04-26T16:10:36.242 [INFO] 	at org.apache.maven.graph.DefaultGraphBuilder.collectProjects(DefaultGraphBuilder.java:419)
2017-04-26T16:10:36.242 [INFO] 	at org.apache.maven.graph.DefaultGraphBuilder.getProjectsForMavenReactor(DefaultGraphBuilder.java:410)
2017-04-26T16:10:36.242 [INFO] 	at org.apache.maven.graph.DefaultGraphBuilder.build(DefaultGraphBuilder.java:83)
2017-04-26T16:10:36.242 [INFO] 	at org.apache.maven.DefaultMaven.buildGraph(DefaultMaven.java:491)
2017-04-26T16:10:36.242 [INFO] 	at org.apache.maven.DefaultMaven.doExecute(DefaultMaven.java:219)
2017-04-26T16:10:36.242 [INFO] 	at org.apache.maven.DefaultMaven.doExecute(DefaultMaven.java:193)
2017-04-26T16:10:36.242 [INFO] 	at org.apache.maven.DefaultMaven.execute(DefaultMaven.java:106)
2017-04-26T16:10:36.242 [INFO] 	at org.apache.maven.cli.MavenCli.execute(MavenCli.java:862)
2017-04-26T16:10:36.242 [INFO] 	at org.apache.maven.cli.MavenCli.doMain(MavenCli.java:286)
2017-04-26T16:10:36.243 [INFO] 	at org.apache.maven.cli.MavenCli.main(MavenCli.java:197)
2017-04-26T16:10:36.243 [INFO] 	at sun.reflect.NativeMethodAccessorImpl.invoke0(Native Method)
2017-04-26T16:10:36.243 [INFO] 	at sun.reflect.NativeMethodAccessorImpl.invoke(NativeMethodAccessorImpl.java:62)
2017-04-26T16:10:36.243 [INFO] 	at sun.reflect.DelegatingMethodAccessorImpl.invoke(DelegatingMethodAccessorImpl.java:43)
2017-04-26T16:10:36.243 [INFO] 	at java.lang.reflect.Method.invoke(Method.java:498)
2017-04-26T16:10:36.243 [INFO] 	at org.codehaus.plexus.classworlds.launcher.Launcher.launchEnhanced(Launcher.java:289)
2017-04-26T16:10:36.243 [INFO] 	at org.codehaus.plexus.classworlds.launcher.Launcher.launch(Launcher.java:229)
2017-04-26T16:10:36.243 [INFO] 	at org.codehaus.plexus.classworlds.launcher.Launcher.mainWithExitCode(Launcher.java:415)
2017-04-26T16:10:36.243 [INFO] 	at org.codehaus.plexus.classworlds.launcher.Launcher.main(Launcher.java:356)
2017-04-26T16:10:36.243 [INFO] 2017-04-26\T\16:10:36.243 [ERROR]   
2017-04-26T16:10:36.244 [INFO] 2017-04-26\T\16:10:36.243 [ERROR]   The project archetype.it:basic:0.1
(<https://builds.apache.org/job/beam_PostCommit_Java_MavenInstall/ws/sdks/java/maven-archetypes/examples/target/test-classes/projects/basic/project/basic/pom.xml)>
has 2 errors
2017-04-26T16:10:36.245 [INFO] 2017-04-26\T\16:10:36.245 [ERROR]     'build.plugins.plugin.version'
for org.apache.maven.plugins:maven-surefire-plugin must be a valid version but is '${surefire-plugin.version}'.
@ line 62, column 18
2017-04-26T16:10:36.245 [INFO] 2017-04-26\T\16:10:36.245 [ERROR]     'build.plugins.plugin[org.apache.maven.plugins:maven-surefire-plugin].dependencies.dependency.version'
for org.apache.maven.surefire:surefire-junit47:jar must be a valid version but is '${surefire-plugin.version}'.
@ line 72, column 22
2017-04-26T16:10:36.245 [INFO] 2017-04-26\T\16:10:36.245 [ERROR] 
2017-04-26T16:10:36.245 [INFO] 2017-04-26\T\16:10:36.245 [ERROR] Re-run Maven using the -X
switch to enable full debug logging.
2017-04-26T16:10:36.245 [INFO] 2017-04-26\T\16:10:36.245 [ERROR] 
2017-04-26T16:10:36.245 [INFO] 2017-04-26\T\16:10:36.245 [ERROR] For more information about
the errors and possible solutions, please read the following articles:
2017-04-26T16:10:36.245 [INFO] 2017-04-26\T\16:10:36.245 [ERROR] [Help 1] http://cwiki.apache.org/confluence/display/MAVEN/ProjectBuildingException
2017-04-26T16:10:36.272 [INFO] Post-archetype-generation invoker exit code: 1
[JENKINS] Recording test results
[JENKINS] Archiving disabled
2017-04-26T16:10:37.019 [INFO]                                                           
             
2017-04-26T16:10:37.019 [INFO] ------------------------------------------------------------------------
2017-04-26T16:10:37.019 [INFO] Skipping Apache Beam :: Parent
2017-04-26T16:10:37.019 [INFO] This project has been banned from the build due to previous
failures.
2017-04-26T16:10:37.019 [INFO] ------------------------------------------------------------------------
[JENKINS] Archiving disabled
[JENKINS] Archiving disabled
[JENKINS] Archiving disabled
[JENKINS] Archiving disabled
[JENKINS] Archiving disabled
[JENKINS] Archiving disabled
[JENKINS] Archiving disabled
[JENKINS] Archiving disabled
[JENKINS] Archiving disabled
[JENKINS] Archiving disabled
[JENKINS] Archiving disabled
[JENKINS] Archiving disabled
[JENKINS] Archiving disabled
[JENKINS] Archiving disabled
[JENKINS] Archiving disabled
[JENKINS] Archiving disabled
[JENKINS] Archiving disabled
[JENKINS] Archiving disabled
[JENKINS] Archiving disabled
[JENKINS] Archiving disabled
[JENKINS] Archiving disabled
[JENKINS] Archiving disabled
[JENKINS] Archiving disabled
[JENKINS] Archiving disabled
[JENKINS] Archiving disabled
[JENKINS] Archiving disabled
[JENKINS] Archiving disabled
[JENKINS] Archiving disabled
[JENKINS] Archiving disabled
[JENKINS] Archiving disabled
[JENKINS] Archiving disabled
[JENKINS] Archiving disabled
[JENKINS] Archiving disabled
[JENKINS] Archiving disabled
[JENKINS] Archiving disabled
[JENKINS] Archiving disabled
[JENKINS] Archiving disabled
[JENKINS] Archiving disabled
[JENKINS] Archiving disabled
[JENKINS] Archiving disabled
[JENKINS] Archiving disabled
[JENKINS] Archiving disabled
[JENKINS] Archiving disabled
[JENKINS] Archiving disabled
[JENKINS] Archiving disabled
2017-04-26T16:10:56.953 [INFO] ------------------------------------------------------------------------
2017-04-26T16:10:56.953 [INFO] Reactor Summary:
2017-04-26T16:10:56.953 [INFO] 
2017-04-26T16:10:56.953 [INFO] Apache Beam :: Parent .............................. SUCCESS
[ 34.369 s]
2017-04-26T16:10:56.954 [INFO] Apache Beam :: SDKs :: Java :: Build Tools ......... SUCCESS
[ 14.574 s]
2017-04-26T16:10:56.954 [INFO] Apache Beam :: SDKs ................................ SUCCESS
[ 12.824 s]
2017-04-26T16:10:56.954 [INFO] Apache Beam :: SDKs :: Common ...................... SUCCESS
[  3.746 s]
2017-04-26T16:10:56.954 [INFO] Apache Beam :: SDKs :: Common :: Fn API ............ SUCCESS
[ 26.076 s]
2017-04-26T16:10:56.954 [INFO] Apache Beam :: SDKs :: Common :: Runner API ........ SUCCESS
[ 28.590 s]
2017-04-26T16:10:56.954 [INFO] Apache Beam :: SDKs :: Java ........................ SUCCESS
[  3.918 s]
2017-04-26T16:10:56.954 [INFO] Apache Beam :: SDKs :: Java :: Core ................ SUCCESS
[03:34 min]
2017-04-26T16:10:56.954 [INFO] Apache Beam :: SDKs :: Java :: IO .................. SUCCESS
[  6.302 s]
2017-04-26T16:10:56.954 [INFO] Apache Beam :: SDKs :: Java :: IO :: Common ........ SUCCESS
[  9.443 s]
2017-04-26T16:10:56.954 [INFO] Apache Beam :: Runners ............................. SUCCESS
[  3.768 s]
2017-04-26T16:10:56.954 [INFO] Apache Beam :: Runners :: Core Construction Java ... SUCCESS
[ 53.208 s]
2017-04-26T16:10:56.954 [INFO] Apache Beam :: Runners :: Core Java ................ SUCCESS
[01:56 min]
2017-04-26T16:10:56.954 [INFO] Apache Beam :: Runners :: Direct Java .............. SUCCESS
[06:16 min]
2017-04-26T16:10:56.954 [INFO] Apache Beam :: SDKs :: Java :: IO :: Elasticsearch . SUCCESS
[ 59.341 s]
2017-04-26T16:10:56.954 [INFO] Apache Beam :: SDKs :: Java :: Extensions .......... SUCCESS
[  5.242 s]
2017-04-26T16:10:56.954 [INFO] Apache Beam :: SDKs :: Java :: Extensions :: Google Cloud Platform
Core SUCCESS [ 55.845 s]
2017-04-26T16:10:56.954 [INFO] Apache Beam :: SDKs :: Java :: Extensions :: Protobuf SUCCESS
[ 38.121 s]
2017-04-26T16:10:56.954 [INFO] Apache Beam :: SDKs :: Java :: IO :: Google Cloud Platform
SUCCESS [02:38 min]
2017-04-26T16:10:56.954 [INFO] Apache Beam :: SDKs :: Java :: IO :: Hadoop Common . SUCCESS
[ 33.901 s]
2017-04-26T16:10:56.954 [INFO] Apache Beam :: SDKs :: Java :: IO :: Hadoop ........ SUCCESS
[  5.156 s]
2017-04-26T16:10:56.954 [INFO] Apache Beam :: SDKs :: Java :: IO :: Hadoop :: input-format
SUCCESS [ 35.507 s]
2017-04-26T16:10:56.954 [INFO] Apache Beam :: Runners :: Google Cloud Dataflow .... SUCCESS
[01:20 min]
2017-04-26T16:10:56.954 [INFO] Apache Beam :: SDKs :: Java :: IO :: Hadoop :: jdk1.8-tests
SUCCESS [01:55 min]
2017-04-26T16:10:56.954 [INFO] Apache Beam :: SDKs :: Java :: IO :: HBase ......... SUCCESS
[02:03 min]
2017-04-26T16:10:56.954 [INFO] Apache Beam :: SDKs :: Java :: IO :: HDFS .......... SUCCESS
[ 38.932 s]
2017-04-26T16:10:56.954 [INFO] Apache Beam :: SDKs :: Java :: IO :: JDBC .......... SUCCESS
[ 43.015 s]
2017-04-26T16:10:56.954 [INFO] Apache Beam :: SDKs :: Java :: IO :: JMS ........... SUCCESS
[ 31.637 s]
2017-04-26T16:10:56.954 [INFO] Apache Beam :: SDKs :: Java :: IO :: Kafka ......... SUCCESS
[ 36.739 s]
2017-04-26T16:10:56.954 [INFO] Apache Beam :: SDKs :: Java :: IO :: Kinesis ....... SUCCESS
[ 38.350 s]
2017-04-26T16:10:56.954 [INFO] Apache Beam :: SDKs :: Java :: IO :: MongoDB ....... SUCCESS
[ 55.281 s]
2017-04-26T16:10:56.954 [INFO] Apache Beam :: SDKs :: Java :: IO :: MQTT .......... SUCCESS
[ 57.606 s]
2017-04-26T16:10:56.954 [INFO] Apache Beam :: SDKs :: Java :: IO :: XML ........... SUCCESS
[ 47.329 s]
2017-04-26T16:10:56.955 [INFO] Apache Beam :: SDKs :: Java :: Maven Archetypes .... SUCCESS
[  2.294 s]
2017-04-26T16:10:56.955 [INFO] Apache Beam :: SDKs :: Java :: Maven Archetypes :: Starter
SUCCESS [ 25.379 s]
[JENKINS] Archiving disabled
2017-04-26T16:10:56.955 [INFO] Apache Beam :: SDKs :: Java :: Maven Archetypes :: Examples
FAILURE [ 13.709 s]
2017-04-26T16:10:56.955 [INFO] Apache Beam :: SDKs :: Java :: Maven Archetypes :: Examples
- Java 8 SKIPPED
2017-04-26T16:10:56.955 [INFO] Apache Beam :: SDKs :: Java :: Extensions :: Jackson SKIPPED
2017-04-26T16:10:56.955 [INFO] Apache Beam :: SDKs :: Java :: Extensions :: Join library SKIPPED
2017-04-26T16:10:56.955 [INFO] Apache Beam :: SDKs :: Java :: Extensions :: Sorter  SKIPPED
2017-04-26T16:10:56.955 [INFO] Apache Beam :: SDKs :: Java :: Harness ............. SKIPPED
2017-04-26T16:10:56.955 [INFO] Apache Beam :: SDKs :: Java :: Java 8 Tests ........ SKIPPED
2017-04-26T16:10:56.955 [INFO] Apache Beam :: SDKs :: Python ...................... SKIPPED
2017-04-26T16:10:56.955 [INFO] Apache Beam :: Runners :: Flink .................... SKIPPED
2017-04-26T16:10:56.955 [INFO] Apache Beam :: Runners :: Spark .................... SKIPPED
2017-04-26T16:10:56.955 [INFO] Apache Beam :: Runners :: Apex ..................... SKIPPED
2017-04-26T16:10:56.955 [INFO] Apache Beam :: Examples ............................ SKIPPED
2017-04-26T16:10:56.955 [INFO] Apache Beam :: Examples :: Java .................... SKIPPED
2017-04-26T16:10:56.955 [INFO] Apache Beam :: Examples :: Java 8 .................. SKIPPED
2017-04-26T16:10:56.955 [INFO] Apache Beam :: SDKs :: Java :: Aggregated Javadoc .. SKIPPED
2017-04-26T16:10:56.955 [INFO] ------------------------------------------------------------------------
2017-04-26T16:10:56.955 [INFO] BUILD FAILURE
2017-04-26T16:10:56.955 [INFO] ------------------------------------------------------------------------
2017-04-26T16:10:56.955 [INFO] Total time: 35:15 min
2017-04-26T16:10:56.955 [INFO] Finished at: 2017-04-26T16:10:56+00:00
2017-04-26T16:10:59.181 [INFO] Final Memory: 261M/2255M
2017-04-26T16:10:59.181 [INFO] ------------------------------------------------------------------------
Waiting for Jenkins to finish collecting data
2017-04-26T16:11:06.347 [ERROR] Failed to execute goal org.apache.maven.plugins:maven-archetype-plugin:2.4:integration-test
(default-integration-test) on project beam-sdks-java-maven-archetypes-examples:
2017-04-26T16:11:06.347 [ERROR] Archetype IT 'basic' failed: Execution failure: exit code
= 1
2017-04-26T16:11:06.347 [ERROR] -> [Help 1]
org.apache.maven.lifecycle.LifecycleExecutionException: Failed to execute goal org.apache.maven.plugins:maven-archetype-plugin:2.4:integration-test
(default-integration-test) on project beam-sdks-java-maven-archetypes-examples: 
Archetype IT 'basic' failed: Execution failure: exit code = 1
	at org.apache.maven.lifecycle.internal.MojoExecutor.execute(MojoExecutor.java:216)
	at org.apache.maven.lifecycle.internal.MojoExecutor.execute(MojoExecutor.java:153)
	at org.apache.maven.lifecycle.internal.MojoExecutor.execute(MojoExecutor.java:145)
	at org.apache.maven.lifecycle.internal.LifecycleModuleBuilder.buildProject(LifecycleModuleBuilder.java:116)
	at org.apache.maven.lifecycle.internal.LifecycleModuleBuilder.buildProject(LifecycleModuleBuilder.java:80)
	at org.apache.maven.lifecycle.internal.builder.singlethreaded.SingleThreadedBuilder.build(SingleThreadedBuilder.java:51)
	at org.apache.maven.lifecycle.internal.LifecycleStarter.execute(LifecycleStarter.java:128)
	at org.apache.maven.DefaultMaven.doExecute(DefaultMaven.java:307)
	at org.apache.maven.DefaultMaven.doExecute(DefaultMaven.java:193)
	at org.apache.maven.DefaultMaven.execute(DefaultMaven.java:106)
	at org.jvnet.hudson.maven3.launcher.Maven33Launcher.main(Maven33Launcher.java:129)
	at sun.reflect.NativeMethodAccessorImpl.invoke0(Native Method)
	at sun.reflect.NativeMethodAccessorImpl.invoke(NativeMethodAccessorImpl.java:62)
	at sun.reflect.DelegatingMethodAccessorImpl.invoke(DelegatingMethodAccessorImpl.java:43)
	at java.lang.reflect.Method.invoke(Method.java:498)
	at org.codehaus.plexus.classworlds.launcher.Launcher.launchStandard(Launcher.java:330)
	at org.codehaus.plexus.classworlds.launcher.Launcher.launch(Launcher.java:238)
	at jenkins.maven3.agent.Maven33Main.launch(Maven33Main.java:176)
	at sun.reflect.NativeMethodAccessorImpl.invoke0(Native Method)
	at sun.reflect.NativeMethodAccessorImpl.invoke(NativeMethodAccessorImpl.java:62)
	at sun.reflect.DelegatingMethodAccessorImpl.invoke(DelegatingMethodAccessorImpl.java:43)
	at java.lang.reflect.Method.invoke(Method.java:498)
	at hudson.maven.Maven3Builder.call(Maven3Builder.java:139)
	at hudson.maven.Maven3Builder.call(Maven3Builder.java:70)
	at hudson.remoting.UserRequest.perform(UserRequest.java:153)
	at hudson.remoting.UserRequest.perform(UserRequest.java:50)
	at hudson.remoting.Request$2.run(Request.java:336)
	at hudson.remoting.InterceptingExecutorService$1.call(InterceptingExecutorService.java:68)
	at java.util.concurrent.FutureTask.run(FutureTask.java:266)
	at java.util.concurrent.ThreadPoolExecutor.runWorker(ThreadPoolExecutor.java:1142)
	at java.util.concurrent.ThreadPoolExecutor$Worker.run(ThreadPoolExecutor.java:617)
	at java.lang.Thread.run(Thread.java:745)
Caused by: org.apache.maven.plugin.MojoExecutionException: 
Archetype IT 'basic' failed: Execution failure: exit code = 1
	at org.apache.maven.archetype.mojos.IntegrationTestMojo.execute(IntegrationTestMojo.java:269)
	at org.apache.maven.plugin.DefaultBuildPluginManager.executeMojo(DefaultBuildPluginManager.java:134)
	at org.apache.maven.lifecycle.internal.MojoExecutor.execute(MojoExecutor.java:208)
	... 31 more
2017-04-26T16:11:06.348 [ERROR] 
2017-04-26T16:11:06.348 [ERROR] Re-run Maven using the -X switch to enable full debug logging.
2017-04-26T16:11:06.348 [ERROR] 
2017-04-26T16:11:06.348 [ERROR] For more information about the errors and possible solutions,
please read the following articles:
2017-04-26T16:11:06.348 [ERROR] [Help 1] http://cwiki.apache.org/confluence/display/MAVEN/MojoExecutionException
2017-04-26T16:11:06.348 [ERROR] 
2017-04-26T16:11:06.348 [ERROR] After correcting the problems, you can resume the build with
the command
2017-04-26T16:11:06.348 [ERROR]   mvn <goals> -rf :beam-sdks-java-maven-archetypes-examples
channel stopped

Mime
View raw message