beam-commits mailing list archives

Site index · List index
Message view « Date » · « Thread »
Top « Date » · « Thread »
From Apache Jenkins Server <jenk...@builds.apache.org>
Subject Build failed in Jenkins: beam_PostCommit_Python_Verify #1955
Date Fri, 21 Apr 2017 21:16:50 GMT
See <https://builds.apache.org/job/beam_PostCommit_Python_Verify/1955/display/redirect?page=changes>

Changes:

[lcwik] Validates that input and output GCS paths specify a bucket

------------------------------------------
[...truncated 708.19 KB...]
Collecting setuptools (from pyhamcrest->-r postcommit_requirements.txt (line 1))
Collecting funcsigs>=1 (from mock->-r postcommit_requirements.txt (line 2))
  File was already downloaded /tmp/dataflow-requirements-cache/funcsigs-1.0.2.tar.gz
  File was already downloaded /tmp/dataflow-requirements-cache/setuptools-35.0.1.zip
  File was already downloaded /tmp/dataflow-requirements-cache/setuptools-35.0.1.zip
Collecting pbr>=0.11 (from mock->-r postcommit_requirements.txt (line 2))
  File was already downloaded /tmp/dataflow-requirements-cache/pbr-3.0.0.tar.gz
Collecting six (from pyhamcrest->-r postcommit_requirements.txt (line 1))
  File was already downloaded /tmp/dataflow-requirements-cache/six-1.10.0.tar.gz
Collecting packaging>=16.8 (from setuptools->pyhamcrest->-r postcommit_requirements.txt
(line 1))
  File was already downloaded /tmp/dataflow-requirements-cache/packaging-16.8.tar.gz
Collecting six (from pyhamcrest->-r postcommit_requirements.txt (line 1))
  File was already downloaded /tmp/dataflow-requirements-cache/six-1.10.0.tar.gz
Collecting funcsigs>=1 (from mock->-r postcommit_requirements.txt (line 2))
  File was already downloaded /tmp/dataflow-requirements-cache/funcsigs-1.0.2.tar.gz
Collecting appdirs>=1.4.0 (from setuptools->pyhamcrest->-r postcommit_requirements.txt
(line 1))
Collecting funcsigs>=1 (from mock->-r postcommit_requirements.txt (line 2))
  File was already downloaded /tmp/dataflow-requirements-cache/appdirs-1.4.3.tar.gz
  File was already downloaded /tmp/dataflow-requirements-cache/funcsigs-1.0.2.tar.gz
Collecting pbr>=0.11 (from mock->-r postcommit_requirements.txt (line 2))
  File was already downloaded /tmp/dataflow-requirements-cache/pbr-3.0.0.tar.gz
Collecting pyparsing (from packaging>=16.8->setuptools->pyhamcrest->-r postcommit_requirements.txt
(line 1))
Collecting pbr>=0.11 (from mock->-r postcommit_requirements.txt (line 2))
  File was already downloaded /tmp/dataflow-requirements-cache/pbr-3.0.0.tar.gz
  File was already downloaded /tmp/dataflow-requirements-cache/pyparsing-2.2.0.tar.gz
Collecting packaging>=16.8 (from setuptools->pyhamcrest->-r postcommit_requirements.txt
(line 1))
  File was already downloaded /tmp/dataflow-requirements-cache/packaging-16.8.tar.gz
Collecting packaging>=16.8 (from setuptools->pyhamcrest->-r postcommit_requirements.txt
(line 1))
  File was already downloaded /tmp/dataflow-requirements-cache/packaging-16.8.tar.gz
Successfully downloaded pyhamcrest mock setuptools six funcsigs pbr packaging appdirs pyparsing
Collecting appdirs>=1.4.0 (from setuptools->pyhamcrest->-r postcommit_requirements.txt
(line 1))
  File was already downloaded /tmp/dataflow-requirements-cache/appdirs-1.4.3.tar.gz
Collecting pyparsing (from packaging>=16.8->setuptools->pyhamcrest->-r postcommit_requirements.txt
(line 1))
Collecting appdirs>=1.4.0 (from setuptools->pyhamcrest->-r postcommit_requirements.txt
(line 1))
  File was already downloaded /tmp/dataflow-requirements-cache/appdirs-1.4.3.tar.gz
  File was already downloaded /tmp/dataflow-requirements-cache/pyparsing-2.2.0.tar.gz
Collecting pyparsing (from packaging>=16.8->setuptools->pyhamcrest->-r postcommit_requirements.txt
(line 1))
  File was already downloaded /tmp/dataflow-requirements-cache/pyparsing-2.2.0.tar.gz
Successfully downloaded pyhamcrest mock setuptools six funcsigs pbr packaging appdirs pyparsing
Successfully downloaded pyhamcrest mock setuptools six funcsigs pbr packaging appdirs pyparsing
test_multiple_empty_outputs (apache_beam.transforms.ptransform_test.PTransformTest) ... ok
<https://builds.apache.org/job/beam_PostCommit_Python_Verify/ws/sdks/python/apache_beam/coders/typecoders.py>:132:
UserWarning: Using fallback coder for typehint: List[Any].
  warnings.warn('Using fallback coder for typehint: %r.' % typehint)
<https://builds.apache.org/job/beam_PostCommit_Python_Verify/ws/sdks/python/apache_beam/coders/typecoders.py>:132:
UserWarning: Using fallback coder for typehint: Union[].
  warnings.warn('Using fallback coder for typehint: %r.' % typehint)
DEPRECATION: pip install --download has been deprecated and will be removed in the future.
Pip now has a download command that should be used instead.
Collecting pyhamcrest (from -r postcommit_requirements.txt (line 1))
  File was already downloaded /tmp/dataflow-requirements-cache/PyHamcrest-1.9.0.tar.gz
Collecting mock (from -r postcommit_requirements.txt (line 2))
  File was already downloaded /tmp/dataflow-requirements-cache/mock-2.0.0.tar.gz
Collecting setuptools (from pyhamcrest->-r postcommit_requirements.txt (line 1))
  File was already downloaded /tmp/dataflow-requirements-cache/setuptools-35.0.1.zip
Collecting six (from pyhamcrest->-r postcommit_requirements.txt (line 1))
  File was already downloaded /tmp/dataflow-requirements-cache/six-1.10.0.tar.gz
Collecting funcsigs>=1 (from mock->-r postcommit_requirements.txt (line 2))
  File was already downloaded /tmp/dataflow-requirements-cache/funcsigs-1.0.2.tar.gz
Collecting pbr>=0.11 (from mock->-r postcommit_requirements.txt (line 2))
  File was already downloaded /tmp/dataflow-requirements-cache/pbr-3.0.0.tar.gz
Collecting packaging>=16.8 (from setuptools->pyhamcrest->-r postcommit_requirements.txt
(line 1))
  File was already downloaded /tmp/dataflow-requirements-cache/packaging-16.8.tar.gz
Collecting appdirs>=1.4.0 (from setuptools->pyhamcrest->-r postcommit_requirements.txt
(line 1))
  File was already downloaded /tmp/dataflow-requirements-cache/appdirs-1.4.3.tar.gz
Collecting pyparsing (from packaging>=16.8->setuptools->pyhamcrest->-r postcommit_requirements.txt
(line 1))
  File was already downloaded /tmp/dataflow-requirements-cache/pyparsing-2.2.0.tar.gz
Successfully downloaded pyhamcrest mock setuptools six funcsigs pbr packaging appdirs pyparsing
test_as_singleton_with_different_defaults (apache_beam.transforms.sideinputs_test.SideInputsTest)
... ok
DEPRECATION: pip install --download has been deprecated and will be removed in the future.
Pip now has a download command that should be used instead.
Collecting pyhamcrest (from -r postcommit_requirements.txt (line 1))
<https://builds.apache.org/job/beam_PostCommit_Python_Verify/ws/sdks/python/local/lib/python2.7/site-packages/pip/_vendor/requests/packages/urllib3/util/ssl_.py>:318:
SNIMissingWarning: An HTTPS request has been made, but the SNI (Subject Name Indication) extension
to TLS is not available on this platform. This may cause the server to present an incorrect
TLS certificate, which can cause validation failures. You can upgrade to a newer version of
Python to solve this. For more information, see https://urllib3.readthedocs.io/en/latest/security.html#snimissingwarning.
  SNIMissingWarning
<https://builds.apache.org/job/beam_PostCommit_Python_Verify/ws/sdks/python/local/lib/python2.7/site-packages/pip/_vendor/requests/packages/urllib3/util/ssl_.py>:122:
InsecurePlatformWarning: A true SSLContext object is not available. This prevents urllib3
from configuring SSL appropriately and may cause certain SSL connections to fail. You can
upgrade to a newer version of Python to solve this. For more information, see https://urllib3.readthedocs.io/en/latest/security.html#insecureplatformwarning.
  InsecurePlatformWarning
  File was already downloaded /tmp/dataflow-requirements-cache/PyHamcrest-1.9.0.tar.gz
Collecting mock (from -r postcommit_requirements.txt (line 2))
  File was already downloaded /tmp/dataflow-requirements-cache/mock-2.0.0.tar.gz
Collecting setuptools (from pyhamcrest->-r postcommit_requirements.txt (line 1))
  File was already downloaded /tmp/dataflow-requirements-cache/setuptools-35.0.1.zip
Collecting six (from pyhamcrest->-r postcommit_requirements.txt (line 1))
  File was already downloaded /tmp/dataflow-requirements-cache/six-1.10.0.tar.gz
Collecting funcsigs>=1 (from mock->-r postcommit_requirements.txt (line 2))
  File was already downloaded /tmp/dataflow-requirements-cache/funcsigs-1.0.2.tar.gz
Collecting pbr>=0.11 (from mock->-r postcommit_requirements.txt (line 2))
  File was already downloaded /tmp/dataflow-requirements-cache/pbr-3.0.0.tar.gz
Collecting packaging>=16.8 (from setuptools->pyhamcrest->-r postcommit_requirements.txt
(line 1))
  File was already downloaded /tmp/dataflow-requirements-cache/packaging-16.8.tar.gz
Collecting appdirs>=1.4.0 (from setuptools->pyhamcrest->-r postcommit_requirements.txt
(line 1))
  File was already downloaded /tmp/dataflow-requirements-cache/appdirs-1.4.3.tar.gz
Collecting pyparsing (from packaging>=16.8->setuptools->pyhamcrest->-r postcommit_requirements.txt
(line 1))
  File was already downloaded /tmp/dataflow-requirements-cache/pyparsing-2.2.0.tar.gz
Successfully downloaded pyhamcrest mock setuptools six funcsigs pbr packaging appdirs pyparsing
test_as_dict_twice (apache_beam.transforms.sideinputs_test.SideInputsTest) ... ok
test_as_list_and_as_dict_side_inputs (apache_beam.transforms.sideinputs_test.SideInputsTest)
... ok
DEPRECATION: pip install --download has been deprecated and will be removed in the future.
Pip now has a download command that should be used instead.
Collecting pyhamcrest (from -r postcommit_requirements.txt (line 1))
  File was already downloaded /tmp/dataflow-requirements-cache/PyHamcrest-1.9.0.tar.gz
DEPRECATION: pip install --download has been deprecated and will be removed in the future.
Pip now has a download command that should be used instead.
Collecting pyhamcrest (from -r postcommit_requirements.txt (line 1))
  File was already downloaded /tmp/dataflow-requirements-cache/PyHamcrest-1.9.0.tar.gz
Collecting mock (from -r postcommit_requirements.txt (line 2))
  File was already downloaded /tmp/dataflow-requirements-cache/mock-2.0.0.tar.gz
Collecting mock (from -r postcommit_requirements.txt (line 2))
  File was already downloaded /tmp/dataflow-requirements-cache/mock-2.0.0.tar.gz
Collecting setuptools (from pyhamcrest->-r postcommit_requirements.txt (line 1))
Collecting setuptools (from pyhamcrest->-r postcommit_requirements.txt (line 1))
  File was already downloaded /tmp/dataflow-requirements-cache/setuptools-35.0.1.zip
  File was already downloaded /tmp/dataflow-requirements-cache/setuptools-35.0.1.zip
Collecting six (from pyhamcrest->-r postcommit_requirements.txt (line 1))
  File was already downloaded /tmp/dataflow-requirements-cache/six-1.10.0.tar.gz
Collecting six (from pyhamcrest->-r postcommit_requirements.txt (line 1))
  File was already downloaded /tmp/dataflow-requirements-cache/six-1.10.0.tar.gz
Collecting funcsigs>=1 (from mock->-r postcommit_requirements.txt (line 2))
  File was already downloaded /tmp/dataflow-requirements-cache/funcsigs-1.0.2.tar.gz
Collecting funcsigs>=1 (from mock->-r postcommit_requirements.txt (line 2))
  File was already downloaded /tmp/dataflow-requirements-cache/funcsigs-1.0.2.tar.gz
Collecting pbr>=0.11 (from mock->-r postcommit_requirements.txt (line 2))
  File was already downloaded /tmp/dataflow-requirements-cache/pbr-3.0.0.tar.gz
Collecting pbr>=0.11 (from mock->-r postcommit_requirements.txt (line 2))
  File was already downloaded /tmp/dataflow-requirements-cache/pbr-3.0.0.tar.gz
Collecting packaging>=16.8 (from setuptools->pyhamcrest->-r postcommit_requirements.txt
(line 1))
  File was already downloaded /tmp/dataflow-requirements-cache/packaging-16.8.tar.gz
Collecting packaging>=16.8 (from setuptools->pyhamcrest->-r postcommit_requirements.txt
(line 1))
  File was already downloaded /tmp/dataflow-requirements-cache/packaging-16.8.tar.gz
Collecting appdirs>=1.4.0 (from setuptools->pyhamcrest->-r postcommit_requirements.txt
(line 1))
  File was already downloaded /tmp/dataflow-requirements-cache/appdirs-1.4.3.tar.gz
Collecting appdirs>=1.4.0 (from setuptools->pyhamcrest->-r postcommit_requirements.txt
(line 1))
  File was already downloaded /tmp/dataflow-requirements-cache/appdirs-1.4.3.tar.gz
Collecting pyparsing (from packaging>=16.8->setuptools->pyhamcrest->-r postcommit_requirements.txt
(line 1))
  File was already downloaded /tmp/dataflow-requirements-cache/pyparsing-2.2.0.tar.gz
Collecting pyparsing (from packaging>=16.8->setuptools->pyhamcrest->-r postcommit_requirements.txt
(line 1))
  File was already downloaded /tmp/dataflow-requirements-cache/pyparsing-2.2.0.tar.gz
Successfully downloaded pyhamcrest mock setuptools six funcsigs pbr packaging appdirs pyparsing
Successfully downloaded pyhamcrest mock setuptools six funcsigs pbr packaging appdirs pyparsing
test_as_list_twice (apache_beam.transforms.sideinputs_test.SideInputsTest) ... ok
DEPRECATION: pip install --download has been deprecated and will be removed in the future.
Pip now has a download command that should be used instead.
Collecting pyhamcrest (from -r postcommit_requirements.txt (line 1))
  File was already downloaded /tmp/dataflow-requirements-cache/PyHamcrest-1.9.0.tar.gz
Collecting mock (from -r postcommit_requirements.txt (line 2))
  File was already downloaded /tmp/dataflow-requirements-cache/mock-2.0.0.tar.gz
Collecting setuptools (from pyhamcrest->-r postcommit_requirements.txt (line 1))
  File was already downloaded /tmp/dataflow-requirements-cache/setuptools-35.0.1.zip
Collecting six (from pyhamcrest->-r postcommit_requirements.txt (line 1))
  File was already downloaded /tmp/dataflow-requirements-cache/six-1.10.0.tar.gz
Collecting funcsigs>=1 (from mock->-r postcommit_requirements.txt (line 2))
  File was already downloaded /tmp/dataflow-requirements-cache/funcsigs-1.0.2.tar.gz
Collecting pbr>=0.11 (from mock->-r postcommit_requirements.txt (line 2))
  File was already downloaded /tmp/dataflow-requirements-cache/pbr-3.0.0.tar.gz
Collecting packaging>=16.8 (from setuptools->pyhamcrest->-r postcommit_requirements.txt
(line 1))
  File was already downloaded /tmp/dataflow-requirements-cache/packaging-16.8.tar.gz
Collecting appdirs>=1.4.0 (from setuptools->pyhamcrest->-r postcommit_requirements.txt
(line 1))
  File was already downloaded /tmp/dataflow-requirements-cache/appdirs-1.4.3.tar.gz
Collecting pyparsing (from packaging>=16.8->setuptools->pyhamcrest->-r postcommit_requirements.txt
(line 1))
  File was already downloaded /tmp/dataflow-requirements-cache/pyparsing-2.2.0.tar.gz
Successfully downloaded pyhamcrest mock setuptools six funcsigs pbr packaging appdirs pyparsing
test_as_singleton_without_unique_labels (apache_beam.transforms.sideinputs_test.SideInputsTest)
... ok
test_empty_singleton_side_input (apache_beam.transforms.sideinputs_test.SideInputsTest) ...
ok
DEPRECATION: pip install --download has been deprecated and will be removed in the future.
Pip now has a download command that should be used instead.
Collecting pyhamcrest (from -r postcommit_requirements.txt (line 1))
  File was already downloaded /tmp/dataflow-requirements-cache/PyHamcrest-1.9.0.tar.gz
Collecting mock (from -r postcommit_requirements.txt (line 2))
  File was already downloaded /tmp/dataflow-requirements-cache/mock-2.0.0.tar.gz
Collecting setuptools (from pyhamcrest->-r postcommit_requirements.txt (line 1))
  File was already downloaded /tmp/dataflow-requirements-cache/setuptools-35.0.1.zip
DEPRECATION: pip install --download has been deprecated and will be removed in the future.
Pip now has a download command that should be used instead.
Collecting pyhamcrest (from -r postcommit_requirements.txt (line 1))
Collecting six (from pyhamcrest->-r postcommit_requirements.txt (line 1))
  File was already downloaded /tmp/dataflow-requirements-cache/PyHamcrest-1.9.0.tar.gz
  File was already downloaded /tmp/dataflow-requirements-cache/six-1.10.0.tar.gz
Collecting funcsigs>=1 (from mock->-r postcommit_requirements.txt (line 2))
  File was already downloaded /tmp/dataflow-requirements-cache/funcsigs-1.0.2.tar.gz
Collecting mock (from -r postcommit_requirements.txt (line 2))
  File was already downloaded /tmp/dataflow-requirements-cache/mock-2.0.0.tar.gz
Collecting pbr>=0.11 (from mock->-r postcommit_requirements.txt (line 2))
  File was already downloaded /tmp/dataflow-requirements-cache/pbr-3.0.0.tar.gz
Collecting setuptools (from pyhamcrest->-r postcommit_requirements.txt (line 1))
Collecting packaging>=16.8 (from setuptools->pyhamcrest->-r postcommit_requirements.txt
(line 1))
  File was already downloaded /tmp/dataflow-requirements-cache/packaging-16.8.tar.gz
  File was already downloaded /tmp/dataflow-requirements-cache/setuptools-35.0.1.zip
test_default_value_singleton_side_input (apache_beam.transforms.sideinputs_test.SideInputsTest)
... ok
Collecting appdirs>=1.4.0 (from setuptools->pyhamcrest->-r postcommit_requirements.txt
(line 1))
  File was already downloaded /tmp/dataflow-requirements-cache/appdirs-1.4.3.tar.gz
Collecting pyparsing (from packaging>=16.8->setuptools->pyhamcrest->-r postcommit_requirements.txt
(line 1))
Collecting six (from pyhamcrest->-r postcommit_requirements.txt (line 1))
  File was already downloaded /tmp/dataflow-requirements-cache/six-1.10.0.tar.gz
  File was already downloaded /tmp/dataflow-requirements-cache/pyparsing-2.2.0.tar.gz
Collecting funcsigs>=1 (from mock->-r postcommit_requirements.txt (line 2))
  File was already downloaded /tmp/dataflow-requirements-cache/funcsigs-1.0.2.tar.gz
Successfully downloaded pyhamcrest mock setuptools six funcsigs pbr packaging appdirs pyparsing
Collecting pbr>=0.11 (from mock->-r postcommit_requirements.txt (line 2))
  File was already downloaded /tmp/dataflow-requirements-cache/pbr-3.0.0.tar.gz
Collecting packaging>=16.8 (from setuptools->pyhamcrest->-r postcommit_requirements.txt
(line 1))
  File was already downloaded /tmp/dataflow-requirements-cache/packaging-16.8.tar.gz
Collecting appdirs>=1.4.0 (from setuptools->pyhamcrest->-r postcommit_requirements.txt
(line 1))
  File was already downloaded /tmp/dataflow-requirements-cache/appdirs-1.4.3.tar.gz
Collecting pyparsing (from packaging>=16.8->setuptools->pyhamcrest->-r postcommit_requirements.txt
(line 1))
  File was already downloaded /tmp/dataflow-requirements-cache/pyparsing-2.2.0.tar.gz
Successfully downloaded pyhamcrest mock setuptools six funcsigs pbr packaging appdirs pyparsing
test_flattened_side_input (apache_beam.transforms.sideinputs_test.SideInputsTest) ... ok
test_iterable_side_input (apache_beam.transforms.sideinputs_test.SideInputsTest) ... ok
Found: https://console.cloud.google.com/dataflow/job/2017-04-21_13_48_38-15171245919040968709?project=apache-beam-testing
Found: https://console.cloud.google.com/dataflow/job/2017-04-21_13_54_54-8357200140933170619?project=apache-beam-testing
Found: https://console.cloud.google.com/dataflow/job/2017-04-21_14_01_14-845600991365351559?project=apache-beam-testing
Found: https://console.cloud.google.com/dataflow/job/2017-04-21_14_07_00-17795274849040450619?project=apache-beam-testing
test_multi_valued_singleton_side_input (apache_beam.transforms.sideinputs_test.SideInputsTest)
... ERROR

======================================================================
ERROR: test_multi_valued_singleton_side_input (apache_beam.transforms.sideinputs_test.SideInputsTest)
----------------------------------------------------------------------
Traceback (most recent call last):
  File "<https://builds.apache.org/job/beam_PostCommit_Python_Verify/ws/sdks/python/nose-1.3.7-py2.7.egg/nose/plugins/multiprocess.py",>
line 812, in run
    test(orig)
  File "<https://builds.apache.org/job/beam_PostCommit_Python_Verify/ws/sdks/python/nose-1.3.7-py2.7.egg/nose/case.py",>
line 45, in __call__
    return self.run(*arg, **kwarg)
  File "<https://builds.apache.org/job/beam_PostCommit_Python_Verify/ws/sdks/python/nose-1.3.7-py2.7.egg/nose/case.py",>
line 133, in run
    self.runTest(result)
  File "<https://builds.apache.org/job/beam_PostCommit_Python_Verify/ws/sdks/python/nose-1.3.7-py2.7.egg/nose/case.py",>
line 151, in runTest
    test(result)
  File "/usr/lib/python2.7/unittest/case.py", line 395, in __call__
    return self.run(*args, **kwds)
  File "/usr/lib/python2.7/unittest/case.py", line 331, in run
    testMethod()
  File "<https://builds.apache.org/job/beam_PostCommit_Python_Verify/ws/sdks/python/apache_beam/transforms/sideinputs_test.py",>
line 156, in test_multi_valued_singleton_side_input
    pipeline.run()
  File "<https://builds.apache.org/job/beam_PostCommit_Python_Verify/ws/sdks/python/apache_beam/test_pipeline.py",>
line 91, in run
    result = super(TestPipeline, self).run()
  File "<https://builds.apache.org/job/beam_PostCommit_Python_Verify/ws/sdks/python/apache_beam/pipeline.py",>
line 169, in run
    return self.runner.run(self)
  File "<https://builds.apache.org/job/beam_PostCommit_Python_Verify/ws/sdks/python/apache_beam/runners/dataflow/test_dataflow_runner.py",>
line 44, in run
    self.result.wait_until_finish()
  File "<https://builds.apache.org/job/beam_PostCommit_Python_Verify/ws/sdks/python/apache_beam/runners/dataflow/dataflow_runner.py",>
line 767, in wait_until_finish
    time.sleep(5.0)
  File "<https://builds.apache.org/job/beam_PostCommit_Python_Verify/ws/sdks/python/nose-1.3.7-py2.7.egg/nose/plugins/multiprocess.py",>
line 276, in signalhandler
    raise TimedOutException()
TimedOutException: 'test_multi_valued_singleton_side_input (apache_beam.transforms.sideinputs_test.SideInputsTest)'

----------------------------------------------------------------------
Ran 14 tests in 1706.591s

FAILED (errors=1)
Found: https://console.cloud.google.com/dataflow/job/2017-04-21_13_48_37-9696471327646999687?project=apache-beam-testing
Found: https://console.cloud.google.com/dataflow/job/2017-04-21_13_55_13-4635423114634230182?project=apache-beam-testing
Found: https://console.cloud.google.com/dataflow/job/2017-04-21_14_00_48-10163370272219784771?project=apache-beam-testing
Found: https://console.cloud.google.com/dataflow/job/2017-04-21_14_06_58-5603983664628050934?project=apache-beam-testing
Found: https://console.cloud.google.com/dataflow/job/2017-04-21_13_48_37-12538096327863509903?project=apache-beam-testing
Found: https://console.cloud.google.com/dataflow/job/2017-04-21_13_54_54-1696440827163490311?project=apache-beam-testing
Found: https://console.cloud.google.com/dataflow/job/2017-04-21_14_01_13-14500564637643588314?project=apache-beam-testing
Found: https://console.cloud.google.com/dataflow/job/2017-04-21_13_48_37-5704511293371569934?project=apache-beam-testing
Found: https://console.cloud.google.com/dataflow/job/2017-04-21_13_54_54-4028390419690024828?project=apache-beam-testing
Found: https://console.cloud.google.com/dataflow/job/2017-04-21_14_01_24-10505284617627961775?project=apache-beam-testing
Build step 'Execute shell' marked build as failure

Mime
View raw message