beam-commits mailing list archives

Site index · List index
Message view « Date » · « Thread »
Top « Date » · « Thread »
From Apache Jenkins Server <jenk...@builds.apache.org>
Subject Build failed in Jenkins: beam_PostCommit_Java_ValidatesRunner_Flink #2215
Date Thu, 06 Apr 2017 01:31:30 GMT
See <https://builds.apache.org/job/beam_PostCommit_Java_ValidatesRunner_Flink/2215/display/redirect?page=changes>

Changes:

[dhalperi] DataflowPipelineJob: handle concurrent cancel and finish

------------------------------------------
[...truncated 682.39 KB...]
2017-04-06T01:31:11.277 [INFO] --- maven-site-plugin:3.5.1:attach-descriptor (attach-descriptor)
@ beam-sdks-java-core ---
2017-04-06T01:31:11.378 [INFO] 
2017-04-06T01:31:11.378 [INFO] --- maven-jar-plugin:3.0.2:test-jar (default-test-jar) @ beam-sdks-java-core
---
2017-04-06T01:31:11.512 [INFO] Building jar: <https://builds.apache.org/job/beam_PostCommit_Java_ValidatesRunner_Flink/ws/sdks/java/core/target/beam-sdks-java-core-0.7.0-SNAPSHOT-tests.jar>
2017-04-06T01:31:11.632 [INFO] 
2017-04-06T01:31:11.632 [INFO] --- maven-shade-plugin:3.0.0:shade (bundle-and-repackage) @
beam-sdks-java-core ---
2017-04-06T01:31:11.635 [INFO] Excluding org.apache.beam:beam-sdks-common-runner-api:jar:0.7.0-SNAPSHOT
from the shaded jar.
2017-04-06T01:31:11.635 [INFO] Excluding io.grpc:grpc-auth:jar:1.2.0 from the shaded jar.
2017-04-06T01:31:11.635 [INFO] Excluding io.grpc:grpc-core:jar:1.2.0 from the shaded jar.
2017-04-06T01:31:11.635 [INFO] Excluding com.google.errorprone:error_prone_annotations:jar:2.0.15
from the shaded jar.
2017-04-06T01:31:11.635 [INFO] Excluding io.grpc:grpc-context:jar:1.2.0 from the shaded jar.
2017-04-06T01:31:11.635 [INFO] Excluding com.google.instrumentation:instrumentation-api:jar:0.3.0
from the shaded jar.
2017-04-06T01:31:11.635 [INFO] Excluding io.grpc:grpc-netty:jar:1.2.0 from the shaded jar.
2017-04-06T01:31:11.635 [INFO] Excluding io.netty:netty-codec-http2:jar:4.1.8.Final from the
shaded jar.
2017-04-06T01:31:11.635 [INFO] Excluding io.netty:netty-codec-http:jar:4.1.8.Final from the
shaded jar.
2017-04-06T01:31:11.635 [INFO] Excluding io.netty:netty-handler-proxy:jar:4.1.8.Final from
the shaded jar.
2017-04-06T01:31:11.635 [INFO] Excluding io.netty:netty-codec-socks:jar:4.1.8.Final from the
shaded jar.
2017-04-06T01:31:11.635 [INFO] Excluding io.grpc:grpc-stub:jar:1.2.0 from the shaded jar.
2017-04-06T01:31:11.635 [INFO] Excluding io.grpc:grpc-all:jar:1.2.0 from the shaded jar.
2017-04-06T01:31:11.635 [INFO] Excluding io.grpc:grpc-okhttp:jar:1.2.0 from the shaded jar.
2017-04-06T01:31:11.635 [INFO] Excluding com.squareup.okhttp:okhttp:jar:2.5.0 from the shaded
jar.
2017-04-06T01:31:11.635 [INFO] Excluding com.squareup.okio:okio:jar:1.6.0 from the shaded
jar.
2017-04-06T01:31:11.635 [INFO] Excluding io.grpc:grpc-protobuf-lite:jar:1.2.0 from the shaded
jar.
2017-04-06T01:31:11.635 [INFO] Excluding io.grpc:grpc-protobuf-nano:jar:1.2.0 from the shaded
jar.
2017-04-06T01:31:11.635 [INFO] Excluding com.google.protobuf.nano:protobuf-javanano:jar:3.0.0-alpha-5
from the shaded jar.
2017-04-06T01:31:11.635 [INFO] Excluding io.grpc:grpc-protobuf:jar:1.2.0 from the shaded jar.
2017-04-06T01:31:11.635 [INFO] Excluding com.google.protobuf:protobuf-java-util:jar:3.2.0
from the shaded jar.
2017-04-06T01:31:11.635 [INFO] Excluding com.google.code.gson:gson:jar:2.7 from the shaded
jar.
2017-04-06T01:31:11.635 [INFO] Excluding com.google.auth:google-auth-library-credentials:jar:0.6.0
from the shaded jar.
2017-04-06T01:31:11.635 [INFO] Excluding com.google.auth:google-auth-library-oauth2-http:jar:0.6.0
from the shaded jar.
2017-04-06T01:31:11.635 [INFO] Excluding io.netty:netty-handler:jar:4.1.8.Final from the shaded
jar.
2017-04-06T01:31:11.635 [INFO] Excluding io.netty:netty-buffer:jar:4.1.8.Final from the shaded
jar.
2017-04-06T01:31:11.635 [INFO] Excluding io.netty:netty-common:jar:4.1.8.Final from the shaded
jar.
2017-04-06T01:31:11.635 [INFO] Excluding io.netty:netty-transport:jar:4.1.8.Final from the
shaded jar.
2017-04-06T01:31:11.635 [INFO] Excluding io.netty:netty-resolver:jar:4.1.8.Final from the
shaded jar.
2017-04-06T01:31:11.635 [INFO] Excluding io.netty:netty-codec:jar:4.1.8.Final from the shaded
jar.
2017-04-06T01:31:11.635 [INFO] Excluding com.google.api.grpc:grpc-google-pubsub-v1:jar:0.1.0
from the shaded jar.
2017-04-06T01:31:11.635 [INFO] Excluding com.google.api.grpc:grpc-google-common-protos:jar:0.1.0
from the shaded jar.
2017-04-06T01:31:11.635 [INFO] Excluding com.google.api.grpc:grpc-google-iam-v1:jar:0.1.0
from the shaded jar.
2017-04-06T01:31:11.635 [INFO] Excluding com.google.api-client:google-api-client:jar:1.22.0
from the shaded jar.
2017-04-06T01:31:11.635 [INFO] Excluding com.google.apis:google-api-services-bigquery:jar:v2-rev295-1.22.0
from the shaded jar.
2017-04-06T01:31:11.635 [INFO] Excluding com.google.apis:google-api-services-cloudresourcemanager:jar:v1-rev6-1.22.0
from the shaded jar.
2017-04-06T01:31:11.635 [INFO] Excluding com.google.apis:google-api-services-pubsub:jar:v1-rev10-1.22.0
from the shaded jar.
2017-04-06T01:31:11.635 [INFO] Excluding com.google.apis:google-api-services-storage:jar:v1-rev71-1.22.0
from the shaded jar.
2017-04-06T01:31:11.635 [INFO] Excluding com.google.http-client:google-http-client:jar:1.22.0
from the shaded jar.
2017-04-06T01:31:11.635 [INFO] Excluding org.apache.httpcomponents:httpclient:jar:4.0.1 from
the shaded jar.
2017-04-06T01:31:11.635 [INFO] Excluding org.apache.httpcomponents:httpcore:jar:4.0.1 from
the shaded jar.
2017-04-06T01:31:11.635 [INFO] Excluding commons-logging:commons-logging:jar:1.1.1 from the
shaded jar.
2017-04-06T01:31:11.635 [INFO] Excluding commons-codec:commons-codec:jar:1.3 from the shaded
jar.
2017-04-06T01:31:11.635 [INFO] Excluding com.google.http-client:google-http-client-jackson:jar:1.22.0
from the shaded jar.
2017-04-06T01:31:11.635 [INFO] Excluding com.google.http-client:google-http-client-jackson2:jar:1.22.0
from the shaded jar.
2017-04-06T01:31:11.635 [INFO] Excluding com.google.http-client:google-http-client-protobuf:jar:1.22.0
from the shaded jar.
2017-04-06T01:31:11.635 [INFO] Excluding com.google.oauth-client:google-oauth-client:jar:1.22.0
from the shaded jar.
2017-04-06T01:31:11.635 [INFO] Excluding com.google.cloud.bigdataoss:gcsio:jar:1.4.5 from
the shaded jar.
2017-04-06T01:31:11.636 [INFO] Excluding com.google.api-client:google-api-client-java6:jar:1.22.0
from the shaded jar.
2017-04-06T01:31:11.636 [INFO] Excluding com.google.api-client:google-api-client-jackson2:jar:1.22.0
from the shaded jar.
2017-04-06T01:31:11.636 [INFO] Excluding com.google.oauth-client:google-oauth-client-java6:jar:1.22.0
from the shaded jar.
2017-04-06T01:31:11.636 [INFO] Excluding com.google.cloud.bigdataoss:util:jar:1.4.5 from the
shaded jar.
2017-04-06T01:31:11.636 [INFO] Including com.google.guava:guava:jar:20.0 in the shaded jar.
2017-04-06T01:31:11.636 [INFO] Excluding com.google.protobuf:protobuf-java:jar:3.2.0 from
the shaded jar.
2017-04-06T01:31:11.636 [INFO] Excluding com.google.code.findbugs:jsr305:jar:3.0.1 from the
shaded jar.
2017-04-06T01:31:11.636 [INFO] Excluding com.fasterxml.jackson.core:jackson-core:jar:2.7.2
from the shaded jar.
2017-04-06T01:31:11.636 [INFO] Excluding com.fasterxml.jackson.core:jackson-annotations:jar:2.7.2
from the shaded jar.
2017-04-06T01:31:11.636 [INFO] Excluding com.fasterxml.jackson.core:jackson-databind:jar:2.7.2
from the shaded jar.
2017-04-06T01:31:11.636 [INFO] Excluding org.slf4j:slf4j-api:jar:1.7.14 from the shaded jar.
2017-04-06T01:31:11.636 [INFO] Excluding net.bytebuddy:byte-buddy:jar:1.6.8 from the shaded
jar.
2017-04-06T01:31:11.636 [INFO] Excluding org.apache.avro:avro:jar:1.8.1 from the shaded jar.
2017-04-06T01:31:11.636 [INFO] Excluding org.codehaus.jackson:jackson-core-asl:jar:1.9.13
from the shaded jar.
2017-04-06T01:31:11.636 [INFO] Excluding org.codehaus.jackson:jackson-mapper-asl:jar:1.9.13
from the shaded jar.
2017-04-06T01:31:11.636 [INFO] Excluding com.thoughtworks.paranamer:paranamer:jar:2.7 from
the shaded jar.
2017-04-06T01:31:11.636 [INFO] Excluding org.xerial.snappy:snappy-java:jar:1.1.2.1 from the
shaded jar.
2017-04-06T01:31:11.636 [INFO] Excluding org.apache.commons:commons-compress:jar:1.9 from
the shaded jar.
2017-04-06T01:31:11.636 [INFO] Excluding org.apache.commons:commons-lang3:jar:3.5 from the
shaded jar.
2017-04-06T01:31:11.636 [INFO] Excluding joda-time:joda-time:jar:2.4 from the shaded jar.
2017-04-06T01:31:11.636 [INFO] Excluding org.codehaus.woodstox:stax2-api:jar:3.1.4 from the
shaded jar.
2017-04-06T01:31:11.636 [INFO] Excluding org.codehaus.woodstox:woodstox-core-asl:jar:4.4.1
from the shaded jar.
2017-04-06T01:31:11.636 [INFO] Excluding org.tukaani:xz:jar:1.5 from the shaded jar.
2017-04-06T01:31:11.636 [INFO] Excluding com.google.auto.service:auto-service:jar:1.0-rc2
from the shaded jar.
2017-04-06T01:31:11.636 [INFO] Excluding com.google.auto:auto-common:jar:0.3 from the shaded
jar.
2017-04-06T01:31:13.153 [INFO] Replacing original artifact with shaded artifact.
2017-04-06T01:31:13.153 [INFO] Replacing <https://builds.apache.org/job/beam_PostCommit_Java_ValidatesRunner_Flink/ws/sdks/java/core/target/beam-sdks-java-core-0.7.0-SNAPSHOT.jar>
with <https://builds.apache.org/job/beam_PostCommit_Java_ValidatesRunner_Flink/ws/sdks/java/core/target/beam-sdks-java-core-0.7.0-SNAPSHOT-shaded.jar>
2017-04-06T01:31:13.154 [INFO] Dependency-reduced POM written at: <https://builds.apache.org/job/beam_PostCommit_Java_ValidatesRunner_Flink/ws/sdks/java/core/dependency-reduced-pom.xml>
2017-04-06T01:31:13.306 [INFO] 
2017-04-06T01:31:13.306 [INFO] --- maven-dependency-plugin:3.0.0:analyze-only (default) @
beam-sdks-java-core ---
2017-04-06T01:31:13.565 [INFO] No dependency problems found
[JENKINS] Archiving disabled
2017-04-06T01:31:14.424 [INFO]                                                           
             
2017-04-06T01:31:14.424 [INFO] ------------------------------------------------------------------------
2017-04-06T01:31:14.424 [INFO] Building Apache Beam :: Runners 0.7.0-SNAPSHOT
2017-04-06T01:31:14.424 [INFO] ------------------------------------------------------------------------
2017-04-06T01:31:14.425 [INFO] 
2017-04-06T01:31:14.426 [INFO] --- maven-clean-plugin:3.0.0:clean (default-clean) @ beam-runners-parent
---
2017-04-06T01:31:14.427 [INFO] Deleting <https://builds.apache.org/job/beam_PostCommit_Java_ValidatesRunner_Flink/ws/runners>
(includes = [**/*.pyc, **/*.egg-info/], excludes = [])
2017-04-06T01:31:14.529 [INFO] 
2017-04-06T01:31:14.529 [INFO] --- maven-enforcer-plugin:1.4.1:enforce (enforce) @ beam-runners-parent
---
2017-04-06T01:31:14.582 [INFO] 
2017-04-06T01:31:14.582 [INFO] --- maven-remote-resources-plugin:1.5:process (process-resource-bundles)
@ beam-runners-parent ---
2017-04-06T01:31:14.644 [INFO] 
2017-04-06T01:31:14.644 [INFO] --- maven-checkstyle-plugin:2.17:check (default) @ beam-runners-parent
---
2017-04-06T01:31:15.006 [INFO] Starting audit...
Audit done.
2017-04-06T01:31:15.093 [INFO] 
2017-04-06T01:31:15.093 [INFO] --- build-helper-maven-plugin:3.0.0:regex-properties (render-artifact-id)
@ beam-runners-parent ---
2017-04-06T01:31:15.144 [INFO] 
2017-04-06T01:31:15.144 [INFO] --- maven-site-plugin:3.5.1:attach-descriptor (attach-descriptor)
@ beam-runners-parent ---
2017-04-06T01:31:15.195 [INFO] 
2017-04-06T01:31:15.195 [INFO] --- maven-shade-plugin:3.0.0:shade (bundle-and-repackage) @
beam-runners-parent ---
2017-04-06T01:31:15.198 [INFO] Replacing original artifact with shaded artifact.
2017-04-06T01:31:15.249 [INFO] 
2017-04-06T01:31:15.249 [INFO] --- maven-dependency-plugin:3.0.0:analyze-only (default) @
beam-runners-parent ---
2017-04-06T01:31:15.249 [INFO] Skipping pom project
[JENKINS] Archiving disabled
2017-04-06T01:31:15.816 [INFO]                                                           
             
2017-04-06T01:31:15.816 [INFO] ------------------------------------------------------------------------
2017-04-06T01:31:15.816 [INFO] Building Apache Beam :: Runners :: Core Java Construction 0.7.0-SNAPSHOT
2017-04-06T01:31:15.816 [INFO] ------------------------------------------------------------------------
2017-04-06T01:31:15.831 [INFO] 
2017-04-06T01:31:15.831 [INFO] --- maven-clean-plugin:3.0.0:clean (default-clean) @ beam-runners-core-construction-java
---
2017-04-06T01:31:15.832 [INFO] Deleting <https://builds.apache.org/job/beam_PostCommit_Java_ValidatesRunner_Flink/ws/runners/core-construction-java>
(includes = [**/*.pyc, **/*.egg-info/], excludes = [])
2017-04-06T01:31:15.921 [INFO] 
2017-04-06T01:31:15.921 [INFO] --- maven-enforcer-plugin:1.4.1:enforce (enforce) @ beam-runners-core-construction-java
---
2017-04-06T01:31:16.377 [INFO] 
2017-04-06T01:31:16.377 [INFO] --- maven-remote-resources-plugin:1.5:process (process-resource-bundles)
@ beam-runners-core-construction-java ---
2017-04-06T01:31:16.785 [INFO] 
2017-04-06T01:31:16.785 [INFO] --- maven-resources-plugin:2.7:resources (default-resources)
@ beam-runners-core-construction-java ---
2017-04-06T01:31:16.786 [INFO] Using 'UTF-8' encoding to copy filtered resources.
2017-04-06T01:31:16.786 [INFO] skip non existing resourceDirectory <https://builds.apache.org/job/beam_PostCommit_Java_ValidatesRunner_Flink/ws/runners/core-construction-java/src/main/resources>
2017-04-06T01:31:16.786 [INFO] Copying 3 resources
2017-04-06T01:31:16.836 [INFO] 
2017-04-06T01:31:16.836 [INFO] --- maven-compiler-plugin:3.6.1:compile (default-compile) @
beam-runners-core-construction-java ---
2017-04-06T01:31:16.840 [INFO] Changes detected - recompiling the module!
2017-04-06T01:31:16.840 [INFO] Compiling 9 source files to <https://builds.apache.org/job/beam_PostCommit_Java_ValidatesRunner_Flink/ws/runners/core-construction-java/target/classes>
2017-04-06T01:31:16.921 [WARNING] bootstrap class path not set in conjunction with -source
1.7
2017-04-06T01:31:16.921 [INFO] <https://builds.apache.org/job/beam_PostCommit_Java_ValidatesRunner_Flink/ws/runners/core-construction-java/src/main/java/org/apache/beam/runners/core/construction/PTransformMatchers.java>:
Some input files use or override a deprecated API.
2017-04-06T01:31:16.921 [INFO] <https://builds.apache.org/job/beam_PostCommit_Java_ValidatesRunner_Flink/ws/runners/core-construction-java/src/main/java/org/apache/beam/runners/core/construction/PTransformMatchers.java>:
Recompile with -Xlint:deprecation for details.
2017-04-06T01:31:16.921 [INFO] <https://builds.apache.org/job/beam_PostCommit_Java_ValidatesRunner_Flink/ws/runners/core-construction-java/src/main/java/org/apache/beam/runners/core/construction/EmptyFlattenAsCreateFactory.java>:
Some input files use unchecked or unsafe operations.
2017-04-06T01:31:16.921 [INFO] <https://builds.apache.org/job/beam_PostCommit_Java_ValidatesRunner_Flink/ws/runners/core-construction-java/src/main/java/org/apache/beam/runners/core/construction/EmptyFlattenAsCreateFactory.java>:
Recompile with -Xlint:unchecked for details.
2017-04-06T01:31:16.971 [INFO] 
2017-04-06T01:31:16.971 [INFO] --- maven-resources-plugin:2.7:testResources (default-testResources)
@ beam-runners-core-construction-java ---
2017-04-06T01:31:16.972 [INFO] Using 'UTF-8' encoding to copy filtered resources.
2017-04-06T01:31:16.972 [INFO] skip non existing resourceDirectory <https://builds.apache.org/job/beam_PostCommit_Java_ValidatesRunner_Flink/ws/runners/core-construction-java/src/test/resources>
2017-04-06T01:31:16.972 [INFO] Copying 3 resources
2017-04-06T01:31:17.022 [INFO] 
2017-04-06T01:31:17.022 [INFO] --- maven-compiler-plugin:3.6.1:testCompile (default-testCompile)
@ beam-runners-core-construction-java ---
2017-04-06T01:31:17.028 [INFO] Changes detected - recompiling the module!
2017-04-06T01:31:17.029 [INFO] Compiling 7 source files to <https://builds.apache.org/job/beam_PostCommit_Java_ValidatesRunner_Flink/ws/runners/core-construction-java/target/test-classes>
2017-04-06T01:31:17.147 [INFO] <https://builds.apache.org/job/beam_PostCommit_Java_ValidatesRunner_Flink/ws/runners/core-construction-java/src/test/java/org/apache/beam/runners/core/construction/PTransformMatchersTest.java>:
<https://builds.apache.org/job/beam_PostCommit_Java_ValidatesRunner_Flink/ws/runners/core-construction-java/src/test/java/org/apache/beam/runners/core/construction/PTransformMatchersTest.java>
uses or overrides a deprecated API.
2017-04-06T01:31:17.147 [INFO] <https://builds.apache.org/job/beam_PostCommit_Java_ValidatesRunner_Flink/ws/runners/core-construction-java/src/test/java/org/apache/beam/runners/core/construction/PTransformMatchersTest.java>:
Recompile with -Xlint:deprecation for details.
2017-04-06T01:31:17.147 [INFO] <https://builds.apache.org/job/beam_PostCommit_Java_ValidatesRunner_Flink/ws/runners/core-construction-java/src/test/java/org/apache/beam/runners/core/construction/UnsupportedOverrideFactoryTest.java>:
Some input files use unchecked or unsafe operations.
2017-04-06T01:31:17.147 [INFO] <https://builds.apache.org/job/beam_PostCommit_Java_ValidatesRunner_Flink/ws/runners/core-construction-java/src/test/java/org/apache/beam/runners/core/construction/UnsupportedOverrideFactoryTest.java>:
Recompile with -Xlint:unchecked for details.
2017-04-06T01:31:17.147 [INFO] -------------------------------------------------------------
2017-04-06T01:31:17.147 [ERROR] COMPILATION ERROR : 
2017-04-06T01:31:17.147 [INFO] -------------------------------------------------------------
2017-04-06T01:31:17.147 [ERROR] <https://builds.apache.org/job/beam_PostCommit_Java_ValidatesRunner_Flink/ws/runners/core-construction-java/src/test/java/org/apache/beam/runners/core/construction/PTransformMatchersTest.java>:[351,69]
<anonymous org.apache.beam.runners.core.construction.PTransformMatchersTest$9> is not
abstract and does not override abstract method getMaterialization() in org.apache.beam.sdk.transforms.ViewFn
2017-04-06T01:31:17.147 [INFO] 1 error
2017-04-06T01:31:17.147 [INFO] -------------------------------------------------------------
[JENKINS] Archiving disabled
[JENKINS] Archiving disabled
[JENKINS] Archiving disabled
[JENKINS] Archiving disabled
[JENKINS] Archiving disabled
[JENKINS] Archiving disabled
[JENKINS] Archiving disabled
[JENKINS] Archiving disabled
[JENKINS] Archiving disabled
[JENKINS] Archiving disabled
[JENKINS] Archiving disabled
[JENKINS] Archiving disabled
[JENKINS] Archiving disabled
[JENKINS] Archiving disabled
2017-04-06T01:31:20.471 [INFO] ------------------------------------------------------------------------
2017-04-06T01:31:20.471 [INFO] Reactor Summary:
2017-04-06T01:31:20.471 [INFO] 
2017-04-06T01:31:20.471 [INFO] Apache Beam :: Parent .............................. SUCCESS
[ 18.283 s]
2017-04-06T01:31:20.471 [INFO] Apache Beam :: SDKs :: Java :: Build Tools ......... SUCCESS
[  9.268 s]
2017-04-06T01:31:20.471 [INFO] Apache Beam :: SDKs ................................ SUCCESS
[  0.949 s]
2017-04-06T01:31:20.472 [INFO] Apache Beam :: SDKs :: Common ...................... SUCCESS
[  0.893 s]
2017-04-06T01:31:20.472 [INFO] Apache Beam :: SDKs :: Common :: Fn API ............ SUCCESS
[  9.718 s]
2017-04-06T01:31:20.472 [INFO] Apache Beam :: SDKs :: Common :: Runner API ........ SUCCESS
[  3.194 s]
2017-04-06T01:31:20.472 [INFO] Apache Beam :: SDKs :: Java ........................ SUCCESS
[  0.941 s]
2017-04-06T01:31:20.472 [INFO] Apache Beam :: SDKs :: Java :: Core ................ SUCCESS
[01:55 min]
2017-04-06T01:31:20.472 [INFO] Apache Beam :: Runners ............................. SUCCESS
[  1.104 s]
2017-04-06T01:31:20.472 [INFO] Apache Beam :: Runners :: Core Java Construction ... FAILURE
[  1.497 s]
2017-04-06T01:31:20.472 [INFO] Apache Beam :: Runners :: Core Java ................ SKIPPED
2017-04-06T01:31:20.472 [INFO] Apache Beam :: Runners :: Flink .................... SKIPPED
2017-04-06T01:31:20.472 [INFO] Apache Beam :: Runners :: Flink :: Core ............ SKIPPED
2017-04-06T01:31:20.472 [INFO] ------------------------------------------------------------------------
2017-04-06T01:31:20.472 [INFO] BUILD FAILURE
2017-04-06T01:31:20.472 [INFO] ------------------------------------------------------------------------
2017-04-06T01:31:20.472 [INFO] Total time: 03:06 min
2017-04-06T01:31:20.472 [INFO] Finished at: 2017-04-06T01:31:20+00:00
2017-04-06T01:31:20.918 [INFO] Final Memory: 180M/1493M
2017-04-06T01:31:20.918 [INFO] ------------------------------------------------------------------------
Waiting for Jenkins to finish collecting data
2017-04-06T01:31:21.069 [ERROR] Failed to execute goal org.apache.maven.plugins:maven-compiler-plugin:3.6.1:testCompile
(default-testCompile) on project beam-runners-core-construction-java: Compilation failure
2017-04-06T01:31:21.069 [ERROR] <https://builds.apache.org/job/beam_PostCommit_Java_ValidatesRunner_Flink/ws/runners/core-construction-java/src/test/java/org/apache/beam/runners/core/construction/PTransformMatchersTest.java>:[351,69]
<anonymous org.apache.beam.runners.core.construction.PTransformMatchersTest$9> is not
abstract and does not override abstract method getMaterialization() in org.apache.beam.sdk.transforms.ViewFn
2017-04-06T01:31:21.069 [ERROR] -> [Help 1]
org.apache.maven.lifecycle.LifecycleExecutionException: Failed to execute goal org.apache.maven.plugins:maven-compiler-plugin:3.6.1:testCompile
(default-testCompile) on project beam-runners-core-construction-java: Compilation failure
<https://builds.apache.org/job/beam_PostCommit_Java_ValidatesRunner_Flink/ws/runners/core-construction-java/src/test/java/org/apache/beam/runners/core/construction/PTransformMatchersTest.java>:[351,69]
<anonymous org.apache.beam.runners.core.construction.PTransformMatchersTest$9> is not
abstract and does not override abstract method getMaterialization() in org.apache.beam.sdk.transforms.ViewFn

	at org.apache.maven.lifecycle.internal.MojoExecutor.execute(MojoExecutor.java:212)
	at org.apache.maven.lifecycle.internal.MojoExecutor.execute(MojoExecutor.java:153)
	at org.apache.maven.lifecycle.internal.MojoExecutor.execute(MojoExecutor.java:145)
	at org.apache.maven.lifecycle.internal.LifecycleModuleBuilder.buildProject(LifecycleModuleBuilder.java:116)
	at org.apache.maven.lifecycle.internal.LifecycleModuleBuilder.buildProject(LifecycleModuleBuilder.java:80)
	at org.apache.maven.lifecycle.internal.builder.singlethreaded.SingleThreadedBuilder.build(SingleThreadedBuilder.java:51)
	at org.apache.maven.lifecycle.internal.LifecycleStarter.execute(LifecycleStarter.java:128)
	at org.apache.maven.DefaultMaven.doExecute(DefaultMaven.java:307)
	at org.apache.maven.DefaultMaven.doExecute(DefaultMaven.java:193)
	at org.apache.maven.DefaultMaven.execute(DefaultMaven.java:106)
	at org.jvnet.hudson.maven3.launcher.Maven33Launcher.main(Maven33Launcher.java:129)
	at sun.reflect.NativeMethodAccessorImpl.invoke0(Native Method)
	at sun.reflect.NativeMethodAccessorImpl.invoke(NativeMethodAccessorImpl.java:62)
	at sun.reflect.DelegatingMethodAccessorImpl.invoke(DelegatingMethodAccessorImpl.java:43)
	at java.lang.reflect.Method.invoke(Method.java:498)
	at org.codehaus.plexus.classworlds.launcher.Launcher.launchStandard(Launcher.java:330)
	at org.codehaus.plexus.classworlds.launcher.Launcher.launch(Launcher.java:238)
	at jenkins.maven3.agent.Maven33Main.launch(Maven33Main.java:176)
	at sun.reflect.NativeMethodAccessorImpl.invoke0(Native Method)
	at sun.reflect.NativeMethodAccessorImpl.invoke(NativeMethodAccessorImpl.java:62)
	at sun.reflect.DelegatingMethodAccessorImpl.invoke(DelegatingMethodAccessorImpl.java:43)
	at java.lang.reflect.Method.invoke(Method.java:498)
	at hudson.maven.Maven3Builder.call(Maven3Builder.java:139)
	at hudson.maven.Maven3Builder.call(Maven3Builder.java:70)
	at hudson.remoting.UserRequest.perform(UserRequest.java:153)
	at hudson.remoting.UserRequest.perform(UserRequest.java:50)
	at hudson.remoting.Request$2.run(Request.java:336)
	at hudson.remoting.InterceptingExecutorService$1.call(InterceptingExecutorService.java:68)
	at java.util.concurrent.FutureTask.run(FutureTask.java:266)
	at java.util.concurrent.ThreadPoolExecutor.runWorker(ThreadPoolExecutor.java:1142)
	at java.util.concurrent.ThreadPoolExecutor$Worker.run(ThreadPoolExecutor.java:617)
	at java.lang.Thread.run(Thread.java:745)
Caused by: org.apache.maven.plugin.compiler.CompilationFailureException: Compilation failure
<https://builds.apache.org/job/beam_PostCommit_Java_ValidatesRunner_Flink/ws/runners/core-construction-java/src/test/java/org/apache/beam/runners/core/construction/PTransformMatchersTest.java>:[351,69]
<anonymous org.apache.beam.runners.core.construction.PTransformMatchersTest$9> is not
abstract and does not override abstract method getMaterialization() in org.apache.beam.sdk.transforms.ViewFn

	at org.apache.maven.plugin.compiler.AbstractCompilerMojo.execute(AbstractCompilerMojo.java:1029)
	at org.apache.maven.plugin.compiler.TestCompilerMojo.execute(TestCompilerMojo.java:170)
	at org.apache.maven.plugin.DefaultBuildPluginManager.executeMojo(DefaultBuildPluginManager.java:134)
	at org.apache.maven.lifecycle.internal.MojoExecutor.execute(MojoExecutor.java:208)
	... 31 more
2017-04-06T01:31:21.070 [ERROR] 
2017-04-06T01:31:21.070 [ERROR] Re-run Maven using the -X switch to enable full debug logging.
2017-04-06T01:31:21.070 [ERROR] 
2017-04-06T01:31:21.070 [ERROR] For more information about the errors and possible solutions,
please read the following articles:
2017-04-06T01:31:21.070 [ERROR] [Help 1] http://cwiki.apache.org/confluence/display/MAVEN/MojoFailureException
2017-04-06T01:31:21.070 [ERROR] 
2017-04-06T01:31:21.070 [ERROR] After correcting the problems, you can resume the build with
the command
2017-04-06T01:31:21.070 [ERROR]   mvn <goals> -rf :beam-runners-core-construction-java
channel stopped

Mime
View raw message