beam-commits mailing list archives

Site index · List index
Message view « Date » · « Thread »
Top « Date » · « Thread »
From Apache Jenkins Server <jenk...@builds.apache.org>
Subject Build failed in Jenkins: beam_PostCommit_Java_MavenInstall #3439
Date Mon, 24 Apr 2017 22:28:35 GMT
See <https://builds.apache.org/job/beam_PostCommit_Java_MavenInstall/3439/display/redirect?page=changes>

Changes:

[lcwik] [BEAM-1871] Move ProtoCoder to new sdks/java/extensions/protobuf

------------------------------------------
[...truncated 927.19 KB...]
2017-04-24T22:28:07.580 [INFO] Downloading: https://repo.maven.apache.org/maven2/io/netty/netty-codec-http2/4.1.8.Final/netty-codec-http2-4.1.8.Final.jar
2017-04-24T22:28:07.595 [INFO] Downloaded: https://repo.maven.apache.org/maven2/com/google/api/grpc/grpc-google-pubsub-v1/0.1.0/grpc-google-pubsub-v1-0.1.0.jar
(262 KB at 3636.7 KB/sec)
2017-04-24T22:28:07.595 [INFO] Downloading: https://repo.maven.apache.org/maven2/io/netty/netty-codec-http/4.1.8.Final/netty-codec-http-4.1.8.Final.jar
2017-04-24T22:28:07.606 [INFO] Downloaded: https://repo.maven.apache.org/maven2/com/google/api/grpc/grpc-google-iam-v1/0.1.0/grpc-google-iam-v1-0.1.0.jar
(78 KB at 930.7 KB/sec)
2017-04-24T22:28:07.606 [INFO] Downloading: https://repo.maven.apache.org/maven2/io/netty/netty-handler-proxy/4.1.8.Final/netty-handler-proxy-4.1.8.Final.jar
2017-04-24T22:28:07.636 [INFO] Downloaded: https://repo.maven.apache.org/maven2/io/netty/netty-handler-proxy/4.1.8.Final/netty-handler-proxy-4.1.8.Final.jar
(20 KB at 179.9 KB/sec)
2017-04-24T22:28:07.636 [INFO] Downloading: https://repo.maven.apache.org/maven2/io/netty/netty-codec-socks/4.1.8.Final/netty-codec-socks-4.1.8.Final.jar
2017-04-24T22:28:07.660 [INFO] Downloaded: https://repo.maven.apache.org/maven2/com/google/cloud/datastore/datastore-v1-protos/1.3.0/datastore-v1-protos-1.3.0.jar
(437 KB at 3212.6 KB/sec)
2017-04-24T22:28:07.660 [INFO] Downloading: https://repo.maven.apache.org/maven2/io/netty/netty-handler/4.1.8.Final/netty-handler-4.1.8.Final.jar
2017-04-24T22:28:07.687 [INFO] Downloaded: https://repo.maven.apache.org/maven2/io/netty/netty-codec-socks/4.1.8.Final/netty-codec-socks-4.1.8.Final.jar
(118 KB at 724.2 KB/sec)
2017-04-24T22:28:07.687 [INFO] Downloading: https://repo.maven.apache.org/maven2/io/netty/netty-buffer/4.1.8.Final/netty-buffer-4.1.8.Final.jar
2017-04-24T22:28:07.699 [INFO] Downloaded: https://repo.maven.apache.org/maven2/io/grpc/grpc-netty/1.2.0/grpc-netty-1.2.0.jar
(162 KB at 929.6 KB/sec)
2017-04-24T22:28:07.699 [INFO] Downloading: https://repo.maven.apache.org/maven2/io/netty/netty-common/4.1.8.Final/netty-common-4.1.8.Final.jar
2017-04-24T22:28:07.720 [INFO] Downloaded: https://repo.maven.apache.org/maven2/io/netty/netty-codec-http/4.1.8.Final/netty-codec-http-4.1.8.Final.jar
(533 KB at 2728.8 KB/sec)
2017-04-24T22:28:07.721 [INFO] Downloading: https://repo.maven.apache.org/maven2/io/netty/netty-transport/4.1.8.Final/netty-transport-4.1.8.Final.jar
2017-04-24T22:28:07.760 [INFO] Downloaded: https://repo.maven.apache.org/maven2/io/netty/netty-codec-http2/4.1.8.Final/netty-codec-http2-4.1.8.Final.jar
(355 KB at 1510.6 KB/sec)
2017-04-24T22:28:07.760 [INFO] Downloading: https://repo.maven.apache.org/maven2/io/netty/netty-resolver/4.1.8.Final/netty-resolver-4.1.8.Final.jar
2017-04-24T22:28:07.772 [INFO] Downloaded: https://repo.maven.apache.org/maven2/io/netty/netty-handler/4.1.8.Final/netty-handler-4.1.8.Final.jar
(325 KB at 1312.3 KB/sec)
2017-04-24T22:28:07.772 [INFO] Downloading: https://repo.maven.apache.org/maven2/io/netty/netty-codec/4.1.8.Final/netty-codec-4.1.8.Final.jar
2017-04-24T22:28:07.797 [INFO] Downloaded: https://repo.maven.apache.org/maven2/io/netty/netty-buffer/4.1.8.Final/netty-buffer-4.1.8.Final.jar
(254 KB at 930.2 KB/sec)
2017-04-24T22:28:07.797 [INFO] Downloading: https://repo.maven.apache.org/maven2/io/grpc/grpc-all/1.2.0/grpc-all-1.2.0.jar
2017-04-24T22:28:07.806 [INFO] Downloaded: https://repo.maven.apache.org/maven2/io/netty/netty-resolver/4.1.8.Final/netty-resolver-4.1.8.Final.jar
(29 KB at 103.6 KB/sec)
2017-04-24T22:28:07.806 [INFO] Downloading: https://repo.maven.apache.org/maven2/io/grpc/grpc-okhttp/1.2.0/grpc-okhttp-1.2.0.jar
2017-04-24T22:28:07.807 [INFO] Downloaded: https://repo.maven.apache.org/maven2/io/netty/netty-transport/4.1.8.Final/netty-transport-4.1.8.Final.jar
(418 KB at 1480.2 KB/sec)
2017-04-24T22:28:07.807 [INFO] Downloading: https://repo.maven.apache.org/maven2/com/squareup/okhttp/okhttp/2.5.0/okhttp-2.5.0.jar
2017-04-24T22:28:07.823 [INFO] Downloaded: https://repo.maven.apache.org/maven2/io/grpc/grpc-all/1.2.0/grpc-all-1.2.0.jar
(359 B at 1.2 KB/sec)
2017-04-24T22:28:07.823 [INFO] Downloading: https://repo.maven.apache.org/maven2/com/squareup/okio/okio/1.6.0/okio-1.6.0.jar
2017-04-24T22:28:07.858 [INFO] Downloaded: https://repo.maven.apache.org/maven2/io/netty/netty-codec/4.1.8.Final/netty-codec-4.1.8.Final.jar
(302 KB at 905.6 KB/sec)
2017-04-24T22:28:07.858 [INFO] Downloading: https://repo.maven.apache.org/maven2/io/grpc/grpc-protobuf-nano/1.2.0/grpc-protobuf-nano-1.2.0.jar
2017-04-24T22:28:07.859 [INFO] Downloaded: https://repo.maven.apache.org/maven2/com/squareup/okio/okio/1.6.0/okio-1.6.0.jar
(65 KB at 192.8 KB/sec)
2017-04-24T22:28:07.859 [INFO] Downloading: https://repo.maven.apache.org/maven2/com/google/protobuf/nano/protobuf-javanano/3.0.0-alpha-5/protobuf-javanano-3.0.0-alpha-5.jar
2017-04-24T22:28:07.870 [INFO] Downloaded: https://repo.maven.apache.org/maven2/io/grpc/grpc-okhttp/1.2.0/grpc-okhttp-1.2.0.jar
(138 KB at 398.6 KB/sec)
2017-04-24T22:28:07.870 [INFO] Downloading: https://repo.maven.apache.org/maven2/com/google/cloud/bigtable/bigtable-protos/0.9.6/bigtable-protos-0.9.6.jar
2017-04-24T22:28:07.881 [INFO] Downloaded: https://repo.maven.apache.org/maven2/io/netty/netty-common/4.1.8.Final/netty-common-4.1.8.Final.jar
(680 KB at 1909.2 KB/sec)
2017-04-24T22:28:07.882 [INFO] Downloading: https://repo.maven.apache.org/maven2/com/google/cloud/bigtable/bigtable-client-core/0.9.6/bigtable-client-core-0.9.6.jar
2017-04-24T22:28:07.891 [INFO] Downloaded: https://repo.maven.apache.org/maven2/io/grpc/grpc-protobuf-nano/1.2.0/grpc-protobuf-nano-1.2.0.jar
(5 KB at 11.2 KB/sec)
2017-04-24T22:28:07.891 [INFO] Downloading: https://repo.maven.apache.org/maven2/commons-logging/commons-logging/1.2/commons-logging-1.2.jar
2017-04-24T22:28:07.895 [INFO] Downloaded: https://repo.maven.apache.org/maven2/com/google/protobuf/nano/protobuf-javanano/3.0.0-alpha-5/protobuf-javanano-3.0.0-alpha-5.jar
(50 KB at 132.8 KB/sec)
2017-04-24T22:28:07.895 [INFO] Downloading: https://repo.maven.apache.org/maven2/com/google/auth/google-auth-library-appengine/0.6.0/google-auth-library-appengine-0.6.0.jar
2017-04-24T22:28:07.903 [INFO] Downloaded: https://repo.maven.apache.org/maven2/com/squareup/okhttp/okhttp/2.5.0/okhttp-2.5.0.jar
(311 KB at 821.3 KB/sec)
2017-04-24T22:28:07.904 [INFO] Downloading: https://repo.maven.apache.org/maven2/com/google/appengine/appengine-api-1.0-sdk/1.9.34/appengine-api-1.0-sdk-1.9.34.jar
2017-04-24T22:28:07.925 [INFO] Downloaded: https://repo.maven.apache.org/maven2/com/google/auth/google-auth-library-appengine/0.6.0/google-auth-library-appengine-0.6.0.jar
(5 KB at 11.6 KB/sec)
2017-04-24T22:28:07.925 [INFO] Downloading: https://repo.maven.apache.org/maven2/io/dropwizard/metrics/metrics-core/3.1.2/metrics-core-3.1.2.jar
2017-04-24T22:28:07.927 [INFO] Downloaded: https://repo.maven.apache.org/maven2/commons-logging/commons-logging/1.2/commons-logging-1.2.jar
(61 KB at 150.2 KB/sec)
2017-04-24T22:28:07.927 [INFO] Downloading: https://repo.maven.apache.org/maven2/com/google/api/grpc/grpc-google-common-protos/0.1.0/grpc-google-common-protos-0.1.0.jar
2017-04-24T22:28:07.961 [INFO] Downloaded: https://repo.maven.apache.org/maven2/com/google/cloud/bigtable/bigtable-client-core/0.9.6/bigtable-client-core-0.9.6.jar
(209 KB at 477.4 KB/sec)
2017-04-24T22:28:07.961 [INFO] Downloading: https://repo.maven.apache.org/maven2/io/netty/netty-tcnative-boringssl-static/1.1.33.Fork26/netty-tcnative-boringssl-static-1.1.33.Fork26.jar
2017-04-24T22:28:07.979 [INFO] Downloaded: https://repo.maven.apache.org/maven2/io/dropwizard/metrics/metrics-core/3.1.2/metrics-core-3.1.2.jar
(110 KB at 242.1 KB/sec)
2017-04-24T22:28:08.089 [INFO] Downloaded: https://repo.maven.apache.org/maven2/com/google/api/grpc/grpc-google-common-protos/0.1.0/grpc-google-common-protos-0.1.0.jar
(974 KB at 1726.2 KB/sec)
2017-04-24T22:28:08.123 [INFO] Downloaded: https://repo.maven.apache.org/maven2/com/google/cloud/bigtable/bigtable-protos/0.9.6/bigtable-protos-0.9.6.jar
(792 KB at 1323.3 KB/sec)
2017-04-24T22:28:08.455 [INFO] Downloaded: https://repo.maven.apache.org/maven2/io/netty/netty-tcnative-boringssl-static/1.1.33.Fork26/netty-tcnative-boringssl-static-1.1.33.Fork26.jar
(2552 KB at 2743.5 KB/sec)
2017-04-24T22:28:09.920 [INFO] Downloaded: https://repo.maven.apache.org/maven2/com/google/appengine/appengine-api-1.0-sdk/1.9.34/appengine-api-1.0-sdk-1.9.34.jar
(17206 KB at 7183.7 KB/sec)
2017-04-24T22:28:09.928 [INFO] 
2017-04-24T22:28:09.928 [INFO] --- maven-clean-plugin:3.0.0:clean (default-clean) @ beam-sdks-java-io-google-cloud-platform
---
2017-04-24T22:28:09.929 [INFO] Deleting <https://builds.apache.org/job/beam_PostCommit_Java_MavenInstall/ws/sdks/java/io/google-cloud-platform>
(includes = [**/*.pyc, **/*.egg-info/], excludes = [])
2017-04-24T22:28:10.126 [INFO] 
2017-04-24T22:28:10.126 [INFO] --- maven-enforcer-plugin:1.4.1:enforce (enforce) @ beam-sdks-java-io-google-cloud-platform
---
2017-04-24T22:28:10.257 [INFO] artifact io.netty:netty-codec-http2: checking for updates from
central
2017-04-24T22:28:12.105 [INFO] 
2017-04-24T22:28:12.106 [INFO] --- maven-remote-resources-plugin:1.5:process (process-resource-bundles)
@ beam-sdks-java-io-google-cloud-platform ---
2017-04-24T22:28:12.870 [INFO] 
2017-04-24T22:28:12.870 [INFO] --- maven-resources-plugin:2.7:resources (default-resources)
@ beam-sdks-java-io-google-cloud-platform ---
2017-04-24T22:28:12.871 [INFO] Using 'UTF-8' encoding to copy filtered resources.
2017-04-24T22:28:12.871 [INFO] skip non existing resourceDirectory <https://builds.apache.org/job/beam_PostCommit_Java_MavenInstall/ws/sdks/java/io/google-cloud-platform/src/main/resources>
2017-04-24T22:28:12.871 [INFO] Copying 3 resources
2017-04-24T22:28:12.958 [INFO] 
2017-04-24T22:28:12.959 [INFO] --- maven-compiler-plugin:3.6.1:compile (default-compile) @
beam-sdks-java-io-google-cloud-platform ---
2017-04-24T22:28:12.971 [INFO] Changes detected - recompiling the module!
2017-04-24T22:28:12.972 [INFO] Compiling 53 source files to <https://builds.apache.org/job/beam_PostCommit_Java_MavenInstall/ws/sdks/java/io/google-cloud-platform/target/classes>
2017-04-24T22:28:14.571 [INFO] -------------------------------------------------------------
2017-04-24T22:28:14.571 [WARNING] COMPILATION WARNING : 
2017-04-24T22:28:14.571 [INFO] -------------------------------------------------------------
2017-04-24T22:28:14.572 [WARNING] bootstrap class path not set in conjunction with -source
1.7
2017-04-24T22:28:14.572 [INFO] 1 warning
2017-04-24T22:28:14.572 [INFO] -------------------------------------------------------------
2017-04-24T22:28:14.572 [INFO] -------------------------------------------------------------
2017-04-24T22:28:14.572 [ERROR] COMPILATION ERROR : 
2017-04-24T22:28:14.572 [INFO] -------------------------------------------------------------
2017-04-24T22:28:14.572 [ERROR] <https://builds.apache.org/job/beam_PostCommit_Java_MavenInstall/ws/sdks/java/io/google-cloud-platform/src/main/java/org/apache/beam/sdk/io/gcp/bigtable/BigtableIO.java>:[47,43]
package org.apache.beam.sdk.coders.protobuf does not exist
2017-04-24T22:28:14.572 [INFO] 1 error
2017-04-24T22:28:14.572 [INFO] -------------------------------------------------------------
[JENKINS] Archiving disabled
2017-04-24T22:28:15.085 [INFO]                                                           
             
2017-04-24T22:28:15.085 [INFO] ------------------------------------------------------------------------
2017-04-24T22:28:15.085 [INFO] Skipping Apache Beam :: Parent
2017-04-24T22:28:15.085 [INFO] This project has been banned from the build due to previous
failures.
2017-04-24T22:28:15.085 [INFO] ------------------------------------------------------------------------
[JENKINS] Archiving disabled
[JENKINS] Archiving disabled
[JENKINS] Archiving disabled
[JENKINS] Archiving disabled
[JENKINS] Archiving disabled
[JENKINS] Archiving disabled
[JENKINS] Archiving disabled
[JENKINS] Archiving disabled
[JENKINS] Archiving disabled
[JENKINS] Archiving disabled
[JENKINS] Archiving disabled
[JENKINS] Archiving disabled
[JENKINS] Archiving disabled
[JENKINS] Archiving disabled
[JENKINS] Archiving disabled
[JENKINS] Archiving disabled
[JENKINS] Archiving disabled
[JENKINS] Archiving disabled
[JENKINS] Archiving disabled
[JENKINS] Archiving disabled
[JENKINS] Archiving disabled
[JENKINS] Archiving disabled
[JENKINS] Archiving disabled
[JENKINS] Archiving disabled
[JENKINS] Archiving disabled
[JENKINS] Archiving disabled
[JENKINS] Archiving disabled
[JENKINS] Archiving disabled
[JENKINS] Archiving disabled
[JENKINS] Archiving disabled
[JENKINS] Archiving disabled
[JENKINS] Archiving disabled
[JENKINS] Archiving disabled
[JENKINS] Archiving disabled
[JENKINS] Archiving disabled
[JENKINS] Archiving disabled
[JENKINS] Archiving disabled
[JENKINS] Archiving disabled
[JENKINS] Archiving disabled
[JENKINS] Archiving disabled
[JENKINS] Archiving disabled
[JENKINS] Archiving disabled
[JENKINS] Archiving disabled
[JENKINS] Archiving disabled
[JENKINS] Archiving disabled
[JENKINS] Archiving disabled
2017-04-24T22:28:27.628 [INFO] ------------------------------------------------------------------------
2017-04-24T22:28:27.628 [INFO] Reactor Summary:
2017-04-24T22:28:27.628 [INFO] 
2017-04-24T22:28:27.628 [INFO] Apache Beam :: Parent .............................. SUCCESS
[ 32.897 s]
2017-04-24T22:28:27.628 [INFO] Apache Beam :: SDKs :: Java :: Build Tools ......... SUCCESS
[ 17.085 s]
2017-04-24T22:28:27.628 [INFO] Apache Beam :: SDKs ................................ SUCCESS
[  6.448 s]
2017-04-24T22:28:27.628 [INFO] Apache Beam :: SDKs :: Common ...................... SUCCESS
[  2.264 s]
2017-04-24T22:28:27.628 [INFO] Apache Beam :: SDKs :: Common :: Fn API ............ SUCCESS
[ 36.367 s]
2017-04-24T22:28:27.629 [INFO] Apache Beam :: SDKs :: Common :: Runner API ........ SUCCESS
[ 24.413 s]
2017-04-24T22:28:27.629 [INFO] Apache Beam :: SDKs :: Java ........................ SUCCESS
[  3.547 s]
2017-04-24T22:28:27.629 [INFO] Apache Beam :: SDKs :: Java :: Core ................ SUCCESS
[04:41 min]
2017-04-24T22:28:27.629 [INFO] Apache Beam :: SDKs :: Java :: IO .................. SUCCESS
[  3.886 s]
2017-04-24T22:28:27.629 [INFO] Apache Beam :: SDKs :: Java :: IO :: Common ........ SUCCESS
[  6.437 s]
2017-04-24T22:28:27.629 [INFO] Apache Beam :: Runners ............................. SUCCESS
[  7.320 s]
2017-04-24T22:28:27.629 [INFO] Apache Beam :: Runners :: Core Construction Java ... SUCCESS
[ 38.075 s]
2017-04-24T22:28:27.629 [INFO] Apache Beam :: Runners :: Core Java ................ SUCCESS
[01:38 min]
2017-04-24T22:28:27.629 [INFO] Apache Beam :: Runners :: Direct Java .............. SUCCESS
[04:59 min]
2017-04-24T22:28:27.629 [INFO] Apache Beam :: SDKs :: Java :: IO :: Elasticsearch . SUCCESS
[ 58.036 s]
2017-04-24T22:28:27.629 [INFO] Apache Beam :: SDKs :: Java :: Extensions .......... SUCCESS
[  3.223 s]
2017-04-24T22:28:27.629 [INFO] Apache Beam :: SDKs :: Java :: Extensions :: Google Cloud Platform
Core SUCCESS [ 43.368 s]
2017-04-24T22:28:27.629 [INFO] Apache Beam :: SDKs :: Java :: IO :: Google Cloud Platform
FAILURE [  9.120 s]
2017-04-24T22:28:27.629 [INFO] Apache Beam :: SDKs :: Java :: IO :: Hadoop Common . SKIPPED
2017-04-24T22:28:27.629 [INFO] Apache Beam :: SDKs :: Java :: IO :: Hadoop ........ SKIPPED
2017-04-24T22:28:27.629 [INFO] Apache Beam :: SDKs :: Java :: IO :: Hadoop :: input-format
SKIPPED
2017-04-24T22:28:27.629 [INFO] Apache Beam :: Runners :: Google Cloud Dataflow .... SKIPPED
2017-04-24T22:28:27.629 [INFO] Apache Beam :: SDKs :: Java :: IO :: Hadoop :: jdk1.8-tests
SKIPPED
2017-04-24T22:28:27.629 [INFO] Apache Beam :: SDKs :: Java :: IO :: HBase ......... SKIPPED
2017-04-24T22:28:27.629 [INFO] Apache Beam :: SDKs :: Java :: IO :: HDFS .......... SKIPPED
2017-04-24T22:28:27.629 [INFO] Apache Beam :: SDKs :: Java :: IO :: JDBC .......... SKIPPED
2017-04-24T22:28:27.629 [INFO] Apache Beam :: SDKs :: Java :: IO :: JMS ........... SKIPPED
2017-04-24T22:28:27.629 [INFO] Apache Beam :: SDKs :: Java :: IO :: Kafka ......... SKIPPED
2017-04-24T22:28:27.629 [INFO] Apache Beam :: SDKs :: Java :: IO :: Kinesis ....... SKIPPED
2017-04-24T22:28:27.629 [INFO] Apache Beam :: SDKs :: Java :: IO :: MongoDB ....... SKIPPED
2017-04-24T22:28:27.629 [INFO] Apache Beam :: SDKs :: Java :: IO :: MQTT .......... SKIPPED
2017-04-24T22:28:27.629 [INFO] Apache Beam :: SDKs :: Java :: IO :: XML ........... SKIPPED
2017-04-24T22:28:27.629 [INFO] Apache Beam :: SDKs :: Java :: Maven Archetypes .... SKIPPED
2017-04-24T22:28:27.629 [INFO] Apache Beam :: SDKs :: Java :: Maven Archetypes :: Starter
SKIPPED
2017-04-24T22:28:27.629 [INFO] Apache Beam :: SDKs :: Java :: Maven Archetypes :: Examples
SKIPPED
2017-04-24T22:28:27.629 [INFO] Apache Beam :: SDKs :: Java :: Maven Archetypes :: Examples
- Java 8 SKIPPED
2017-04-24T22:28:27.629 [INFO] Apache Beam :: SDKs :: Java :: Extensions :: Jackson SKIPPED
2017-04-24T22:28:27.629 [INFO] Apache Beam :: SDKs :: Java :: Extensions :: Join library SKIPPED
2017-04-24T22:28:27.629 [INFO] Apache Beam :: SDKs :: Java :: Extensions :: Protobuf SKIPPED
2017-04-24T22:28:27.629 [INFO] Apache Beam :: SDKs :: Java :: Extensions :: Sorter  SKIPPED
2017-04-24T22:28:27.629 [INFO] Apache Beam :: SDKs :: Java :: Harness ............. SKIPPED
2017-04-24T22:28:27.629 [INFO] Apache Beam :: SDKs :: Java :: Java 8 Tests ........ SKIPPED
2017-04-24T22:28:27.629 [INFO] Apache Beam :: SDKs :: Python ...................... SKIPPED
2017-04-24T22:28:27.629 [INFO] Apache Beam :: Runners :: Flink .................... SKIPPED
2017-04-24T22:28:27.629 [INFO] Apache Beam :: Runners :: Spark .................... SKIPPED
2017-04-24T22:28:27.629 [INFO] Apache Beam :: Runners :: Apex ..................... SKIPPED
2017-04-24T22:28:27.629 [INFO] Apache Beam :: Examples ............................ SKIPPED
2017-04-24T22:28:27.629 [INFO] Apache Beam :: Examples :: Java .................... SKIPPED
2017-04-24T22:28:27.629 [INFO] Apache Beam :: Examples :: Java 8 .................. SKIPPED
2017-04-24T22:28:27.629 [INFO] Apache Beam :: SDKs :: Java :: Aggregated Javadoc .. SKIPPED
2017-04-24T22:28:27.629 [INFO] ------------------------------------------------------------------------
2017-04-24T22:28:27.629 [INFO] BUILD FAILURE
2017-04-24T22:28:27.629 [INFO] ------------------------------------------------------------------------
2017-04-24T22:28:27.629 [INFO] Total time: 16:55 min
2017-04-24T22:28:27.629 [INFO] Finished at: 2017-04-24T22:28:27+00:00
2017-04-24T22:28:28.814 [INFO] Final Memory: 146M/1510M
2017-04-24T22:28:28.814 [INFO] ------------------------------------------------------------------------
2017-04-24T22:28:29.008 [ERROR] Failed to execute goal org.apache.maven.plugins:maven-compiler-plugin:3.6.1:compile
(default-compile) on project beam-sdks-java-io-google-cloud-platform: Compilation failure
2017-04-24T22:28:29.008 [ERROR] <https://builds.apache.org/job/beam_PostCommit_Java_MavenInstall/ws/sdks/java/io/google-cloud-platform/src/main/java/org/apache/beam/sdk/io/gcp/bigtable/BigtableIO.java>:[47,43]
package org.apache.beam.sdk.coders.protobuf does not exist
2017-04-24T22:28:29.008 [ERROR] -> [Help 1]
org.apache.maven.lifecycle.LifecycleExecutionException: Failed to execute goal org.apache.maven.plugins:maven-compiler-plugin:3.6.1:compile
(default-compile) on project beam-sdks-java-io-google-cloud-platform: Compilation failure
<https://builds.apache.org/job/beam_PostCommit_Java_MavenInstall/ws/sdks/java/io/google-cloud-platform/src/main/java/org/apache/beam/sdk/io/gcp/bigtable/BigtableIO.java>:[47,43]
package org.apache.beam.sdk.coders.protobuf does not exist

	at org.apache.maven.lifecycle.internal.MojoExecutor.execute(MojoExecutor.java:212)
	at org.apache.maven.lifecycle.internal.MojoExecutor.execute(MojoExecutor.java:153)
	at org.apache.maven.lifecycle.internal.MojoExecutor.execute(MojoExecutor.java:145)
	at org.apache.maven.lifecycle.internal.LifecycleModuleBuilder.buildProject(LifecycleModuleBuilder.java:116)
	at org.apache.maven.lifecycle.internal.LifecycleModuleBuilder.buildProject(LifecycleModuleBuilder.java:80)
	at org.apache.maven.lifecycle.internal.builder.singlethreaded.SingleThreadedBuilder.build(SingleThreadedBuilder.java:51)
	at org.apache.maven.lifecycle.internal.LifecycleStarter.execute(LifecycleStarter.java:128)
	at org.apache.maven.DefaultMaven.doExecute(DefaultMaven.java:307)
	at org.apache.maven.DefaultMaven.doExecute(DefaultMaven.java:193)
	at org.apache.maven.DefaultMaven.execute(DefaultMaven.java:106)
	at org.jvnet.hudson.maven3.launcher.Maven33Launcher.main(Maven33Launcher.java:129)
	at sun.reflect.NativeMethodAccessorImpl.invoke0(Native Method)
	at sun.reflect.NativeMethodAccessorImpl.invoke(NativeMethodAccessorImpl.java:62)
	at sun.reflect.DelegatingMethodAccessorImpl.invoke(DelegatingMethodAccessorImpl.java:43)
	at java.lang.reflect.Method.invoke(Method.java:498)
	at org.codehaus.plexus.classworlds.launcher.Launcher.launchStandard(Launcher.java:330)
	at org.codehaus.plexus.classworlds.launcher.Launcher.launch(Launcher.java:238)
	at jenkins.maven3.agent.Maven33Main.launch(Maven33Main.java:176)
	at sun.reflect.NativeMethodAccessorImpl.invoke0(Native Method)
	at sun.reflect.NativeMethodAccessorImpl.invoke(NativeMethodAccessorImpl.java:62)
	at sun.reflect.DelegatingMethodAccessorImpl.invoke(DelegatingMethodAccessorImpl.java:43)
	at java.lang.reflect.Method.invoke(Method.java:498)
	at hudson.maven.Maven3Builder.call(Maven3Builder.java:139)
	at hudson.maven.Maven3Builder.call(Maven3Builder.java:70)
	at hudson.remoting.UserRequest.perform(UserRequest.java:153)
	at hudson.remoting.UserRequest.perform(UserRequest.java:50)
	at hudson.remoting.Request$2.run(Request.java:336)
	at hudson.remoting.InterceptingExecutorService$1.call(InterceptingExecutorService.java:68)
	at java.util.concurrent.FutureTask.run(FutureTask.java:266)
	at java.util.concurrent.ThreadPoolExecutor.runWorker(ThreadPoolExecutor.java:1142)
	at java.util.concurrent.ThreadPoolExecutor$Worker.run(ThreadPoolExecutor.java:617)
	at java.lang.Thread.run(Thread.java:745)
Caused by: org.apache.maven.plugin.compiler.CompilationFailureException: Compilation failure
<https://builds.apache.org/job/beam_PostCommit_Java_MavenInstall/ws/sdks/java/io/google-cloud-platform/src/main/java/org/apache/beam/sdk/io/gcp/bigtable/BigtableIO.java>:[47,43]
package org.apache.beam.sdk.coders.protobuf does not exist

	at org.apache.maven.plugin.compiler.AbstractCompilerMojo.execute(AbstractCompilerMojo.java:1029)
	at org.apache.maven.plugin.compiler.CompilerMojo.execute(CompilerMojo.java:137)
	at org.apache.maven.plugin.DefaultBuildPluginManager.executeMojo(DefaultBuildPluginManager.java:134)
	at org.apache.maven.lifecycle.internal.MojoExecutor.execute(MojoExecutor.java:208)
	... 31 more
2017-04-24T22:28:29.009 [ERROR] 
2017-04-24T22:28:29.009 [ERROR] Re-run Maven using the -X switch to enable full debug logging.
2017-04-24T22:28:29.009 [ERROR] 
2017-04-24T22:28:29.009 [ERROR] For more information about the errors and possible solutions,
please read the following articles:
2017-04-24T22:28:29.009 [ERROR] [Help 1] http://cwiki.apache.org/confluence/display/MAVEN/MojoFailureException
2017-04-24T22:28:29.009 [ERROR] 
2017-04-24T22:28:29.009 [ERROR] After correcting the problems, you can resume the build with
the command
2017-04-24T22:28:29.009 [ERROR]   mvn <goals> -rf :beam-sdks-java-io-google-cloud-platform
Waiting for Jenkins to finish collecting data
channel stopped

Mime
View raw message