beam-commits mailing list archives

Site index · List index
Message view « Date » · « Thread »
Top « Date » · « Thread »
From Apache Jenkins Server <jenk...@builds.apache.org>
Subject Build failed in Jenkins: beam_PostCommit_Java_ValidatesRunner_Flink #2240
Date Fri, 07 Apr 2017 20:39:02 GMT
See <https://builds.apache.org/job/beam_PostCommit_Java_ValidatesRunner_Flink/2240/display/redirect>

------------------------------------------
[...truncated 618.55 KB...]
2017-04-07T20:37:29.893 [INFO] Downloaded: https://repo.maven.apache.org/maven2/org/codehaus/woodstox/stax2-api/3.1.4/stax2-api-3.1.4.jar
(159 KB at 286.4 KB/sec)
2017-04-07T20:37:29.893 [INFO] Downloading: https://repo.maven.apache.org/maven2/com/google/auto/service/auto-service/1.0-rc2/auto-service-1.0-rc2.jar
2017-04-07T20:37:29.905 [INFO] Downloaded: https://repo.maven.apache.org/maven2/org/xerial/snappy/snappy-java/1.1.2.1/snappy-java-1.1.2.1.jar
(689 KB at 1220.4 KB/sec)
2017-04-07T20:37:29.905 [INFO] Downloading: https://repo.maven.apache.org/maven2/com/google/auto/auto-common/0.3/auto-common-0.3.jar
2017-04-07T20:37:29.921 [INFO] Downloaded: https://repo.maven.apache.org/maven2/com/google/auto/service/auto-service/1.0-rc2/auto-service-1.0-rc2.jar
(11 KB at 17.5 KB/sec)
2017-04-07T20:37:29.921 [INFO] Downloading: https://repo.maven.apache.org/maven2/com/google/auto/value/auto-value/1.3/auto-value-1.3.jar
2017-04-07T20:37:29.937 [INFO] Downloaded: https://repo.maven.apache.org/maven2/joda-time/joda-time/2.4/joda-time-2.4.jar
(573 KB at 960.5 KB/sec)
2017-04-07T20:37:29.937 [INFO] Downloading: https://repo.maven.apache.org/maven2/com/fasterxml/jackson/dataformat/jackson-dataformat-yaml/2.7.2/jackson-dataformat-yaml-2.7.2.jar
2017-04-07T20:37:29.937 [INFO] Downloaded: https://repo.maven.apache.org/maven2/com/google/auto/auto-common/0.3/auto-common-0.3.jar
(39 KB at 63.9 KB/sec)
2017-04-07T20:37:29.938 [INFO] Downloading: https://repo.maven.apache.org/maven2/org/yaml/snakeyaml/1.15/snakeyaml-1.15.jar
2017-04-07T20:37:29.941 [INFO] Downloaded: https://repo.maven.apache.org/maven2/net/bytebuddy/byte-buddy/1.6.8/byte-buddy-1.6.8.jar
(2706 KB at 4509.7 KB/sec)
2017-04-07T20:37:29.942 [INFO] Downloading: https://repo.maven.apache.org/maven2/org/hamcrest/hamcrest-all/1.3/hamcrest-all-1.3.jar
2017-04-07T20:37:29.944 [INFO] Downloaded: https://repo.maven.apache.org/maven2/org/codehaus/woodstox/woodstox-core-asl/4.4.1/woodstox-core-asl-4.4.1.jar
(475 KB at 787.1 KB/sec)
2017-04-07T20:37:29.944 [INFO] Downloading: https://repo.maven.apache.org/maven2/org/slf4j/slf4j-jdk14/1.7.14/slf4j-jdk14-1.7.14.jar
2017-04-07T20:37:29.970 [INFO] Downloaded: https://repo.maven.apache.org/maven2/org/slf4j/slf4j-jdk14/1.7.14/slf4j-jdk14-1.7.14.jar
(8 KB at 12.1 KB/sec)
2017-04-07T20:37:29.970 [INFO] Downloading: https://repo.maven.apache.org/maven2/org/mockito/mockito-all/1.9.5/mockito-all-1.9.5.jar
2017-04-07T20:37:29.983 [INFO] Downloaded: https://repo.maven.apache.org/maven2/org/yaml/snakeyaml/1.15/snakeyaml-1.15.jar
(263 KB at 409.6 KB/sec)
2017-04-07T20:37:29.984 [INFO] Downloading: https://repo.maven.apache.org/maven2/com/google/cloud/dataflow/google-cloud-dataflow-java-proto-library-all/0.5.160304/google-cloud-dataflow-java-proto-library-all-0.5.160304.jar
2017-04-07T20:37:29.987 [INFO] Downloaded: https://repo.maven.apache.org/maven2/org/hamcrest/hamcrest-all/1.3/hamcrest-all-1.3.jar
(300 KB at 463.5 KB/sec)
2017-04-07T20:37:29.987 [INFO] Downloading: https://repo.maven.apache.org/maven2/com/esotericsoftware/kryo/kryo/2.21/kryo-2.21.jar
2017-04-07T20:37:30.001 [INFO] Downloaded: https://repo.maven.apache.org/maven2/com/fasterxml/jackson/dataformat/jackson-dataformat-yaml/2.7.2/jackson-dataformat-yaml-2.7.2.jar
(314 KB at 474.9 KB/sec)
2017-04-07T20:37:30.002 [INFO] Downloading: https://repo.maven.apache.org/maven2/com/esotericsoftware/reflectasm/reflectasm/1.07/reflectasm-1.07-shaded.jar
2017-04-07T20:37:30.015 [INFO] Downloaded: https://repo.maven.apache.org/maven2/com/google/cloud/dataflow/google-cloud-dataflow-java-proto-library-all/0.5.160304/google-cloud-dataflow-java-proto-library-all-0.5.160304.jar
(53 KB at 78.1 KB/sec)
2017-04-07T20:37:30.015 [INFO] Downloading: https://repo.maven.apache.org/maven2/org/ow2/asm/asm/4.0/asm-4.0.jar
2017-04-07T20:37:30.034 [INFO] Downloaded: https://repo.maven.apache.org/maven2/com/esotericsoftware/reflectasm/reflectasm/1.07/reflectasm-1.07-shaded.jar
(65 KB at 92.5 KB/sec)
2017-04-07T20:37:30.034 [INFO] Downloading: https://repo.maven.apache.org/maven2/com/esotericsoftware/minlog/minlog/1.2/minlog-1.2.jar
2017-04-07T20:37:30.044 [INFO] Downloaded: https://repo.maven.apache.org/maven2/com/esotericsoftware/kryo/kryo/2.21/kryo-2.21.jar
(355 KB at 504.9 KB/sec)
2017-04-07T20:37:30.044 [INFO] Downloading: https://repo.maven.apache.org/maven2/org/objenesis/objenesis/1.2/objenesis-1.2.jar
2017-04-07T20:37:30.049 [INFO] Downloaded: https://repo.maven.apache.org/maven2/com/google/auto/value/auto-value/1.3/auto-value-1.3.jar
(1380 KB at 1949.0 KB/sec)
2017-04-07T20:37:30.062 [INFO] Downloaded: https://repo.maven.apache.org/maven2/com/esotericsoftware/minlog/minlog/1.2/minlog-1.2.jar
(5 KB at 6.7 KB/sec)
2017-04-07T20:37:30.065 [INFO] Downloaded: https://repo.maven.apache.org/maven2/org/ow2/asm/asm/4.0/asm-4.0.jar
(45 KB at 62.1 KB/sec)
2017-04-07T20:37:30.074 [INFO] Downloaded: https://repo.maven.apache.org/maven2/org/objenesis/objenesis/1.2/objenesis-1.2.jar
(36 KB at 48.0 KB/sec)
2017-04-07T20:37:30.110 [INFO] Downloaded: https://repo.maven.apache.org/maven2/org/mockito/mockito-all/1.9.5/mockito-all-1.9.5.jar
(1545 KB at 2010.4 KB/sec)
2017-04-07T20:37:30.127 [INFO] 
2017-04-07T20:37:30.127 [INFO] --- maven-clean-plugin:3.0.0:clean (default-clean) @ beam-sdks-java-core
---
2017-04-07T20:37:30.128 [INFO] Deleting <https://builds.apache.org/job/beam_PostCommit_Java_ValidatesRunner_Flink/ws/sdks/java/core>
(includes = [**/*.pyc, **/*.egg-info/], excludes = [])
2017-04-07T20:37:31.460 [INFO] 
2017-04-07T20:37:31.460 [INFO] --- maven-enforcer-plugin:1.4.1:enforce (enforce) @ beam-sdks-java-core
---
2017-04-07T20:37:31.500 [INFO] artifact io.netty:netty-codec-http2: checking for updates from
central
2017-04-07T20:37:32.609 [INFO] 
2017-04-07T20:37:32.609 [INFO] --- jacoco-maven-plugin:0.7.8:prepare-agent (default) @ beam-sdks-java-core
---
2017-04-07T20:37:32.612 [INFO] Downloading: https://repo.maven.apache.org/maven2/junit/junit/4.8.2/junit-4.8.2.pom
2017-04-07T20:37:32.639 [INFO] Downloaded: https://repo.maven.apache.org/maven2/junit/junit/4.8.2/junit-4.8.2.pom
(2 KB at 53.6 KB/sec)
2017-04-07T20:37:32.641 [INFO] Downloading: https://repo.maven.apache.org/maven2/org/apache/maven/maven-artifact-manager/2.0.2/maven-artifact-manager-2.0.2.pom
2017-04-07T20:37:32.666 [INFO] Downloaded: https://repo.maven.apache.org/maven2/org/apache/maven/maven-artifact-manager/2.0.2/maven-artifact-manager-2.0.2.pom
(2 KB at 54.5 KB/sec)
2017-04-07T20:37:32.668 [INFO] Downloading: https://repo.maven.apache.org/maven2/org/apache/maven/maven-repository-metadata/2.0.2/maven-repository-metadata-2.0.2.pom
2017-04-07T20:37:32.695 [INFO] Downloaded: https://repo.maven.apache.org/maven2/org/apache/maven/maven-repository-metadata/2.0.2/maven-repository-metadata-2.0.2.pom
(2 KB at 47.3 KB/sec)
2017-04-07T20:37:32.698 [INFO] Downloading: https://repo.maven.apache.org/maven2/org/apache/maven/maven-plugin-api/2.0.10/maven-plugin-api-2.0.10.pom
2017-04-07T20:37:32.724 [INFO] Downloaded: https://repo.maven.apache.org/maven2/org/apache/maven/maven-plugin-api/2.0.10/maven-plugin-api-2.0.10.pom
(2 KB at 56.2 KB/sec)
2017-04-07T20:37:32.728 [INFO] Downloading: https://repo.maven.apache.org/maven2/org/jacoco/org.jacoco.agent/0.7.8/org.jacoco.agent-0.7.8.pom
2017-04-07T20:37:32.756 [INFO] Downloaded: https://repo.maven.apache.org/maven2/org/jacoco/org.jacoco.agent/0.7.8/org.jacoco.agent-0.7.8.pom
(3 KB at 100.3 KB/sec)
2017-04-07T20:37:32.759 [INFO] Downloading: https://repo.maven.apache.org/maven2/org/jacoco/org.jacoco.core/0.7.8/org.jacoco.core-0.7.8.pom
2017-04-07T20:37:32.785 [INFO] Downloaded: https://repo.maven.apache.org/maven2/org/jacoco/org.jacoco.core/0.7.8/org.jacoco.core-0.7.8.pom
(2 KB at 45.5 KB/sec)
2017-04-07T20:37:32.787 [INFO] Downloading: https://repo.maven.apache.org/maven2/org/ow2/asm/asm-debug-all/5.1/asm-debug-all-5.1.pom
2017-04-07T20:37:32.816 [INFO] Downloaded: https://repo.maven.apache.org/maven2/org/ow2/asm/asm-debug-all/5.1/asm-debug-all-5.1.pom
(2 KB at 66.7 KB/sec)
2017-04-07T20:37:32.817 [INFO] Downloading: https://repo.maven.apache.org/maven2/org/jacoco/org.jacoco.report/0.7.8/org.jacoco.report-0.7.8.pom
2017-04-07T20:37:32.843 [INFO] Downloaded: https://repo.maven.apache.org/maven2/org/jacoco/org.jacoco.report/0.7.8/org.jacoco.report-0.7.8.pom
(2 KB at 50.6 KB/sec)
2017-04-07T20:37:32.850 [INFO] Downloading: https://repo.maven.apache.org/maven2/junit/junit/4.8.2/junit-4.8.2.jar
2017-04-07T20:37:32.850 [INFO] Downloading: https://repo.maven.apache.org/maven2/org/apache/maven/doxia/doxia-core/1.1.2/doxia-core-1.1.2.jar
2017-04-07T20:37:32.850 [INFO] Downloading: https://repo.maven.apache.org/maven2/xerces/xercesImpl/2.8.1/xercesImpl-2.8.1.jar
2017-04-07T20:37:32.851 [INFO] Downloading: https://repo.maven.apache.org/maven2/commons-httpclient/commons-httpclient/3.1/commons-httpclient-3.1.jar
2017-04-07T20:37:32.851 [INFO] Downloading: https://repo.maven.apache.org/maven2/commons-codec/commons-codec/1.2/commons-codec-1.2.jar
2017-04-07T20:37:32.891 [INFO] Downloaded: https://repo.maven.apache.org/maven2/commons-codec/commons-codec/1.2/commons-codec-1.2.jar
(30 KB at 734.5 KB/sec)
2017-04-07T20:37:32.891 [INFO] Downloading: https://repo.maven.apache.org/maven2/org/apache/maven/doxia/doxia-site-renderer/1.1.2/doxia-site-renderer-1.1.2.jar
2017-04-07T20:37:32.893 [INFO] Downloaded: https://repo.maven.apache.org/maven2/org/apache/maven/doxia/doxia-core/1.1.2/doxia-core-1.1.2.jar
(155 KB at 3595.1 KB/sec)
2017-04-07T20:37:32.893 [INFO] Downloading: https://repo.maven.apache.org/maven2/org/apache/maven/doxia/doxia-decoration-model/1.1.2/doxia-decoration-model-1.1.2.jar
2017-04-07T20:37:32.894 [INFO] Downloaded: https://repo.maven.apache.org/maven2/junit/junit/4.8.2/junit-4.8.2.jar
(232 KB at 5150.7 KB/sec)
2017-04-07T20:37:32.894 [INFO] Downloading: https://repo.maven.apache.org/maven2/org/apache/maven/doxia/doxia-module-xhtml/1.1.2/doxia-module-xhtml-1.1.2.jar
2017-04-07T20:37:32.898 [INFO] Downloaded: https://repo.maven.apache.org/maven2/commons-httpclient/commons-httpclient/3.1/commons-httpclient-3.1.jar
(298 KB at 6205.3 KB/sec)
2017-04-07T20:37:32.898 [INFO] Downloading: https://repo.maven.apache.org/maven2/org/apache/maven/doxia/doxia-module-fml/1.1.2/doxia-module-fml-1.1.2.jar
2017-04-07T20:37:32.921 [INFO] Downloaded: https://repo.maven.apache.org/maven2/org/apache/maven/doxia/doxia-site-renderer/1.1.2/doxia-site-renderer-1.1.2.jar
(50 KB at 703.8 KB/sec)
2017-04-07T20:37:32.921 [INFO] Downloading: https://repo.maven.apache.org/maven2/commons-collections/commons-collections/3.2/commons-collections-3.2.jar
2017-04-07T20:37:32.922 [INFO] Downloaded: https://repo.maven.apache.org/maven2/org/apache/maven/doxia/doxia-decoration-model/1.1.2/doxia-decoration-model-1.1.2.jar
(52 KB at 719.5 KB/sec)
2017-04-07T20:37:32.922 [INFO] Downloading: https://repo.maven.apache.org/maven2/org/jacoco/org.jacoco.agent/0.7.8/org.jacoco.agent-0.7.8-runtime.jar
2017-04-07T20:37:32.923 [INFO] Downloaded: https://repo.maven.apache.org/maven2/org/apache/maven/doxia/doxia-module-xhtml/1.1.2/doxia-module-xhtml-1.1.2.jar
(15 KB at 203.5 KB/sec)
2017-04-07T20:37:32.923 [INFO] Downloading: https://repo.maven.apache.org/maven2/org/jacoco/org.jacoco.core/0.7.8/org.jacoco.core-0.7.8.jar
2017-04-07T20:37:32.925 [INFO] Downloaded: https://repo.maven.apache.org/maven2/org/apache/maven/doxia/doxia-module-fml/1.1.2/doxia-module-fml-1.1.2.jar
(37 KB at 493.5 KB/sec)
2017-04-07T20:37:32.925 [INFO] Downloading: https://repo.maven.apache.org/maven2/org/ow2/asm/asm-debug-all/5.1/asm-debug-all-5.1.jar
2017-04-07T20:37:32.958 [INFO] Downloaded: https://repo.maven.apache.org/maven2/org/jacoco/org.jacoco.core/0.7.8/org.jacoco.core-0.7.8.jar
(122 KB at 1135.5 KB/sec)
2017-04-07T20:37:32.958 [INFO] Downloading: https://repo.maven.apache.org/maven2/org/jacoco/org.jacoco.report/0.7.8/org.jacoco.report-0.7.8.jar
2017-04-07T20:37:32.966 [INFO] Downloaded: https://repo.maven.apache.org/maven2/xerces/xercesImpl/2.8.1/xercesImpl-2.8.1.jar
(1185 KB at 10211.5 KB/sec)
2017-04-07T20:37:32.974 [INFO] Downloaded: https://repo.maven.apache.org/maven2/org/jacoco/org.jacoco.agent/0.7.8/org.jacoco.agent-0.7.8-runtime.jar
(252 KB at 2043.1 KB/sec)
2017-04-07T20:37:32.984 [INFO] Downloaded: https://repo.maven.apache.org/maven2/org/ow2/asm/asm-debug-all/5.1/asm-debug-all-5.1.jar
(379 KB at 2847.1 KB/sec)
2017-04-07T20:37:32.987 [INFO] Downloaded: https://repo.maven.apache.org/maven2/commons-collections/commons-collections/3.2/commons-collections-3.2.jar
(558 KB at 4102.0 KB/sec)
2017-04-07T20:37:32.993 [INFO] Downloaded: https://repo.maven.apache.org/maven2/org/jacoco/org.jacoco.report/0.7.8/org.jacoco.report-0.7.8.jar
(125 KB at 876.1 KB/sec)
2017-04-07T20:37:33.084 [INFO] argLine set to -javaagent:<https://builds.apache.org/job/beam_PostCommit_Java_ValidatesRunner_Flink/ws/.repository/org/jacoco/org.jacoco.agent/0.7.8/org.jacoco.agent-0.7.8-runtime.jar=destfile=/home/jenkins/jenkins-slave/workspace/beam_PostCommit_Java_ValidatesRunner_Flink/sdks/java/core/target/jacoco.exec,excludes=**/AutoValue_*.class,dumponexit=true,output=file>
2017-04-07T20:37:35.287 [INFO] 
2017-04-07T20:37:35.287 [INFO] --- avro-maven-plugin:1.8.1:schema (schemas) @ beam-sdks-java-core
---
2017-04-07T20:37:35.291 [INFO] Downloading: https://repo.maven.apache.org/maven2/org/apache/avro/avro-compiler/1.8.1/avro-compiler-1.8.1.pom
2017-04-07T20:37:35.323 [INFO] Downloaded: https://repo.maven.apache.org/maven2/org/apache/avro/avro-compiler/1.8.1/avro-compiler-1.8.1.pom
(5 KB at 150.5 KB/sec)
2017-04-07T20:37:35.326 [INFO] Downloading: https://repo.maven.apache.org/maven2/org/slf4j/slf4j-api/1.7.7/slf4j-api-1.7.7.pom
2017-04-07T20:37:35.351 [INFO] Downloaded: https://repo.maven.apache.org/maven2/org/slf4j/slf4j-api/1.7.7/slf4j-api-1.7.7.pom
(3 KB at 105.0 KB/sec)
2017-04-07T20:37:35.353 [INFO] Downloading: https://repo.maven.apache.org/maven2/org/slf4j/slf4j-parent/1.7.7/slf4j-parent-1.7.7.pom
2017-04-07T20:37:35.379 [INFO] Downloaded: https://repo.maven.apache.org/maven2/org/slf4j/slf4j-parent/1.7.7/slf4j-parent-1.7.7.pom
(12 KB at 447.2 KB/sec)
2017-04-07T20:37:35.382 [INFO] Downloading: https://repo.maven.apache.org/maven2/joda-time/joda-time/2.7/joda-time-2.7.pom
2017-04-07T20:37:35.411 [INFO] Downloaded: https://repo.maven.apache.org/maven2/joda-time/joda-time/2.7/joda-time-2.7.pom
(28 KB at 962.9 KB/sec)
2017-04-07T20:37:35.414 [INFO] Downloading: https://repo.maven.apache.org/maven2/org/slf4j/slf4j-simple/1.7.7/slf4j-simple-1.7.7.pom
2017-04-07T20:37:35.441 [INFO] Downloaded: https://repo.maven.apache.org/maven2/org/slf4j/slf4j-simple/1.7.7/slf4j-simple-1.7.7.pom
(2 KB at 53.2 KB/sec)
2017-04-07T20:37:35.445 [INFO] Downloading: https://repo.maven.apache.org/maven2/org/apache/maven/maven-plugin-api/2.0.10/maven-plugin-api-2.0.10.jar
2017-04-07T20:37:35.446 [INFO] Downloading: https://repo.maven.apache.org/maven2/org/apache/maven/maven-model/2.0.10/maven-model-2.0.10.jar
2017-04-07T20:37:35.446 [INFO] Downloading: https://repo.maven.apache.org/maven2/org/apache/maven/maven-artifact-manager/2.0.10/maven-artifact-manager-2.0.10.jar
2017-04-07T20:37:35.447 [INFO] Downloading: https://repo.maven.apache.org/maven2/org/codehaus/plexus/plexus-utils/1.5.5/plexus-utils-1.5.5.jar
2017-04-07T20:37:35.447 [INFO] Downloading: https://repo.maven.apache.org/maven2/org/apache/maven/maven-repository-metadata/2.0.10/maven-repository-metadata-2.0.10.jar
2017-04-07T20:37:35.474 [INFO] Downloaded: https://repo.maven.apache.org/maven2/org/apache/maven/maven-plugin-api/2.0.10/maven-plugin-api-2.0.10.jar
(13 KB at 434.2 KB/sec)
2017-04-07T20:37:35.474 [INFO] Downloading: https://repo.maven.apache.org/maven2/org/apache/maven/maven-artifact/2.0.10/maven-artifact-2.0.10.jar
2017-04-07T20:37:35.475 [INFO] Downloaded: https://repo.maven.apache.org/maven2/org/apache/maven/maven-repository-metadata/2.0.10/maven-repository-metadata-2.0.10.jar
(26 KB at 876.2 KB/sec)
2017-04-07T20:37:35.476 [INFO] Downloading: https://repo.maven.apache.org/maven2/org/apache/avro/avro-compiler/1.8.1/avro-compiler-1.8.1.jar
2017-04-07T20:37:35.476 [INFO] Downloaded: https://repo.maven.apache.org/maven2/org/apache/maven/maven-artifact-manager/2.0.10/maven-artifact-manager-2.0.10.jar
(57 KB at 1831.2 KB/sec)
2017-04-07T20:37:35.477 [INFO] Downloading: https://repo.maven.apache.org/maven2/org/xerial/snappy/snappy-java/1.1.1.3/snappy-java-1.1.1.3.jar
2017-04-07T20:37:35.479 [INFO] Downloaded: https://repo.maven.apache.org/maven2/org/apache/maven/maven-model/2.0.10/maven-model-2.0.10.jar
(94 KB at 2762.8 KB/sec)
2017-04-07T20:37:35.479 [INFO] Downloading: https://repo.maven.apache.org/maven2/org/apache/commons/commons-compress/1.8.1/commons-compress-1.8.1.jar
2017-04-07T20:37:35.494 [INFO] Downloaded: https://repo.maven.apache.org/maven2/org/codehaus/plexus/plexus-utils/1.5.5/plexus-utils-1.5.5.jar
(246 KB at 5112.2 KB/sec)
2017-04-07T20:37:35.494 [INFO] Downloading: https://repo.maven.apache.org/maven2/joda-time/joda-time/2.7/joda-time-2.7.jar
2017-04-07T20:37:35.509 [INFO] Downloaded: https://repo.maven.apache.org/maven2/org/apache/avro/avro-compiler/1.8.1/avro-compiler-1.8.1.jar
(80 KB at 1285.1 KB/sec)
2017-04-07T20:37:35.510 [INFO] Downloading: https://repo.maven.apache.org/maven2/org/slf4j/slf4j-api/1.7.7/slf4j-api-1.7.7.jar
2017-04-07T20:37:35.512 [INFO] Downloaded: https://repo.maven.apache.org/maven2/org/apache/maven/maven-artifact/2.0.10/maven-artifact-2.0.10.jar
(88 KB at 1342.0 KB/sec)
2017-04-07T20:37:35.512 [INFO] Downloading: https://repo.maven.apache.org/maven2/org/slf4j/slf4j-simple/1.7.7/slf4j-simple-1.7.7.jar
2017-04-07T20:37:35.531 [INFO] Downloaded: https://repo.maven.apache.org/maven2/org/apache/commons/commons-compress/1.8.1/commons-compress-1.8.1.jar
(357 KB at 4249.8 KB/sec)
2017-04-07T20:37:35.539 [INFO] Downloaded: https://repo.maven.apache.org/maven2/org/slf4j/slf4j-api/1.7.7/slf4j-api-1.7.7.jar
(29 KB at 310.6 KB/sec)
2017-04-07T20:37:35.540 [INFO] Downloaded: https://repo.maven.apache.org/maven2/org/slf4j/slf4j-simple/1.7.7/slf4j-simple-1.7.7.jar
(11 KB at 112.2 KB/sec)
2017-04-07T20:37:35.546 [INFO] Downloaded: https://repo.maven.apache.org/maven2/org/xerial/snappy/snappy-java/1.1.1.3/snappy-java-1.1.1.3.jar
(576 KB at 5810.6 KB/sec)
2017-04-07T20:37:35.563 [INFO] Downloaded: https://repo.maven.apache.org/maven2/joda-time/joda-time/2.7/joda-time-2.7.jar
(576 KB at 4961.0 KB/sec)
2017-04-07T20:37:36.022 [INFO] 
2017-04-07T20:37:36.022 [INFO] --- maven-remote-resources-plugin:1.5:process (process-resource-bundles)
@ beam-sdks-java-core ---
2017-04-07T20:37:37.075 [INFO] 
2017-04-07T20:37:37.075 [INFO] --- maven-resources-plugin:2.7:resources (default-resources)
@ beam-sdks-java-core ---
2017-04-07T20:37:37.077 [INFO] Using 'UTF-8' encoding to copy filtered resources.
2017-04-07T20:37:37.077 [INFO] Copying 1 resource
2017-04-07T20:37:37.093 [INFO] Copying 3 resources
2017-04-07T20:37:37.144 [INFO] 
2017-04-07T20:37:37.144 [INFO] --- maven-compiler-plugin:3.6.1:compile (default-compile) @
beam-sdks-java-core ---
2017-04-07T20:37:37.201 [INFO] Changes detected - recompiling the module!
2017-04-07T20:37:37.202 [INFO] Compiling 434 source files to <https://builds.apache.org/job/beam_PostCommit_Java_ValidatesRunner_Flink/ws/sdks/java/core/target/classes>
2017-04-07T20:37:42.021 [WARNING] bootstrap class path not set in conjunction with -source
1.7
2017-04-07T20:37:42.021 [INFO] <https://builds.apache.org/job/beam_PostCommit_Java_ValidatesRunner_Flink/ws/sdks/java/core/src/main/java/org/apache/beam/sdk/io/FileBasedSink.java>:
Some input files use or override a deprecated API.
2017-04-07T20:37:42.021 [INFO] <https://builds.apache.org/job/beam_PostCommit_Java_ValidatesRunner_Flink/ws/sdks/java/core/src/main/java/org/apache/beam/sdk/io/FileBasedSink.java>:
Recompile with -Xlint:deprecation for details.
2017-04-07T20:37:42.021 [INFO] <https://builds.apache.org/job/beam_PostCommit_Java_ValidatesRunner_Flink/ws/sdks/java/core/src/main/java/org/apache/beam/sdk/options/ValueProvider.java>:
Some input files use unchecked or unsafe operations.
2017-04-07T20:37:42.021 [INFO] <https://builds.apache.org/job/beam_PostCommit_Java_ValidatesRunner_Flink/ws/sdks/java/core/src/main/java/org/apache/beam/sdk/options/ValueProvider.java>:
Recompile with -Xlint:unchecked for details.
2017-04-07T20:37:42.113 [INFO] 
2017-04-07T20:37:42.113 [INFO] --- build-helper-maven-plugin:3.0.0:add-test-source (add-test-source)
@ beam-sdks-java-core ---
2017-04-07T20:37:42.114 [INFO] Test Source directory: <https://builds.apache.org/job/beam_PostCommit_Java_ValidatesRunner_Flink/ws/sdks/java/core/target/generated-test-sources/java>
added.
2017-04-07T20:37:42.773 [INFO] 
2017-04-07T20:37:42.773 [INFO] --- maven-resources-plugin:2.7:testResources (default-testResources)
@ beam-sdks-java-core ---
2017-04-07T20:37:42.774 [INFO] Using 'UTF-8' encoding to copy filtered resources.
2017-04-07T20:37:42.774 [INFO] skip non existing resourceDirectory <https://builds.apache.org/job/beam_PostCommit_Java_ValidatesRunner_Flink/ws/sdks/java/core/src/test/resources>
2017-04-07T20:37:42.775 [INFO] Copying 3 resources
2017-04-07T20:37:42.868 [INFO] 
2017-04-07T20:37:42.868 [INFO] --- maven-compiler-plugin:3.6.1:testCompile (default-testCompile)
@ beam-sdks-java-core ---
2017-04-07T20:37:42.955 [INFO] Changes detected - recompiling the module!
2017-04-07T20:37:42.956 [INFO] Compiling 266 source files to <https://builds.apache.org/job/beam_PostCommit_Java_ValidatesRunner_Flink/ws/sdks/java/core/target/test-classes>
2017-04-07T20:37:47.432 [INFO] <https://builds.apache.org/job/beam_PostCommit_Java_ValidatesRunner_Flink/ws/sdks/java/core/src/test/java/org/apache/beam/sdk/util/DefaultBucketTest.java>:
Some input files use or override a deprecated API.
2017-04-07T20:37:47.432 [INFO] <https://builds.apache.org/job/beam_PostCommit_Java_ValidatesRunner_Flink/ws/sdks/java/core/src/test/java/org/apache/beam/sdk/util/DefaultBucketTest.java>:
Recompile with -Xlint:deprecation for details.
2017-04-07T20:37:47.432 [INFO] <https://builds.apache.org/job/beam_PostCommit_Java_ValidatesRunner_Flink/ws/sdks/java/core/src/test/java/org/apache/beam/sdk/transforms/CombineFnsTest.java>:
Some input files use unchecked or unsafe operations.
2017-04-07T20:37:47.432 [INFO] <https://builds.apache.org/job/beam_PostCommit_Java_ValidatesRunner_Flink/ws/sdks/java/core/src/test/java/org/apache/beam/sdk/transforms/CombineFnsTest.java>:
Recompile with -Xlint:unchecked for details.
2017-04-07T20:37:47.483 [INFO] 
2017-04-07T20:37:47.483 [INFO] --- maven-checkstyle-plugin:2.17:check (default) @ beam-sdks-java-core
---
2017-04-07T20:38:14.169 [INFO] Starting audit...
[ERROR] <https://builds.apache.org/job/beam_PostCommit_Java_ValidatesRunner_Flink/ws/sdks/java/core/src/main/java/org/apache/beam/sdk/testing/TestPipeline.java>:70:
Empty line should be followed by <p> tag on the next line. [JavadocParagraph]
[ERROR] <https://builds.apache.org/job/beam_PostCommit_Java_ValidatesRunner_Flink/ws/sdks/java/core/src/main/java/org/apache/beam/sdk/testing/TestPipeline.java>:72:
Empty line should be followed by <p> tag on the next line. [JavadocParagraph]
Audit done.
2017-04-07T20:38:14.169 [INFO] There are 2 errors reported by Checkstyle 6.19 with beam/checkstyle.xml
ruleset.
2017-04-07T20:38:14.176 [ERROR] src/main/java/org/apache/beam/sdk/testing/TestPipeline.java:[70]
(javadoc) JavadocParagraph: Empty line should be followed by <p> tag on the next line.
2017-04-07T20:38:14.176 [ERROR] src/main/java/org/apache/beam/sdk/testing/TestPipeline.java:[72]
(javadoc) JavadocParagraph: Empty line should be followed by <p> tag on the next line.
[JENKINS] Archiving disabled
[JENKINS] Archiving disabled
[JENKINS] Archiving disabled
[JENKINS] Archiving disabled
[JENKINS] Archiving disabled
[JENKINS] Archiving disabled
[JENKINS] Archiving disabled
[JENKINS] Archiving disabled
[JENKINS] Archiving disabled
[JENKINS] Archiving disabled
[JENKINS] Archiving disabled
[JENKINS] Archiving disabled
[JENKINS] Archiving disabled
[JENKINS] Archiving disabled
2017-04-07T20:38:17.968 [INFO] ------------------------------------------------------------------------
2017-04-07T20:38:17.968 [INFO] Reactor Summary:
2017-04-07T20:38:17.968 [INFO] 
2017-04-07T20:38:17.968 [INFO] Apache Beam :: Parent .............................. SUCCESS
[ 18.948 s]
2017-04-07T20:38:17.968 [INFO] Apache Beam :: SDKs :: Java :: Build Tools ......... SUCCESS
[ 10.263 s]
2017-04-07T20:38:17.968 [INFO] Apache Beam :: SDKs ................................ SUCCESS
[  2.788 s]
2017-04-07T20:38:17.968 [INFO] Apache Beam :: SDKs :: Common ...................... SUCCESS
[  0.957 s]
2017-04-07T20:38:17.968 [INFO] Apache Beam :: SDKs :: Common :: Fn API ............ SUCCESS
[ 11.232 s]
2017-04-07T20:38:17.968 [INFO] Apache Beam :: SDKs :: Common :: Runner API ........ SUCCESS
[  4.673 s]
2017-04-07T20:38:17.968 [INFO] Apache Beam :: SDKs :: Java ........................ SUCCESS
[  1.304 s]
2017-04-07T20:38:17.968 [INFO] Apache Beam :: SDKs :: Java :: Core ................ FAILURE
[ 48.248 s]
2017-04-07T20:38:17.968 [INFO] Apache Beam :: Runners ............................. SKIPPED
2017-04-07T20:38:17.968 [INFO] Apache Beam :: Runners :: Core Java Construction ... SKIPPED
2017-04-07T20:38:17.968 [INFO] Apache Beam :: Runners :: Core Java ................ SKIPPED
2017-04-07T20:38:17.968 [INFO] Apache Beam :: Runners :: Flink .................... SKIPPED
2017-04-07T20:38:17.968 [INFO] Apache Beam :: Runners :: Flink :: Core ............ SKIPPED
2017-04-07T20:38:17.968 [INFO] ------------------------------------------------------------------------
2017-04-07T20:38:17.969 [INFO] BUILD FAILURE
2017-04-07T20:38:17.969 [INFO] ------------------------------------------------------------------------
2017-04-07T20:38:17.969 [INFO] Total time: 02:10 min
2017-04-07T20:38:17.969 [INFO] Finished at: 2017-04-07T20:38:17+00:00
2017-04-07T20:38:18.334 [INFO] Final Memory: 100M/1406M
2017-04-07T20:38:18.335 [INFO] ------------------------------------------------------------------------
Waiting for Jenkins to finish collecting data
2017-04-07T20:38:37.261 [ERROR] Failed to execute goal org.apache.maven.plugins:maven-checkstyle-plugin:2.17:check
(default) on project beam-sdks-java-core: You have 2 Checkstyle violations. -> [Help 1]
org.apache.maven.lifecycle.LifecycleExecutionException: Failed to execute goal org.apache.maven.plugins:maven-checkstyle-plugin:2.17:check
(default) on project beam-sdks-java-core: You have 2 Checkstyle violations.
	at org.apache.maven.lifecycle.internal.MojoExecutor.execute(MojoExecutor.java:212)
	at org.apache.maven.lifecycle.internal.MojoExecutor.execute(MojoExecutor.java:153)
	at org.apache.maven.lifecycle.internal.MojoExecutor.execute(MojoExecutor.java:145)
	at org.apache.maven.lifecycle.internal.LifecycleModuleBuilder.buildProject(LifecycleModuleBuilder.java:116)
	at org.apache.maven.lifecycle.internal.LifecycleModuleBuilder.buildProject(LifecycleModuleBuilder.java:80)
	at org.apache.maven.lifecycle.internal.builder.singlethreaded.SingleThreadedBuilder.build(SingleThreadedBuilder.java:51)
	at org.apache.maven.lifecycle.internal.LifecycleStarter.execute(LifecycleStarter.java:128)
	at org.apache.maven.DefaultMaven.doExecute(DefaultMaven.java:307)
	at org.apache.maven.DefaultMaven.doExecute(DefaultMaven.java:193)
	at org.apache.maven.DefaultMaven.execute(DefaultMaven.java:106)
	at org.jvnet.hudson.maven3.launcher.Maven33Launcher.main(Maven33Launcher.java:129)
	at sun.reflect.NativeMethodAccessorImpl.invoke0(Native Method)
	at sun.reflect.NativeMethodAccessorImpl.invoke(NativeMethodAccessorImpl.java:62)
	at sun.reflect.DelegatingMethodAccessorImpl.invoke(DelegatingMethodAccessorImpl.java:43)
	at java.lang.reflect.Method.invoke(Method.java:498)
	at org.codehaus.plexus.classworlds.launcher.Launcher.launchStandard(Launcher.java:330)
	at org.codehaus.plexus.classworlds.launcher.Launcher.launch(Launcher.java:238)
	at jenkins.maven3.agent.Maven33Main.launch(Maven33Main.java:176)
	at sun.reflect.NativeMethodAccessorImpl.invoke0(Native Method)
	at sun.reflect.NativeMethodAccessorImpl.invoke(NativeMethodAccessorImpl.java:62)
	at sun.reflect.DelegatingMethodAccessorImpl.invoke(DelegatingMethodAccessorImpl.java:43)
	at java.lang.reflect.Method.invoke(Method.java:498)
	at hudson.maven.Maven3Builder.call(Maven3Builder.java:139)
	at hudson.maven.Maven3Builder.call(Maven3Builder.java:70)
	at hudson.remoting.UserRequest.perform(UserRequest.java:153)
	at hudson.remoting.UserRequest.perform(UserRequest.java:50)
	at hudson.remoting.Request$2.run(Request.java:336)
	at hudson.remoting.InterceptingExecutorService$1.call(InterceptingExecutorService.java:68)
	at java.util.concurrent.FutureTask.run(FutureTask.java:266)
	at java.util.concurrent.ThreadPoolExecutor.runWorker(ThreadPoolExecutor.java:1142)
	at java.util.concurrent.ThreadPoolExecutor$Worker.run(ThreadPoolExecutor.java:617)
	at java.lang.Thread.run(Thread.java:745)
Caused by: org.apache.maven.plugin.MojoFailureException: You have 2 Checkstyle violations.
	at org.apache.maven.plugin.checkstyle.CheckstyleViolationCheckMojo.execute(CheckstyleViolationCheckMojo.java:588)
	at org.apache.maven.plugin.DefaultBuildPluginManager.executeMojo(DefaultBuildPluginManager.java:134)
	at org.apache.maven.lifecycle.internal.MojoExecutor.execute(MojoExecutor.java:208)
	... 31 more
2017-04-07T20:38:37.262 [ERROR] 
2017-04-07T20:38:37.263 [ERROR] Re-run Maven using the -X switch to enable full debug logging.
2017-04-07T20:38:37.263 [ERROR] 
2017-04-07T20:38:37.263 [ERROR] For more information about the errors and possible solutions,
please read the following articles:
2017-04-07T20:38:37.263 [ERROR] [Help 1] http://cwiki.apache.org/confluence/display/MAVEN/MojoFailureException
2017-04-07T20:38:37.263 [ERROR] 
2017-04-07T20:38:37.263 [ERROR] After correcting the problems, you can resume the build with
the command
2017-04-07T20:38:37.263 [ERROR]   mvn <goals> -rf :beam-sdks-java-core
channel stopped

Mime
View raw message